A CI plan to test SCT against the latest JVM

Build: #50 failed Changes by Glenn Renfro

Logs

The following logs have been generated by the jobs in this plan.
  • Expand all
  • Collapse all
Job Logs
Collapse Build Spring Cloud Task Project Default Stage Download or View
20-May-2019 14:25:23 [INFO] Spring Cloud Task Multiple DataSources Application . SKIPPED
20-May-2019 14:25:23 [INFO] Spring Cloud Task Samples .......................... SKIPPED
20-May-2019 14:25:23 [INFO] Spring Cloud Task Integration Tests ................ SKIPPED
20-May-2019 14:25:23 [INFO] Spring Cloud Task Docs ............................. SKIPPED
20-May-2019 14:25:23 [INFO] ------------------------------------------------------------------------
20-May-2019 14:25:23 [INFO] BUILD FAILURE
20-May-2019 14:25:23 [INFO] ------------------------------------------------------------------------
20-May-2019 14:25:23 [INFO] Total time: 04:11 min
20-May-2019 14:25:23 [INFO] Finished at: 2019-05-20T14:25:23Z
20-May-2019 14:25:24 [INFO] Final Memory: 496M/1295M
20-May-2019 14:25:24 [INFO] ------------------------------------------------------------------------
20-May-2019 14:25:24 [ERROR] Failed to execute goal org.apache.maven.plugins:maven-surefire-plugin:2.22.2:test (default-test) on project batch-events: There are test failures.
20-May-2019 14:25:24 [ERROR]
20-May-2019 14:25:24 [ERROR] Please refer to /opt/bamboo-home/xml-data/build-dir/SCT-SLJ-JOB1/spring-cloud-task-samples/batch-events/target/surefire-reports for the individual test results.
20-May-2019 14:25:24 [ERROR] Please refer to dump files (if any exist) [date].dump, [date]-jvmRun[N].dump and [date].dumpstream.
20-May-2019 14:25:24 [ERROR] -> [Help 1]
20-May-2019 14:25:24 [ERROR]
20-May-2019 14:25:24 [ERROR] To see the full stack trace of the errors, re-run Maven with the -e switch.
20-May-2019 14:25:24 [ERROR] Re-run Maven using the -X switch to enable full debug logging.
20-May-2019 14:25:24 [ERROR]
20-May-2019 14:25:24 [ERROR] For more information about the errors and possible solutions, please read the following articles:
20-May-2019 14:25:24 [ERROR] [Help 1] http://cwiki.apache.org/confluence/display/MAVEN/MojoFailureException
20-May-2019 14:25:24 [ERROR]
20-May-2019 14:25:24 [ERROR] After correcting the problems, you can resume the build with the command
20-May-2019 14:25:24 [ERROR]   mvn <goals> -rf :batch-events