A CI plan to test SCT against the latest JVM

Build: #50 failed Changes by Glenn Renfro

Test results

  • 329 tests in total
  • 1 test failed
  • 1 failure is new
  • 1 minute taken in total.
New test failures 1
Status Test View job Duration
Collapse Failed BatchEventsApplicationTests testExecution History
Build Spring Cloud Task Project 2 secs
org.springframework.context.ApplicationContextException: Failed to start bean 'outputBindingLifecycle'; nested exception is org.springframework.beans.factory.BeanCreationException: Error creating bean with name 'rabbitMessageChannelBinder' defined in org.springframework.cloud.stream.binder.rabbit.config.RabbitMessageChannelBinderConfiguration: Bean instantiation via factory method failed; nested exception is org.springframework.beans.BeanInstantiationException: Failed to instantiate [org.springframework.cloud.stream.binder.rabbit.RabbitMessageChannelBinder]: Factory method 'rabbitMessageChannelBinder' threw exception; nested exception is java.lang.NoClassDefFoundError: org/springframework/amqp/rabbit/core/support/BatchingStrategy
	at io.spring.cloud.BatchEventsApplicationTests.testExecution(BatchEventsApplicationTests.java:49)
Caused by: org.springframework.beans.factory.BeanCreationException: Error creating bean with name 'rabbitMessageChannelBinder' defined in org.springframework.cloud.stream.binder.rabbit.config.RabbitMessageChannelBinderConfiguration: Bean instantiation via factory method failed; nested exception is org.springframework.beans.BeanInstantiationException: Failed to instantiate [org.springframework.cloud.stream.binder.rabbit.RabbitMessageChannelBinder]: Factory method 'rabbitMessageChannelBinder' threw exception; nested exception is java.lang.NoClassDefFoundError: org/springframework/amqp/rabbit/core/support/BatchingStrategy
	at io.spring.cloud.BatchEventsApplicationTests.testExecution(BatchEventsApplicationTests.java:49)
Caused by: org.springframework.beans.BeanInstantiationException: Failed to instantiate [org.springframework.cloud.stream.binder.rabbit.RabbitMessageChannelBinder]: Factory method 'rabbitMessageChannelBinder' threw exception; nested exception is java.lang.NoClassDefFoundError: org/springframework/amqp/rabbit/core/support/BatchingStrategy
	at io.spring.cloud.BatchEventsApplicationTests.testExecution(BatchEventsApplicationTests.java:49)
Caused by: java.lang.NoClassDefFoundError: org/springframework/amqp/rabbit/core/support/BatchingStrategy
	at io.spring.cloud.BatchEventsApplicationTests.testExecution(BatchEventsApplicationTests.java:49)
(2 more lines...)