A CI plan to test SCT against the latest JVM

Build: #57 failed Manual run by Glenn Renfro

Logs

The following logs have been generated by the jobs in this plan.
  • Expand all
  • Collapse all
Job Logs
Collapse Build Spring Cloud Task Project Default Stage Download or View
03-Jul-2019 19:08:36 [INFO] Batch Events Sample Application .................... SKIPPED
03-Jul-2019 19:08:36 [INFO] Spring Cloud Task JPA Sample Application ........... SKIPPED
03-Jul-2019 19:08:36 [INFO] Spring Cloud Task Multiple DataSources Application . SKIPPED
03-Jul-2019 19:08:36 [INFO] Spring Cloud Task Samples .......................... SKIPPED
03-Jul-2019 19:08:36 [INFO] Spring Cloud Task Integration Tests ................ SKIPPED
03-Jul-2019 19:08:36 [INFO] Spring Cloud Task Docs 2.2.0.BUILD-SNAPSHOT ........ SKIPPED
03-Jul-2019 19:08:36 [INFO] ------------------------------------------------------------------------
03-Jul-2019 19:08:36 [INFO] BUILD FAILURE
03-Jul-2019 19:08:36 [INFO] ------------------------------------------------------------------------
03-Jul-2019 19:08:36 [INFO] Total time: 35.522 s
03-Jul-2019 19:08:36 [INFO] Finished at: 2019-07-03T19:08:36Z
03-Jul-2019 19:08:36 [INFO] ------------------------------------------------------------------------
03-Jul-2019 19:08:36 [ERROR] Failed to execute goal org.apache.maven.plugins:maven-surefire-plugin:2.12.4:test (default-test) on project spring-cloud-task-core: There are test failures.
03-Jul-2019 19:08:36 [ERROR]
03-Jul-2019 19:08:36 [ERROR] Please refer to /opt/bamboo-home/xml-data/build-dir/SCT-SLJ-JOB1/spring-cloud-task-core/target/surefire-reports for the individual test results.
03-Jul-2019 19:08:36 [ERROR] -> [Help 1]
03-Jul-2019 19:08:36 [ERROR]
03-Jul-2019 19:08:36 [ERROR] To see the full stack trace of the errors, re-run Maven with the -e switch.
03-Jul-2019 19:08:36 [ERROR] Re-run Maven using the -X switch to enable full debug logging.
03-Jul-2019 19:08:36 [ERROR]
03-Jul-2019 19:08:36 [ERROR] For more information about the errors and possible solutions, please read the following articles:
03-Jul-2019 19:08:36 [ERROR] [Help 1] http://cwiki.apache.org/confluence/display/MAVEN/MojoFailureException
03-Jul-2019 19:08:36 [ERROR]
03-Jul-2019 19:08:36 [ERROR] After correcting the problems, you can resume the build with the command
03-Jul-2019 19:08:36 [ERROR]   mvn <goals> -rf :spring-cloud-task-core