A CI plan to test SCT against the latest JVM

Build: #50 failed

Job: Build Spring Cloud Task Project failed

Stages & jobs

  1. Default Stage

Job result summary

Completed
Duration
4 minutes
Revision
d7a47002704786699976e6f1ab6820722b0addf5 d7a47002704786699976e6f1ab6820722b0addf5
Total tests
329
Fixed in
#51 (Code changes detected)

Tests

  • 329 tests in total
  • 1 test failed
  • 1 failure is new
  • 1 minute taken in total.
New test failures 1
Status Test Duration
Collapse Failed BatchEventsApplicationTests testExecution History
2 secs
org.springframework.context.ApplicationContextException: Failed to start bean 'outputBindingLifecycle'; nested exception is org.springframework.beans.factory.BeanCreationException: Error creating bean with name 'rabbitMessageChannelBinder' defined in org.springframework.cloud.stream.binder.rabbit.config.RabbitMessageChannelBinderConfiguration: Bean instantiation via factory method failed; nested exception is org.springframework.beans.BeanInstantiationException: Failed to instantiate [org.springframework.cloud.stream.binder.rabbit.RabbitMessageChannelBinder]: Factory method 'rabbitMessageChannelBinder' threw exception; nested exception is java.lang.NoClassDefFoundError: org/springframework/amqp/rabbit/core/support/BatchingStrategy
	at io.spring.cloud.BatchEventsApplicationTests.testExecution(BatchEventsApplicationTests.java:49)
Caused by: org.springframework.beans.factory.BeanCreationException: Error creating bean with name 'rabbitMessageChannelBinder' defined in org.springframework.cloud.stream.binder.rabbit.config.RabbitMessageChannelBinderConfiguration: Bean instantiation via factory method failed; nested exception is org.springframework.beans.BeanInstantiationException: Failed to instantiate [org.springframework.cloud.stream.binder.rabbit.RabbitMessageChannelBinder]: Factory method 'rabbitMessageChannelBinder' threw exception; nested exception is java.lang.NoClassDefFoundError: org/springframework/amqp/rabbit/core/support/BatchingStrategy
	at io.spring.cloud.BatchEventsApplicationTests.testExecution(BatchEventsApplicationTests.java:49)
Caused by: org.springframework.beans.BeanInstantiationException: Failed to instantiate [org.springframework.cloud.stream.binder.rabbit.RabbitMessageChannelBinder]: Factory method 'rabbitMessageChannelBinder' threw exception; nested exception is java.lang.NoClassDefFoundError: org/springframework/amqp/rabbit/core/support/BatchingStrategy
	at io.spring.cloud.BatchEventsApplicationTests.testExecution(BatchEventsApplicationTests.java:49)
Caused by: java.lang.NoClassDefFoundError: org/springframework/amqp/rabbit/core/support/BatchingStrategy
	at io.spring.cloud.BatchEventsApplicationTests.testExecution(BatchEventsApplicationTests.java:49)
(2 more lines...)

Error summary

The build generated some errors. See the full build log for more details.

OpenJDK 64-Bit Server VM warning: Ignoring option MaxPermSize; support was removed in 8.0
WARNING: An illegal reflective access operation has occurred
WARNING: Illegal reflective access by org.bouncycastle.jcajce.provider.drbg.DRBG (file:/tmp/jruby-2790/jruby9099094407850783693bcprov-jdk15on-1.59.jar) to constructor sun.security.provider.Sun()
WARNING: Please consider reporting this to the maintainers of org.bouncycastle.jcajce.provider.drbg.DRBG
WARNING: Use --illegal-access=warn to enable warnings of further illegal reflective access operations
WARNING: All illegal access operations will be denied in a future release