A CI plan to test SCT against the latest JVM

Build: #55 failed

Job: Build Spring Cloud Task Project failed

Stages & jobs

  1. Default Stage

Build log

The build generated 1,139 lines of output.The output is too long and has been truncated to the last 1,000 lines. Download or view full build log

03-Jul-2019 18:29:08 [INFO] /opt/bamboo-home/xml-data/build-dir/SCT-SLJ-JOB1/spring-cloud-task-core/src/main/java/org/springframework/cloud/task/repository/dao/MapTaskExecutionDao.java: /opt/bamboo-home/xml-data/build-dir/SCT-SLJ-JOB1/spring-cloud-task-core/src/main/java/org/springframework/cloud/task/repository/dao/MapTaskExecutionDao.java uses unchecked or unsafe operations.
03-Jul-2019 18:29:08 [INFO] /opt/bamboo-home/xml-data/build-dir/SCT-SLJ-JOB1/spring-cloud-task-core/src/main/java/org/springframework/cloud/task/repository/dao/MapTaskExecutionDao.java: Recompile with -Xlint:unchecked for details.
03-Jul-2019 18:29:08 [INFO]
03-Jul-2019 18:29:08 [INFO] >>>>>>>>>>>>>>>>>>>>>>>>>>>>>>>>>>>>>>>>>>>>>>>>>>>>>>>>>>>>>>>>>>>>>>>>
03-Jul-2019 18:29:08 [INFO] Forking Spring Cloud Task Batch 2.2.0.BUILD-SNAPSHOT
03-Jul-2019 18:29:08 [INFO] >>>>>>>>>>>>>>>>>>>>>>>>>>>>>>>>>>>>>>>>>>>>>>>>>>>>>>>>>>>>>>>>>>>>>>>>
03-Jul-2019 18:29:08 [INFO]
03-Jul-2019 18:29:08 [INFO] --- maven-checkstyle-plugin:3.0.0:check (checkstyle-validation) @ spring-cloud-task-batch ---
03-Jul-2019 18:29:09 [INFO] Starting audit...
03-Jul-2019 18:29:09 Audit done.
03-Jul-2019 18:29:09 [INFO]
03-Jul-2019 18:29:09 [INFO] --- maven-checkstyle-plugin:3.0.0:check (no-http-checkstyle-validation) @ spring-cloud-task-batch ---
03-Jul-2019 18:29:09 [INFO]
03-Jul-2019 18:29:09 [INFO] --- spring-javaformat-maven-plugin:0.0.9:apply (default) @ spring-cloud-task-batch ---
03-Jul-2019 18:29:09 [INFO]
03-Jul-2019 18:29:09 [INFO] --- spring-javaformat-maven-plugin:0.0.9:validate (default) @ spring-cloud-task-batch ---
03-Jul-2019 18:29:09 [INFO]
03-Jul-2019 18:29:09 [INFO] --- jacoco-maven-plugin:0.8.2:prepare-agent (pre-unit-test) @ spring-cloud-task-batch ---
03-Jul-2019 18:29:09 [INFO] surefireArgLine set to -javaagent:/home/bamboo/.m2/repository/org/jacoco/org.jacoco.agent/0.8.2/org.jacoco.agent-0.8.2-runtime.jar=destfile=/opt/bamboo-home/xml-data/build-dir/SCT-SLJ-JOB1/spring-cloud-task-batch/target/coverage-reports/jacoco-ut.exec
03-Jul-2019 18:29:09 [INFO]
03-Jul-2019 18:29:09 [INFO] --- maven-resources-plugin:3.1.0:resources (default-resources) @ spring-cloud-task-batch ---
03-Jul-2019 18:29:09 [INFO] Using 'UTF-8' encoding to copy filtered resources.
03-Jul-2019 18:29:09 [INFO] Copying 0 resource
03-Jul-2019 18:29:09 [INFO] Copying 2 resources
03-Jul-2019 18:29:09 [INFO]
03-Jul-2019 18:29:09 [INFO] --- maven-compiler-plugin:3.5.1:compile (default-compile) @ spring-cloud-task-batch ---
03-Jul-2019 18:29:09 [INFO] Changes detected - recompiling the module!
03-Jul-2019 18:29:09 [INFO] Compiling 19 source files to /opt/bamboo-home/xml-data/build-dir/SCT-SLJ-JOB1/spring-cloud-task-batch/target/classes
03-Jul-2019 18:29:09 [INFO]
03-Jul-2019 18:29:09 [INFO] >>>>>>>>>>>>>>>>>>>>>>>>>>>>>>>>>>>>>>>>>>>>>>>>>>>>>>>>>>>>>>>>>>>>>>>>
03-Jul-2019 18:29:09 [INFO] Forking Spring Cloud Task Stream 2.2.0.BUILD-SNAPSHOT
03-Jul-2019 18:29:09 [INFO] >>>>>>>>>>>>>>>>>>>>>>>>>>>>>>>>>>>>>>>>>>>>>>>>>>>>>>>>>>>>>>>>>>>>>>>>
03-Jul-2019 18:29:10 [INFO]
03-Jul-2019 18:29:10 [INFO] --- maven-checkstyle-plugin:3.0.0:check (checkstyle-validation) @ spring-cloud-task-stream ---
03-Jul-2019 18:29:10 [INFO] Starting audit...
03-Jul-2019 18:29:10 Audit done.
03-Jul-2019 18:29:10 [INFO]
03-Jul-2019 18:29:10 [INFO] --- maven-checkstyle-plugin:3.0.0:check (no-http-checkstyle-validation) @ spring-cloud-task-stream ---
03-Jul-2019 18:29:10 [INFO]
03-Jul-2019 18:29:10 [INFO] --- spring-javaformat-maven-plugin:0.0.9:apply (default) @ spring-cloud-task-stream ---
03-Jul-2019 18:29:10 [INFO]
03-Jul-2019 18:29:10 [INFO] --- spring-javaformat-maven-plugin:0.0.9:validate (default) @ spring-cloud-task-stream ---
03-Jul-2019 18:29:10 [INFO]
03-Jul-2019 18:29:10 [INFO] --- jacoco-maven-plugin:0.8.2:prepare-agent (pre-unit-test) @ spring-cloud-task-stream ---
03-Jul-2019 18:29:10 [INFO] surefireArgLine set to -javaagent:/home/bamboo/.m2/repository/org/jacoco/org.jacoco.agent/0.8.2/org.jacoco.agent-0.8.2-runtime.jar=destfile=/opt/bamboo-home/xml-data/build-dir/SCT-SLJ-JOB1/spring-cloud-task-stream/target/coverage-reports/jacoco-ut.exec
03-Jul-2019 18:29:10 [INFO]
03-Jul-2019 18:29:10 [INFO] --- maven-resources-plugin:3.1.0:resources (default-resources) @ spring-cloud-task-stream ---
03-Jul-2019 18:29:10 [INFO] Using 'UTF-8' encoding to copy filtered resources.
03-Jul-2019 18:29:10 [INFO] Copying 1 resource
03-Jul-2019 18:29:10 [INFO] Copying 2 resources
03-Jul-2019 18:29:10 [INFO]
03-Jul-2019 18:29:10 [INFO] --- maven-compiler-plugin:3.5.1:compile (default-compile) @ spring-cloud-task-stream ---
03-Jul-2019 18:29:10 [INFO] Changes detected - recompiling the module!
03-Jul-2019 18:29:10 [INFO] Compiling 22 source files to /opt/bamboo-home/xml-data/build-dir/SCT-SLJ-JOB1/spring-cloud-task-stream/target/classes
03-Jul-2019 18:29:10 [INFO] /opt/bamboo-home/xml-data/build-dir/SCT-SLJ-JOB1/spring-cloud-task-stream/src/main/java/org/springframework/cloud/task/batch/listener/EventEmittingItemReadListener.java: Some input files use unchecked or unsafe operations.
03-Jul-2019 18:29:10 [INFO] /opt/bamboo-home/xml-data/build-dir/SCT-SLJ-JOB1/spring-cloud-task-stream/src/main/java/org/springframework/cloud/task/batch/listener/EventEmittingItemReadListener.java: Recompile with -Xlint:unchecked for details.
03-Jul-2019 18:29:10 [INFO]
03-Jul-2019 18:29:10 [INFO] >>>>>>>>>>>>>>>>>>>>>>>>>>>>>>>>>>>>>>>>>>>>>>>>>>>>>>>>>>>>>>>>>>>>>>>>
03-Jul-2019 18:29:10 [INFO] Forking Spring Cloud Task Starter 2.2.0.BUILD-SNAPSHOT
03-Jul-2019 18:29:10 [INFO] >>>>>>>>>>>>>>>>>>>>>>>>>>>>>>>>>>>>>>>>>>>>>>>>>>>>>>>>>>>>>>>>>>>>>>>>
03-Jul-2019 18:29:10 [INFO]
03-Jul-2019 18:29:10 [INFO] --- maven-checkstyle-plugin:3.0.0:check (checkstyle-validation) @ spring-cloud-starter-task ---
03-Jul-2019 18:29:11 [INFO] Starting audit...
03-Jul-2019 18:29:11 Audit done.
03-Jul-2019 18:29:11 [INFO]
03-Jul-2019 18:29:11 [INFO] --- maven-checkstyle-plugin:3.0.0:check (no-http-checkstyle-validation) @ spring-cloud-starter-task ---
03-Jul-2019 18:29:11 [INFO]
03-Jul-2019 18:29:11 [INFO] --- spring-javaformat-maven-plugin:0.0.9:apply (default) @ spring-cloud-starter-task ---
03-Jul-2019 18:29:11 [INFO]
03-Jul-2019 18:29:11 [INFO] --- spring-javaformat-maven-plugin:0.0.9:validate (default) @ spring-cloud-starter-task ---
03-Jul-2019 18:29:11 [INFO]
03-Jul-2019 18:29:11 [INFO] --- jacoco-maven-plugin:0.8.2:prepare-agent (pre-unit-test) @ spring-cloud-starter-task ---
03-Jul-2019 18:29:11 [INFO] surefireArgLine set to -javaagent:/home/bamboo/.m2/repository/org/jacoco/org.jacoco.agent/0.8.2/org.jacoco.agent-0.8.2-runtime.jar=destfile=/opt/bamboo-home/xml-data/build-dir/SCT-SLJ-JOB1/spring-cloud-starter-task/target/coverage-reports/jacoco-ut.exec
03-Jul-2019 18:29:11 [INFO]
03-Jul-2019 18:29:11 [INFO] --- maven-resources-plugin:3.1.0:resources (default-resources) @ spring-cloud-starter-task ---
03-Jul-2019 18:29:11 [INFO] Using 'UTF-8' encoding to copy filtered resources.
03-Jul-2019 18:29:11 [INFO] skip non existing resourceDirectory /opt/bamboo-home/xml-data/build-dir/SCT-SLJ-JOB1/spring-cloud-starter-task/src/main/resources
03-Jul-2019 18:29:11 [INFO] skip non existing resourceDirectory /opt/bamboo-home/xml-data/build-dir/SCT-SLJ-JOB1/spring-cloud-starter-task/src/main/resources
03-Jul-2019 18:29:11 [INFO]
03-Jul-2019 18:29:11 [INFO] --- maven-compiler-plugin:3.5.1:compile (default-compile) @ spring-cloud-starter-task ---
03-Jul-2019 18:29:11 [INFO] No sources to compile
03-Jul-2019 18:29:11 [INFO]
03-Jul-2019 18:29:11 [INFO] >>>>>>>>>>>>>>>>>>>>>>>>>>>>>>>>>>>>>>>>>>>>>>>>>>>>>>>>>>>>>>>>>>>>>>>>
03-Jul-2019 18:29:11 [INFO] Forking Timestamp Task 2.2.0.BUILD-SNAPSHOT
03-Jul-2019 18:29:11 [INFO] >>>>>>>>>>>>>>>>>>>>>>>>>>>>>>>>>>>>>>>>>>>>>>>>>>>>>>>>>>>>>>>>>>>>>>>>
03-Jul-2019 18:29:11 [INFO]
03-Jul-2019 18:29:11 [INFO] --- maven-resources-plugin:3.1.0:resources (default-resources) @ timestamp-task ---
03-Jul-2019 18:29:11 [INFO] Using 'UTF-8' encoding to copy filtered resources.
03-Jul-2019 18:29:11 [INFO] Copying 1 resource
03-Jul-2019 18:29:11 [INFO] Copying 0 resource
03-Jul-2019 18:29:11 [INFO]
03-Jul-2019 18:29:11 [INFO] --- maven-compiler-plugin:3.8.1:compile (default-compile) @ timestamp-task ---
03-Jul-2019 18:29:11 [INFO] Changes detected - recompiling the module!
03-Jul-2019 18:29:11 [INFO] Compiling 2 source files to /opt/bamboo-home/xml-data/build-dir/SCT-SLJ-JOB1/spring-cloud-task-samples/timestamp/target/classes
03-Jul-2019 18:29:11 [INFO]
03-Jul-2019 18:29:11 [INFO] >>>>>>>>>>>>>>>>>>>>>>>>>>>>>>>>>>>>>>>>>>>>>>>>>>>>>>>>>>>>>>>>>>>>>>>>
03-Jul-2019 18:29:11 [INFO] Forking Batch Job Sample Application 2.2.0.BUILD-SNAPSHOT
03-Jul-2019 18:29:11 [INFO] >>>>>>>>>>>>>>>>>>>>>>>>>>>>>>>>>>>>>>>>>>>>>>>>>>>>>>>>>>>>>>>>>>>>>>>>
03-Jul-2019 18:29:11 [INFO]
03-Jul-2019 18:29:11 [INFO] --- maven-resources-plugin:3.1.0:resources (default-resources) @ batch-job ---
03-Jul-2019 18:29:11 [INFO] Using 'UTF-8' encoding to copy filtered resources.
03-Jul-2019 18:29:11 [INFO] Copying 1 resource
03-Jul-2019 18:29:11 [INFO] Copying 0 resource
03-Jul-2019 18:29:11 [INFO]
03-Jul-2019 18:29:11 [INFO] --- maven-compiler-plugin:3.8.1:compile (default-compile) @ batch-job ---
03-Jul-2019 18:29:11 [INFO] Changes detected - recompiling the module!
03-Jul-2019 18:29:11 [INFO] Compiling 2 source files to /opt/bamboo-home/xml-data/build-dir/SCT-SLJ-JOB1/spring-cloud-task-samples/batch-job/target/classes
03-Jul-2019 18:29:11 [INFO]
03-Jul-2019 18:29:11 [INFO] >>>>>>>>>>>>>>>>>>>>>>>>>>>>>>>>>>>>>>>>>>>>>>>>>>>>>>>>>>>>>>>>>>>>>>>>
03-Jul-2019 18:29:11 [INFO] Forking Task Sink Sample Application 2.2.0.BUILD-SNAPSHOT
03-Jul-2019 18:29:11 [INFO] >>>>>>>>>>>>>>>>>>>>>>>>>>>>>>>>>>>>>>>>>>>>>>>>>>>>>>>>>>>>>>>>>>>>>>>>
03-Jul-2019 18:29:11 [INFO]
03-Jul-2019 18:29:11 [INFO] --- maven-resources-plugin:3.1.0:resources (default-resources) @ tasksink ---
03-Jul-2019 18:29:11 [INFO] Using 'UTF-8' encoding to copy filtered resources.
03-Jul-2019 18:29:11 [INFO] Copying 1 resource
03-Jul-2019 18:29:11 [INFO] Copying 0 resource
03-Jul-2019 18:29:11 [INFO]
03-Jul-2019 18:29:11 [INFO] --- maven-compiler-plugin:3.8.1:compile (default-compile) @ tasksink ---
03-Jul-2019 18:29:11 [INFO] Changes detected - recompiling the module!
03-Jul-2019 18:29:11 [INFO] Compiling 1 source file to /opt/bamboo-home/xml-data/build-dir/SCT-SLJ-JOB1/spring-cloud-task-samples/tasksink/target/classes
03-Jul-2019 18:29:11 [INFO]
03-Jul-2019 18:29:11 [INFO] >>>>>>>>>>>>>>>>>>>>>>>>>>>>>>>>>>>>>>>>>>>>>>>>>>>>>>>>>>>>>>>>>>>>>>>>
03-Jul-2019 18:29:11 [INFO] Forking Task Processor Sample Application 2.2.0.BUILD-SNAPSHOT
03-Jul-2019 18:29:11 [INFO] >>>>>>>>>>>>>>>>>>>>>>>>>>>>>>>>>>>>>>>>>>>>>>>>>>>>>>>>>>>>>>>>>>>>>>>>
03-Jul-2019 18:29:11 [INFO]
03-Jul-2019 18:29:11 [INFO] --- maven-resources-plugin:3.1.0:resources (default-resources) @ taskprocessor ---
03-Jul-2019 18:29:11 [INFO] Using 'UTF-8' encoding to copy filtered resources.
03-Jul-2019 18:29:11 [INFO] skip non existing resourceDirectory /opt/bamboo-home/xml-data/build-dir/SCT-SLJ-JOB1/spring-cloud-task-samples/taskprocessor/src/main/resources
03-Jul-2019 18:29:11 [INFO] skip non existing resourceDirectory /opt/bamboo-home/xml-data/build-dir/SCT-SLJ-JOB1/spring-cloud-task-samples/taskprocessor/src/main/resources
03-Jul-2019 18:29:11 [INFO]
03-Jul-2019 18:29:11 [INFO] --- maven-compiler-plugin:3.8.1:compile (default-compile) @ taskprocessor ---
03-Jul-2019 18:29:11 [INFO] Changes detected - recompiling the module!
03-Jul-2019 18:29:11 [INFO] Compiling 3 source files to /opt/bamboo-home/xml-data/build-dir/SCT-SLJ-JOB1/spring-cloud-task-samples/taskprocessor/target/classes
03-Jul-2019 18:29:11 [INFO]
03-Jul-2019 18:29:11 [INFO] >>>>>>>>>>>>>>>>>>>>>>>>>>>>>>>>>>>>>>>>>>>>>>>>>>>>>>>>>>>>>>>>>>>>>>>>
03-Jul-2019 18:29:11 [INFO] Forking Partitioned Batch Job 2.2.0.BUILD-SNAPSHOT
03-Jul-2019 18:29:11 [INFO] >>>>>>>>>>>>>>>>>>>>>>>>>>>>>>>>>>>>>>>>>>>>>>>>>>>>>>>>>>>>>>>>>>>>>>>>
03-Jul-2019 18:29:11 [INFO]
03-Jul-2019 18:29:11 [INFO] --- maven-resources-plugin:3.1.0:resources (default-resources) @ partitioned-batch-job ---
03-Jul-2019 18:29:11 [INFO] Using 'UTF-8' encoding to copy filtered resources.
03-Jul-2019 18:29:11 [INFO] Copying 1 resource
03-Jul-2019 18:29:11 [INFO] Copying 0 resource
03-Jul-2019 18:29:11 [INFO]
03-Jul-2019 18:29:11 [INFO] --- maven-compiler-plugin:3.8.1:compile (default-compile) @ partitioned-batch-job ---
03-Jul-2019 18:29:11 [INFO] Changes detected - recompiling the module!
03-Jul-2019 18:29:11 [INFO] Compiling 2 source files to /opt/bamboo-home/xml-data/build-dir/SCT-SLJ-JOB1/spring-cloud-task-samples/partitioned-batch-job/target/classes
03-Jul-2019 18:29:12 [INFO]
03-Jul-2019 18:29:12 [INFO] >>>>>>>>>>>>>>>>>>>>>>>>>>>>>>>>>>>>>>>>>>>>>>>>>>>>>>>>>>>>>>>>>>>>>>>>
03-Jul-2019 18:29:12 [INFO] Forking Task Events 2.2.0.BUILD-SNAPSHOT
03-Jul-2019 18:29:12 [INFO] >>>>>>>>>>>>>>>>>>>>>>>>>>>>>>>>>>>>>>>>>>>>>>>>>>>>>>>>>>>>>>>>>>>>>>>>
03-Jul-2019 18:29:12 [INFO]
03-Jul-2019 18:29:12 [INFO] --- maven-resources-plugin:3.1.0:resources (default-resources) @ task-events ---
03-Jul-2019 18:29:12 [INFO] Using 'UTF-8' encoding to copy filtered resources.
03-Jul-2019 18:29:12 [INFO] Copying 1 resource
03-Jul-2019 18:29:12 [INFO] Copying 0 resource
03-Jul-2019 18:29:12 [INFO]
03-Jul-2019 18:29:12 [INFO] --- maven-compiler-plugin:3.8.1:compile (default-compile) @ task-events ---
03-Jul-2019 18:29:12 [INFO] Changes detected - recompiling the module!
03-Jul-2019 18:29:12 [INFO] Compiling 1 source file to /opt/bamboo-home/xml-data/build-dir/SCT-SLJ-JOB1/spring-cloud-task-samples/task-events/target/classes
03-Jul-2019 18:29:12 [INFO]
03-Jul-2019 18:29:12 [INFO] >>>>>>>>>>>>>>>>>>>>>>>>>>>>>>>>>>>>>>>>>>>>>>>>>>>>>>>>>>>>>>>>>>>>>>>>
03-Jul-2019 18:29:12 [INFO] Forking Batch Events Sample Application 2.2.0.BUILD-SNAPSHOT
03-Jul-2019 18:29:12 [INFO] >>>>>>>>>>>>>>>>>>>>>>>>>>>>>>>>>>>>>>>>>>>>>>>>>>>>>>>>>>>>>>>>>>>>>>>>
03-Jul-2019 18:29:12 [INFO]
03-Jul-2019 18:29:12 [INFO] --- maven-resources-plugin:3.1.0:resources (default-resources) @ batch-events ---
03-Jul-2019 18:29:12 [INFO] Using 'UTF-8' encoding to copy filtered resources.
03-Jul-2019 18:29:12 [INFO] Copying 1 resource
03-Jul-2019 18:29:12 [INFO] Copying 0 resource
03-Jul-2019 18:29:12 [INFO]
03-Jul-2019 18:29:12 [INFO] --- maven-compiler-plugin:3.8.1:compile (default-compile) @ batch-events ---
03-Jul-2019 18:29:12 [INFO] Changes detected - recompiling the module!
03-Jul-2019 18:29:12 [INFO] Compiling 1 source file to /opt/bamboo-home/xml-data/build-dir/SCT-SLJ-JOB1/spring-cloud-task-samples/batch-events/target/classes
03-Jul-2019 18:29:12 [INFO]
03-Jul-2019 18:29:12 [INFO] >>>>>>>>>>>>>>>>>>>>>>>>>>>>>>>>>>>>>>>>>>>>>>>>>>>>>>>>>>>>>>>>>>>>>>>>
03-Jul-2019 18:29:12 [INFO] Forking Spring Cloud Task JPA Sample Application 2.2.0.BUILD-SNAPSHOT
03-Jul-2019 18:29:12 [INFO] >>>>>>>>>>>>>>>>>>>>>>>>>>>>>>>>>>>>>>>>>>>>>>>>>>>>>>>>>>>>>>>>>>>>>>>>
03-Jul-2019 18:29:12 [INFO]
03-Jul-2019 18:29:12 [INFO] --- maven-resources-plugin:3.1.0:resources (default-resources) @ jpa-sample ---
03-Jul-2019 18:29:12 [INFO] Using 'UTF-8' encoding to copy filtered resources.
03-Jul-2019 18:29:12 [INFO] Copying 2 resources
03-Jul-2019 18:29:12 [INFO] Copying 0 resource
03-Jul-2019 18:29:12 [INFO]
03-Jul-2019 18:29:12 [INFO] --- maven-compiler-plugin:3.8.1:compile (default-compile) @ jpa-sample ---
03-Jul-2019 18:29:12 [INFO] Changes detected - recompiling the module!
03-Jul-2019 18:29:12 [INFO] Compiling 4 source files to /opt/bamboo-home/xml-data/build-dir/SCT-SLJ-JOB1/spring-cloud-task-samples/jpa-sample/target/classes
03-Jul-2019 18:29:12 [INFO]
03-Jul-2019 18:29:12 [INFO] >>>>>>>>>>>>>>>>>>>>>>>>>>>>>>>>>>>>>>>>>>>>>>>>>>>>>>>>>>>>>>>>>>>>>>>>
03-Jul-2019 18:29:12 [INFO] Forking Spring Cloud Task Multiple DataSources Application 2.2.0.BUILD-SNAPSHOT
03-Jul-2019 18:29:12 [INFO] >>>>>>>>>>>>>>>>>>>>>>>>>>>>>>>>>>>>>>>>>>>>>>>>>>>>>>>>>>>>>>>>>>>>>>>>
03-Jul-2019 18:29:12 [INFO]
03-Jul-2019 18:29:12 [INFO] --- maven-resources-plugin:3.1.0:resources (default-resources) @ multiple-datasources ---
03-Jul-2019 18:29:12 [INFO] Using 'UTF-8' encoding to copy filtered resources.
03-Jul-2019 18:29:12 [INFO] Copying 1 resource
03-Jul-2019 18:29:12 [INFO] Copying 0 resource
03-Jul-2019 18:29:12 [INFO]
03-Jul-2019 18:29:12 [INFO] --- maven-compiler-plugin:3.8.1:compile (default-compile) @ multiple-datasources ---
03-Jul-2019 18:29:12 [INFO] Changes detected - recompiling the module!
03-Jul-2019 18:29:12 [INFO] Compiling 4 source files to /opt/bamboo-home/xml-data/build-dir/SCT-SLJ-JOB1/spring-cloud-task-samples/multiple-datasources/target/classes
03-Jul-2019 18:29:12 [INFO]
03-Jul-2019 18:29:12 [INFO] >>>>>>>>>>>>>>>>>>>>>>>>>>>>>>>>>>>>>>>>>>>>>>>>>>>>>>>>>>>>>>>>>>>>>>>>
03-Jul-2019 18:29:12 [INFO] Forking Spring Cloud Task Samples 2.2.0.BUILD-SNAPSHOT
03-Jul-2019 18:29:12 [INFO] >>>>>>>>>>>>>>>>>>>>>>>>>>>>>>>>>>>>>>>>>>>>>>>>>>>>>>>>>>>>>>>>>>>>>>>>
03-Jul-2019 18:29:12 [INFO]
03-Jul-2019 18:29:12 [INFO] --- maven-checkstyle-plugin:3.0.0:check (checkstyle-validation) @ spring-cloud-task-samples ---
03-Jul-2019 18:29:12 [INFO] Starting audit...
03-Jul-2019 18:29:12 Audit done.
03-Jul-2019 18:29:12 [INFO]
03-Jul-2019 18:29:12 [INFO] --- maven-checkstyle-plugin:3.0.0:check (no-http-checkstyle-validation) @ spring-cloud-task-samples ---
03-Jul-2019 18:29:12 [INFO]
03-Jul-2019 18:29:12 [INFO] --- spring-javaformat-maven-plugin:0.0.9:apply (default) @ spring-cloud-task-samples ---
03-Jul-2019 18:29:12 [INFO]
03-Jul-2019 18:29:12 [INFO] --- spring-javaformat-maven-plugin:0.0.9:validate (default) @ spring-cloud-task-samples ---
03-Jul-2019 18:29:12 [INFO]
03-Jul-2019 18:29:12 [INFO] --- jacoco-maven-plugin:0.8.2:prepare-agent (pre-unit-test) @ spring-cloud-task-samples ---
03-Jul-2019 18:29:12 [INFO] surefireArgLine set to -javaagent:/home/bamboo/.m2/repository/org/jacoco/org.jacoco.agent/0.8.2/org.jacoco.agent-0.8.2-runtime.jar=destfile=/opt/bamboo-home/xml-data/build-dir/SCT-SLJ-JOB1/spring-cloud-task-samples/target/coverage-reports/jacoco-ut.exec
03-Jul-2019 18:29:12 [INFO]
03-Jul-2019 18:29:12 [INFO] >>>>>>>>>>>>>>>>>>>>>>>>>>>>>>>>>>>>>>>>>>>>>>>>>>>>>>>>>>>>>>>>>>>>>>>>
03-Jul-2019 18:29:12 [INFO] Forking Spring Cloud Task Integration Tests 2.2.0.BUILD-SNAPSHOT
03-Jul-2019 18:29:12 [INFO] >>>>>>>>>>>>>>>>>>>>>>>>>>>>>>>>>>>>>>>>>>>>>>>>>>>>>>>>>>>>>>>>>>>>>>>>
03-Jul-2019 18:29:12 [INFO]
03-Jul-2019 18:29:12 [INFO] --- maven-checkstyle-plugin:3.0.0:check (checkstyle-validation) @ spring-cloud-task-integration-tests ---
03-Jul-2019 18:29:12 [INFO] Starting audit...
03-Jul-2019 18:29:12 Audit done.
03-Jul-2019 18:29:12 [INFO]
03-Jul-2019 18:29:12 [INFO] --- maven-checkstyle-plugin:3.0.0:check (no-http-checkstyle-validation) @ spring-cloud-task-integration-tests ---
03-Jul-2019 18:29:12 [INFO]
03-Jul-2019 18:29:12 [INFO] --- spring-javaformat-maven-plugin:0.0.9:apply (default) @ spring-cloud-task-integration-tests ---
03-Jul-2019 18:29:12 [INFO]
03-Jul-2019 18:29:12 [INFO] --- spring-javaformat-maven-plugin:0.0.9:validate (default) @ spring-cloud-task-integration-tests ---
03-Jul-2019 18:29:12 [INFO]
03-Jul-2019 18:29:12 [INFO] --- jacoco-maven-plugin:0.8.2:prepare-agent (pre-unit-test) @ spring-cloud-task-integration-tests ---
03-Jul-2019 18:29:12 [INFO] surefireArgLine set to -javaagent:/home/bamboo/.m2/repository/org/jacoco/org.jacoco.agent/0.8.2/org.jacoco.agent-0.8.2-runtime.jar=destfile=/opt/bamboo-home/xml-data/build-dir/SCT-SLJ-JOB1/spring-cloud-task-integration-tests/target/coverage-reports/jacoco-ut.exec
03-Jul-2019 18:29:12 [INFO]
03-Jul-2019 18:29:12 [INFO] --- maven-resources-plugin:3.1.0:resources (default-resources) @ spring-cloud-task-integration-tests ---
03-Jul-2019 18:29:12 [INFO] Using 'UTF-8' encoding to copy filtered resources.
03-Jul-2019 18:29:12 [INFO] skip non existing resourceDirectory /opt/bamboo-home/xml-data/build-dir/SCT-SLJ-JOB1/spring-cloud-task-integration-tests/src/main/resources
03-Jul-2019 18:29:12 [INFO] skip non existing resourceDirectory /opt/bamboo-home/xml-data/build-dir/SCT-SLJ-JOB1/spring-cloud-task-integration-tests/src/main/resources
03-Jul-2019 18:29:12 [INFO]
03-Jul-2019 18:29:12 [INFO] --- maven-compiler-plugin:3.5.1:compile (default-compile) @ spring-cloud-task-integration-tests ---
03-Jul-2019 18:29:12 [INFO] No sources to compile
03-Jul-2019 18:29:12 [INFO]
03-Jul-2019 18:29:12 [INFO] >>>>>>>>>>>>>>>>>>>>>>>>>>>>>>>>>>>>>>>>>>>>>>>>>>>>>>>>>>>>>>>>>>>>>>>>
03-Jul-2019 18:29:12 [INFO] Forking Spring Cloud Task Docs 2.2.0.BUILD-SNAPSHOT
03-Jul-2019 18:29:12 [INFO] >>>>>>>>>>>>>>>>>>>>>>>>>>>>>>>>>>>>>>>>>>>>>>>>>>>>>>>>>>>>>>>>>>>>>>>>
03-Jul-2019 18:29:12 [INFO]
03-Jul-2019 18:29:12 [INFO] --- maven-checkstyle-plugin:3.0.0:check (checkstyle-validation) @ spring-cloud-task-docs ---
03-Jul-2019 18:29:12 [INFO] Starting audit...
03-Jul-2019 18:29:12 Audit done.
03-Jul-2019 18:29:12 [INFO]
03-Jul-2019 18:29:12 [INFO] --- maven-checkstyle-plugin:3.0.0:check (no-http-checkstyle-validation) @ spring-cloud-task-docs ---
03-Jul-2019 18:29:12 [INFO]
03-Jul-2019 18:29:12 [INFO] --- spring-javaformat-maven-plugin:0.0.9:apply (default) @ spring-cloud-task-docs ---
03-Jul-2019 18:29:12 [INFO]
03-Jul-2019 18:29:12 [INFO] --- spring-javaformat-maven-plugin:0.0.9:validate (default) @ spring-cloud-task-docs ---
03-Jul-2019 18:29:12 [INFO]
03-Jul-2019 18:29:12 [INFO] --- maven-antrun-plugin:1.8:run (setup-maven-properties) @ spring-cloud-task-docs ---
03-Jul-2019 18:29:13 [INFO] Executing tasks
03-Jul-2019 18:29:13
03-Jul-2019 18:29:13 main:
03-Jul-2019 18:29:13 [INFO] Executed tasks
03-Jul-2019 18:29:13 [INFO]
03-Jul-2019 18:29:13 [INFO] --- jacoco-maven-plugin:0.8.2:prepare-agent (pre-unit-test) @ spring-cloud-task-docs ---
03-Jul-2019 18:29:13 [INFO] surefireArgLine set to -javaagent:/home/bamboo/.m2/repository/org/jacoco/org.jacoco.agent/0.8.2/org.jacoco.agent-0.8.2-runtime.jar=destfile=/opt/bamboo-home/xml-data/build-dir/SCT-SLJ-JOB1/spring-cloud-task-docs/target/coverage-reports/jacoco-ut.exec
03-Jul-2019 18:29:13 [INFO]
03-Jul-2019 18:29:13 [INFO] --- maven-dependency-plugin:2.8:unpack-dependencies (unpack-doc-resources) @ spring-cloud-task-docs ---
03-Jul-2019 18:29:13 [INFO] Unpacking /home/bamboo/.m2/repository/io/spring/docresources/spring-doc-resources/0.1.1.RELEASE/spring-doc-resources-0.1.1.RELEASE.zip to /opt/bamboo-home/xml-data/build-dir/SCT-SLJ-JOB1/spring-cloud-task-docs/target/refdocs with includes "" and excludes ""
03-Jul-2019 18:29:13 [INFO]
03-Jul-2019 18:29:13 [INFO] --- maven-resources-plugin:3.1.0:copy-resources (copy-asciidoc-resources) @ spring-cloud-task-docs ---
03-Jul-2019 18:29:13 [INFO] Using 'UTF-8' encoding to copy filtered resources.
03-Jul-2019 18:29:13 [INFO] Copying 13 resources
03-Jul-2019 18:29:13 [INFO]
03-Jul-2019 18:29:13 [INFO] --- asciidoctor-maven-plugin:1.6.0:process-asciidoc (generate-html) @ spring-cloud-task-docs ---
03-Jul-2019 18:29:15 [INFO] Using 'UTF-8' encoding to copy filtered resources.
03-Jul-2019 18:29:15 [INFO] Copying 19 resources
03-Jul-2019 18:29:16 [INFO] asciidoctor: WARN: features.adoc: line 6: id assigned to block already in use: partintro
03-Jul-2019 18:29:16 [INFO] asciidoctor: WARN: batch.adoc: line 6: id assigned to block already in use: partintro
03-Jul-2019 18:29:16 [INFO] asciidoctor: WARN: stream.adoc: line 5: id assigned to block already in use: partintro
03-Jul-2019 18:29:16 [INFO] asciidoctor: WARN: appendix-task-repository-schema.adoc: line 5: id assigned to block already in use: partintro
03-Jul-2019 18:29:17 [INFO] Rendered /opt/bamboo-home/xml-data/build-dir/SCT-SLJ-JOB1/spring-cloud-task-docs/target/refdocs/index.adoc
03-Jul-2019 18:29:17 [INFO]
03-Jul-2019 18:29:17 [INFO] --- asciidoctor-maven-plugin:1.6.0:process-asciidoc (generate-pdf) @ spring-cloud-task-docs ---
03-Jul-2019 18:29:17 [INFO] Using 'UTF-8' encoding to copy filtered resources.
03-Jul-2019 18:29:17 [INFO] Copying 19 resources
03-Jul-2019 18:29:19 WARNING: An illegal reflective access operation has occurred
03-Jul-2019 18:29:19 WARNING: Illegal reflective access by org.bouncycastle.jcajce.provider.drbg.DRBG (file:/home/bamboo/.m2/repository/org/bouncycastle/bcprov-jdk15on/1.59/bcprov-jdk15on-1.59.jar) to constructor sun.security.provider.Sun()
03-Jul-2019 18:29:19 WARNING: Please consider reporting this to the maintainers of org.bouncycastle.jcajce.provider.drbg.DRBG
03-Jul-2019 18:29:19 WARNING: Use --illegal-access=warn to enable warnings of further illegal reflective access operations
03-Jul-2019 18:29:19 WARNING: All illegal access operations will be denied in a future release
03-Jul-2019 18:29:21 [INFO] asciidoctor: WARN: features.adoc: line 6: id assigned to block already in use: partintro
03-Jul-2019 18:29:21 [INFO] asciidoctor: WARN: batch.adoc: line 6: id assigned to block already in use: partintro
03-Jul-2019 18:29:21 [INFO] asciidoctor: WARN: stream.adoc: line 5: id assigned to block already in use: partintro
03-Jul-2019 18:29:21 [INFO] asciidoctor: WARN: appendix-task-repository-schema.adoc: line 5: id assigned to block already in use: partintro
03-Jul-2019 18:29:29 [INFO] Rendered /opt/bamboo-home/xml-data/build-dir/SCT-SLJ-JOB1/spring-cloud-task-docs/target/refdocs/index.adoc
03-Jul-2019 18:29:29 [INFO]
03-Jul-2019 18:29:29 [INFO] --- maven-resources-plugin:3.1.0:resources (default-resources) @ spring-cloud-task-docs ---
03-Jul-2019 18:29:29 [INFO] Using 'UTF-8' encoding to copy filtered resources.
03-Jul-2019 18:29:29 [INFO] skip non existing resourceDirectory /opt/bamboo-home/xml-data/build-dir/SCT-SLJ-JOB1/spring-cloud-task-docs/src/main/resources
03-Jul-2019 18:29:29 [INFO] skip non existing resourceDirectory /opt/bamboo-home/xml-data/build-dir/SCT-SLJ-JOB1/spring-cloud-task-docs/src/main/resources
03-Jul-2019 18:29:29 [INFO]
03-Jul-2019 18:29:29 [INFO] --- maven-compiler-plugin:3.5.1:compile (default-compile) @ spring-cloud-task-docs ---
03-Jul-2019 18:29:29 [INFO] No sources to compile
03-Jul-2019 18:29:29 [INFO]
03-Jul-2019 18:29:29 [INFO] <<< maven-javadoc-plugin:3.0.1:aggregate (aggregate) < compile @ spring-cloud-task-parent <<<
03-Jul-2019 18:29:29 [INFO]
03-Jul-2019 18:29:30 [INFO]
03-Jul-2019 18:29:30 [INFO] --- maven-javadoc-plugin:3.0.1:aggregate (aggregate) @ spring-cloud-task-parent ---
03-Jul-2019 18:29:30 [ERROR] no module descriptor for org.springframework.cloud:spring-cloud-task-parent
03-Jul-2019 18:29:30 [ERROR] no module descriptor for org.springframework.cloud:spring-cloud-task-dependencies
03-Jul-2019 18:29:30 [ERROR] no module descriptor for org.springframework.cloud:spring-cloud-task-core
03-Jul-2019 18:29:30 [ERROR] no module descriptor for org.springframework.cloud:spring-cloud-task-batch
03-Jul-2019 18:29:30 [ERROR] no module descriptor for org.springframework.cloud:spring-cloud-task-stream
03-Jul-2019 18:29:30 [ERROR] no module descriptor for org.springframework.cloud:spring-cloud-starter-task
03-Jul-2019 18:29:30 [ERROR] no module descriptor for io.spring.cloud:timestamp-task
03-Jul-2019 18:29:30 [ERROR] no module descriptor for io.spring.cloud:batch-job
03-Jul-2019 18:29:30 [ERROR] no module descriptor for io.spring.cloud:tasksink
03-Jul-2019 18:29:30 [ERROR] no module descriptor for io.spring.cloud:taskprocessor
03-Jul-2019 18:29:30 [ERROR] no module descriptor for io.spring.cloud:partitioned-batch-job
03-Jul-2019 18:29:30 [ERROR] no module descriptor for io.spring.cloud:task-events
03-Jul-2019 18:29:30 [ERROR] no module descriptor for io.spring.cloud:batch-events
03-Jul-2019 18:29:30 [ERROR] no module descriptor for io.spring.cloud:jpa-sample
03-Jul-2019 18:29:30 [ERROR] no module descriptor for io.spring.cloud:multiple-datasources
03-Jul-2019 18:29:30 [ERROR] no module descriptor for org.springframework.cloud:spring-cloud-task-samples
03-Jul-2019 18:29:30 [ERROR] no module descriptor for org.springframework.cloud:spring-cloud-task-integration-tests
03-Jul-2019 18:29:30 [ERROR] no module descriptor for org.springframework.cloud:spring-cloud-task-docs
03-Jul-2019 18:29:33 [INFO]
03-Jul-2019 18:29:33 [INFO] --- maven-javadoc-plugin:3.0.1:jar (attach-javadocs) @ spring-cloud-task-parent ---
03-Jul-2019 18:29:33 [INFO] Not executing Javadoc as the project is not a Java classpath-capable package
03-Jul-2019 18:29:33 [INFO]
03-Jul-2019 18:29:33 [INFO] --- maven-javadoc-plugin:3.0.1:jar (javadoc) @ spring-cloud-task-parent ---
03-Jul-2019 18:29:33 [INFO] Not executing Javadoc as the project is not a Java classpath-capable package
03-Jul-2019 18:29:33 [INFO]
03-Jul-2019 18:29:33 [INFO] >>> maven-source-plugin:3.0.1:jar (attach-sources) > generate-sources @ spring-cloud-task-parent >>>
03-Jul-2019 18:29:33 [INFO]
03-Jul-2019 18:29:33 [INFO] --- maven-checkstyle-plugin:3.0.0:check (checkstyle-validation) @ spring-cloud-task-parent ---
03-Jul-2019 18:29:33 [INFO] Starting audit...
03-Jul-2019 18:29:33 Audit done.
03-Jul-2019 18:29:33 [INFO]
03-Jul-2019 18:29:33 [INFO] --- maven-checkstyle-plugin:3.0.0:check (no-http-checkstyle-validation) @ spring-cloud-task-parent ---
03-Jul-2019 18:29:33 [INFO]
03-Jul-2019 18:29:33 [INFO] --- spring-javaformat-maven-plugin:0.0.9:apply (default) @ spring-cloud-task-parent ---
03-Jul-2019 18:29:33 [INFO]
03-Jul-2019 18:29:33 [INFO] --- spring-javaformat-maven-plugin:0.0.9:validate (default) @ spring-cloud-task-parent ---
03-Jul-2019 18:29:33 [INFO]
03-Jul-2019 18:29:33 [INFO] --- jacoco-maven-plugin:0.8.2:prepare-agent (pre-unit-test) @ spring-cloud-task-parent ---
03-Jul-2019 18:29:33 [INFO] surefireArgLine set to -javaagent:/home/bamboo/.m2/repository/org/jacoco/org.jacoco.agent/0.8.2/org.jacoco.agent-0.8.2-runtime.jar=destfile=/opt/bamboo-home/xml-data/build-dir/SCT-SLJ-JOB1/target/coverage-reports/jacoco-ut.exec
03-Jul-2019 18:29:33 [INFO]
03-Jul-2019 18:29:33 [INFO] <<< maven-source-plugin:3.0.1:jar (attach-sources) < generate-sources @ spring-cloud-task-parent <<<
03-Jul-2019 18:29:33 [INFO]
03-Jul-2019 18:29:33 [INFO]
03-Jul-2019 18:29:33 [INFO] --- maven-source-plugin:3.0.1:jar (attach-sources) @ spring-cloud-task-parent ---
03-Jul-2019 18:29:33 [INFO]
03-Jul-2019 18:29:33 [INFO] ----------< org.springframework.cloud:spring-cloud-task-core >----------
03-Jul-2019 18:29:33 [INFO] Building Spring Cloud Task Core 2.2.0.BUILD-SNAPSHOT              [3/18]
03-Jul-2019 18:29:33 [INFO] --------------------------------[ jar ]---------------------------------
03-Jul-2019 18:29:33 [INFO]
03-Jul-2019 18:29:33 [INFO] --- maven-clean-plugin:2.5:clean (default-clean) @ spring-cloud-task-core ---
03-Jul-2019 18:29:33 [INFO] Deleting /opt/bamboo-home/xml-data/build-dir/SCT-SLJ-JOB1/spring-cloud-task-core/target
03-Jul-2019 18:29:33 [INFO]
03-Jul-2019 18:29:33 [INFO] --- maven-checkstyle-plugin:3.0.0:check (checkstyle-validation) @ spring-cloud-task-core ---
03-Jul-2019 18:29:34 [INFO] Starting audit...
03-Jul-2019 18:29:34 Audit done.
03-Jul-2019 18:29:34 [INFO]
03-Jul-2019 18:29:34 [INFO] --- maven-checkstyle-plugin:3.0.0:check (no-http-checkstyle-validation) @ spring-cloud-task-core ---
03-Jul-2019 18:29:34 [INFO]
03-Jul-2019 18:29:34 [INFO] --- spring-javaformat-maven-plugin:0.0.9:apply (default) @ spring-cloud-task-core ---
03-Jul-2019 18:29:34 [INFO]
03-Jul-2019 18:29:34 [INFO] --- spring-javaformat-maven-plugin:0.0.9:validate (default) @ spring-cloud-task-core ---
03-Jul-2019 18:29:34 [INFO]
03-Jul-2019 18:29:34 [INFO] --- jacoco-maven-plugin:0.8.2:prepare-agent (pre-unit-test) @ spring-cloud-task-core ---
03-Jul-2019 18:29:34 [INFO] surefireArgLine set to -javaagent:/home/bamboo/.m2/repository/org/jacoco/org.jacoco.agent/0.8.2/org.jacoco.agent-0.8.2-runtime.jar=destfile=/opt/bamboo-home/xml-data/build-dir/SCT-SLJ-JOB1/spring-cloud-task-core/target/coverage-reports/jacoco-ut.exec
03-Jul-2019 18:29:34 [INFO]
03-Jul-2019 18:29:34 [INFO] --- maven-resources-plugin:3.1.0:resources (default-resources) @ spring-cloud-task-core ---
03-Jul-2019 18:29:34 [INFO] Using 'UTF-8' encoding to copy filtered resources.
03-Jul-2019 18:29:34 [INFO] Copying 0 resource
03-Jul-2019 18:29:34 [INFO] Copying 22 resources
03-Jul-2019 18:29:34 [INFO]
03-Jul-2019 18:29:34 [INFO] --- maven-compiler-plugin:3.5.1:compile (default-compile) @ spring-cloud-task-core ---
03-Jul-2019 18:29:34 [INFO] Changes detected - recompiling the module!
03-Jul-2019 18:29:34 [INFO] Compiling 48 source files to /opt/bamboo-home/xml-data/build-dir/SCT-SLJ-JOB1/spring-cloud-task-core/target/classes
03-Jul-2019 18:29:35 [INFO] /opt/bamboo-home/xml-data/build-dir/SCT-SLJ-JOB1/spring-cloud-task-core/src/main/java/org/springframework/cloud/task/repository/dao/MapTaskExecutionDao.java: /opt/bamboo-home/xml-data/build-dir/SCT-SLJ-JOB1/spring-cloud-task-core/src/main/java/org/springframework/cloud/task/repository/dao/MapTaskExecutionDao.java uses unchecked or unsafe operations.
03-Jul-2019 18:29:35 [INFO] /opt/bamboo-home/xml-data/build-dir/SCT-SLJ-JOB1/spring-cloud-task-core/src/main/java/org/springframework/cloud/task/repository/dao/MapTaskExecutionDao.java: Recompile with -Xlint:unchecked for details.
03-Jul-2019 18:29:35 [INFO]
03-Jul-2019 18:29:35 [INFO] --- maven-resources-plugin:3.1.0:testResources (default-testResources) @ spring-cloud-task-core ---
03-Jul-2019 18:29:35 [INFO] Using 'UTF-8' encoding to copy filtered resources.
03-Jul-2019 18:29:35 [INFO] Copying 2 resources
03-Jul-2019 18:29:35 [INFO]
03-Jul-2019 18:29:35 [INFO] --- maven-compiler-plugin:3.5.1:testCompile (default-testCompile) @ spring-cloud-task-core ---
03-Jul-2019 18:29:35 [INFO] Changes detected - recompiling the module!
03-Jul-2019 18:29:35 [INFO] Compiling 36 source files to /opt/bamboo-home/xml-data/build-dir/SCT-SLJ-JOB1/spring-cloud-task-core/target/test-classes
03-Jul-2019 18:29:36 [INFO] /opt/bamboo-home/xml-data/build-dir/SCT-SLJ-JOB1/spring-cloud-task-core/src/test/java/org/springframework/cloud/task/util/TestVerifierUtils.java: Some input files use or override a deprecated API.
03-Jul-2019 18:29:36 [INFO] /opt/bamboo-home/xml-data/build-dir/SCT-SLJ-JOB1/spring-cloud-task-core/src/test/java/org/springframework/cloud/task/util/TestVerifierUtils.java: Recompile with -Xlint:deprecation for details.
03-Jul-2019 18:29:36 [INFO] /opt/bamboo-home/xml-data/build-dir/SCT-SLJ-JOB1/spring-cloud-task-core/src/test/java/org/springframework/cloud/task/util/TestVerifierUtils.java: Some input files use unchecked or unsafe operations.
03-Jul-2019 18:29:36 [INFO] /opt/bamboo-home/xml-data/build-dir/SCT-SLJ-JOB1/spring-cloud-task-core/src/test/java/org/springframework/cloud/task/util/TestVerifierUtils.java: Recompile with -Xlint:unchecked for details.
03-Jul-2019 18:29:36 [INFO]
03-Jul-2019 18:29:36 [INFO] --- maven-surefire-plugin:2.12.4:test (default-test) @ spring-cloud-task-core ---
03-Jul-2019 18:29:36 [INFO] Surefire report directory: /opt/bamboo-home/xml-data/build-dir/SCT-SLJ-JOB1/spring-cloud-task-core/target/surefire-reports
03-Jul-2019 18:29:36
03-Jul-2019 18:29:36 -------------------------------------------------------
03-Jul-2019 18:29:36 T E S T S
03-Jul-2019 18:29:36 -------------------------------------------------------
03-Jul-2019 18:29:36 Running org.springframework.cloud.task.listener.TaskLifecycleListenerTests
03-Jul-2019 18:29:36 Tests run: 1, Failures: 0, Errors: 1, Skipped: 0, Time elapsed: 0.03 sec <<< FAILURE!
03-Jul-2019 18:29:36 org.springframework.cloud.task.listener.TaskLifecycleListenerTests  Time elapsed: 0.03 sec  <<< ERROR!
03-Jul-2019 18:29:36 java.lang.NoClassDefFoundError: Could not initialize class org.junit.internal.runners.ErrorReportingRunner
03-Jul-2019 18:29:36         at org.junit.runners.model.RunnerBuilder.safeRunnerForClass(RunnerBuilder.java:61)
03-Jul-2019 18:29:36         at org.junit.internal.requests.ClassRequest.getRunner(ClassRequest.java:33)
03-Jul-2019 18:29:36         at org.apache.maven.surefire.junit4.JUnit4Provider.execute(JUnit4Provider.java:250)
03-Jul-2019 18:29:36         at org.apache.maven.surefire.junit4.JUnit4Provider.executeTestSet(JUnit4Provider.java:141)
03-Jul-2019 18:29:36         at org.apache.maven.surefire.junit4.JUnit4Provider.invoke(JUnit4Provider.java:112)
03-Jul-2019 18:29:36         at java.base/jdk.internal.reflect.NativeMethodAccessorImpl.invoke0(Native Method)
03-Jul-2019 18:29:36         at java.base/jdk.internal.reflect.NativeMethodAccessorImpl.invoke(NativeMethodAccessorImpl.java:62)
03-Jul-2019 18:29:36         at java.base/jdk.internal.reflect.DelegatingMethodAccessorImpl.invoke(DelegatingMethodAccessorImpl.java:43)
03-Jul-2019 18:29:36         at java.base/java.lang.reflect.Method.invoke(Method.java:567)
03-Jul-2019 18:29:36         at org.apache.maven.surefire.util.ReflectionUtils.invokeMethodWithArray(ReflectionUtils.java:189)
03-Jul-2019 18:29:36         at org.apache.maven.surefire.booter.ProviderFactory$ProviderProxy.invoke(ProviderFactory.java:165)
03-Jul-2019 18:29:36         at org.apache.maven.surefire.booter.ProviderFactory.invokeProvider(ProviderFactory.java:85)
03-Jul-2019 18:29:36         at org.apache.maven.surefire.booter.ForkedBooter.runSuitesInProcess(ForkedBooter.java:115)
03-Jul-2019 18:29:36         at org.apache.maven.surefire.booter.ForkedBooter.main(ForkedBooter.java:75)
03-Jul-2019 18:29:36
03-Jul-2019 18:29:36 Running org.springframework.cloud.task.listener.TaskExecutionListenerTests
03-Jul-2019 18:29:36 Tests run: 1, Failures: 0, Errors: 1, Skipped: 0, Time elapsed: 0 sec <<< FAILURE!
03-Jul-2019 18:29:36 org.springframework.cloud.task.listener.TaskExecutionListenerTests  Time elapsed: 0 sec  <<< ERROR!
03-Jul-2019 18:29:36 java.lang.NoClassDefFoundError: Could not initialize class org.junit.internal.runners.ErrorReportingRunner
03-Jul-2019 18:29:36         at org.junit.runners.model.RunnerBuilder.safeRunnerForClass(RunnerBuilder.java:61)
03-Jul-2019 18:29:36         at org.junit.internal.requests.ClassRequest.getRunner(ClassRequest.java:33)
03-Jul-2019 18:29:36         at org.apache.maven.surefire.junit4.JUnit4Provider.execute(JUnit4Provider.java:250)
03-Jul-2019 18:29:36         at org.apache.maven.surefire.junit4.JUnit4Provider.executeTestSet(JUnit4Provider.java:141)
03-Jul-2019 18:29:36         at org.apache.maven.surefire.junit4.JUnit4Provider.invoke(JUnit4Provider.java:112)
03-Jul-2019 18:29:36         at java.base/jdk.internal.reflect.NativeMethodAccessorImpl.invoke0(Native Method)
03-Jul-2019 18:29:36         at java.base/jdk.internal.reflect.NativeMethodAccessorImpl.invoke(NativeMethodAccessorImpl.java:62)
03-Jul-2019 18:29:36         at java.base/jdk.internal.reflect.DelegatingMethodAccessorImpl.invoke(DelegatingMethodAccessorImpl.java:43)
03-Jul-2019 18:29:36         at java.base/java.lang.reflect.Method.invoke(Method.java:567)
03-Jul-2019 18:29:36         at org.apache.maven.surefire.util.ReflectionUtils.invokeMethodWithArray(ReflectionUtils.java:189)
03-Jul-2019 18:29:36         at org.apache.maven.surefire.booter.ProviderFactory$ProviderProxy.invoke(ProviderFactory.java:165)
03-Jul-2019 18:29:36         at org.apache.maven.surefire.booter.ProviderFactory.invokeProvider(ProviderFactory.java:85)
03-Jul-2019 18:29:36         at org.apache.maven.surefire.booter.ForkedBooter.runSuitesInProcess(ForkedBooter.java:115)
03-Jul-2019 18:29:36         at org.apache.maven.surefire.booter.ForkedBooter.main(ForkedBooter.java:75)
03-Jul-2019 18:29:36
03-Jul-2019 18:29:36 Running org.springframework.cloud.task.listener.TaskListenerExecutorObjectFactoryTests
03-Jul-2019 18:29:36 Tests run: 1, Failures: 0, Errors: 1, Skipped: 0, Time elapsed: 0.007 sec <<< FAILURE!
03-Jul-2019 18:29:36 org.springframework.cloud.task.listener.TaskListenerExecutorObjectFactoryTests  Time elapsed: 0.007 sec  <<< ERROR!
03-Jul-2019 18:29:36 java.lang.NoClassDefFoundError: Could not initialize class org.junit.internal.runners.ErrorReportingRunner
03-Jul-2019 18:29:36         at org.junit.runners.model.RunnerBuilder.safeRunnerForClass(RunnerBuilder.java:61)
03-Jul-2019 18:29:36         at org.junit.internal.requests.ClassRequest.getRunner(ClassRequest.java:33)
03-Jul-2019 18:29:36         at org.apache.maven.surefire.junit4.JUnit4Provider.execute(JUnit4Provider.java:250)
03-Jul-2019 18:29:36         at org.apache.maven.surefire.junit4.JUnit4Provider.executeTestSet(JUnit4Provider.java:141)
03-Jul-2019 18:29:36         at org.apache.maven.surefire.junit4.JUnit4Provider.invoke(JUnit4Provider.java:112)
03-Jul-2019 18:29:36         at java.base/jdk.internal.reflect.NativeMethodAccessorImpl.invoke0(Native Method)
03-Jul-2019 18:29:36         at java.base/jdk.internal.reflect.NativeMethodAccessorImpl.invoke(NativeMethodAccessorImpl.java:62)
03-Jul-2019 18:29:36         at java.base/jdk.internal.reflect.DelegatingMethodAccessorImpl.invoke(DelegatingMethodAccessorImpl.java:43)
03-Jul-2019 18:29:36         at java.base/java.lang.reflect.Method.invoke(Method.java:567)
03-Jul-2019 18:29:36         at org.apache.maven.surefire.util.ReflectionUtils.invokeMethodWithArray(ReflectionUtils.java:189)
03-Jul-2019 18:29:36         at org.apache.maven.surefire.booter.ProviderFactory$ProviderProxy.invoke(ProviderFactory.java:165)
03-Jul-2019 18:29:36         at org.apache.maven.surefire.booter.ProviderFactory.invokeProvider(ProviderFactory.java:85)
03-Jul-2019 18:29:36         at org.apache.maven.surefire.booter.ForkedBooter.runSuitesInProcess(ForkedBooter.java:115)
03-Jul-2019 18:29:36         at org.apache.maven.surefire.booter.ForkedBooter.main(ForkedBooter.java:75)
03-Jul-2019 18:29:36
03-Jul-2019 18:29:36 Running org.springframework.cloud.task.listener.TaskExceptionTests
03-Jul-2019 18:29:36 Tests run: 1, Failures: 0, Errors: 1, Skipped: 0, Time elapsed: 0 sec <<< FAILURE!
03-Jul-2019 18:29:36 org.springframework.cloud.task.listener.TaskExceptionTests  Time elapsed: 0 sec  <<< ERROR!
03-Jul-2019 18:29:36 java.lang.NoClassDefFoundError: Could not initialize class org.junit.internal.runners.ErrorReportingRunner
03-Jul-2019 18:29:36         at org.junit.runners.model.RunnerBuilder.safeRunnerForClass(RunnerBuilder.java:61)
03-Jul-2019 18:29:36         at org.junit.internal.requests.ClassRequest.getRunner(ClassRequest.java:33)
03-Jul-2019 18:29:36         at org.apache.maven.surefire.junit4.JUnit4Provider.execute(JUnit4Provider.java:250)
03-Jul-2019 18:29:36         at org.apache.maven.surefire.junit4.JUnit4Provider.executeTestSet(JUnit4Provider.java:141)
03-Jul-2019 18:29:36         at org.apache.maven.surefire.junit4.JUnit4Provider.invoke(JUnit4Provider.java:112)
03-Jul-2019 18:29:36         at java.base/jdk.internal.reflect.NativeMethodAccessorImpl.invoke0(Native Method)
03-Jul-2019 18:29:36         at java.base/jdk.internal.reflect.NativeMethodAccessorImpl.invoke(NativeMethodAccessorImpl.java:62)
03-Jul-2019 18:29:36         at java.base/jdk.internal.reflect.DelegatingMethodAccessorImpl.invoke(DelegatingMethodAccessorImpl.java:43)
03-Jul-2019 18:29:36         at java.base/java.lang.reflect.Method.invoke(Method.java:567)
03-Jul-2019 18:29:36         at org.apache.maven.surefire.util.ReflectionUtils.invokeMethodWithArray(ReflectionUtils.java:189)
03-Jul-2019 18:29:36         at org.apache.maven.surefire.booter.ProviderFactory$ProviderProxy.invoke(ProviderFactory.java:165)
03-Jul-2019 18:29:36         at org.apache.maven.surefire.booter.ProviderFactory.invokeProvider(ProviderFactory.java:85)
03-Jul-2019 18:29:36         at org.apache.maven.surefire.booter.ForkedBooter.runSuitesInProcess(ForkedBooter.java:115)
03-Jul-2019 18:29:36         at org.apache.maven.surefire.booter.ForkedBooter.main(ForkedBooter.java:75)
03-Jul-2019 18:29:36
03-Jul-2019 18:29:36 Running org.springframework.cloud.task.micrometer.TaskMetricsTests
03-Jul-2019 18:29:36 Tests run: 1, Failures: 0, Errors: 1, Skipped: 0, Time elapsed: 0 sec <<< FAILURE!
03-Jul-2019 18:29:36 org.springframework.cloud.task.micrometer.TaskMetricsTests  Time elapsed: 0 sec  <<< ERROR!
03-Jul-2019 18:29:36 java.lang.NoClassDefFoundError: Could not initialize class org.junit.internal.runners.ErrorReportingRunner
03-Jul-2019 18:29:36         at org.junit.runners.model.RunnerBuilder.safeRunnerForClass(RunnerBuilder.java:61)
03-Jul-2019 18:29:36         at org.junit.internal.requests.ClassRequest.getRunner(ClassRequest.java:33)
03-Jul-2019 18:29:36         at org.apache.maven.surefire.junit4.JUnit4Provider.execute(JUnit4Provider.java:250)
03-Jul-2019 18:29:36         at org.apache.maven.surefire.junit4.JUnit4Provider.executeTestSet(JUnit4Provider.java:141)
03-Jul-2019 18:29:36         at org.apache.maven.surefire.junit4.JUnit4Provider.invoke(JUnit4Provider.java:112)
03-Jul-2019 18:29:36         at java.base/jdk.internal.reflect.NativeMethodAccessorImpl.invoke0(Native Method)
03-Jul-2019 18:29:36         at java.base/jdk.internal.reflect.NativeMethodAccessorImpl.invoke(NativeMethodAccessorImpl.java:62)
03-Jul-2019 18:29:36         at java.base/jdk.internal.reflect.DelegatingMethodAccessorImpl.invoke(DelegatingMethodAccessorImpl.java:43)
03-Jul-2019 18:29:36         at java.base/java.lang.reflect.Method.invoke(Method.java:567)
03-Jul-2019 18:29:36         at org.apache.maven.surefire.util.ReflectionUtils.invokeMethodWithArray(ReflectionUtils.java:189)
03-Jul-2019 18:29:36         at org.apache.maven.surefire.booter.ProviderFactory$ProviderProxy.invoke(ProviderFactory.java:165)
03-Jul-2019 18:29:36         at org.apache.maven.surefire.booter.ProviderFactory.invokeProvider(ProviderFactory.java:85)
03-Jul-2019 18:29:36         at org.apache.maven.surefire.booter.ForkedBooter.runSuitesInProcess(ForkedBooter.java:115)
03-Jul-2019 18:29:36         at org.apache.maven.surefire.booter.ForkedBooter.main(ForkedBooter.java:75)
03-Jul-2019 18:29:36
03-Jul-2019 18:29:36 Running org.springframework.cloud.task.TaskCoreTests
03-Jul-2019 18:29:36 Tests run: 1, Failures: 0, Errors: 1, Skipped: 0, Time elapsed: 0 sec <<< FAILURE!
03-Jul-2019 18:29:36 org.springframework.cloud.task.TaskCoreTests  Time elapsed: 0 sec  <<< ERROR!
03-Jul-2019 18:29:36 java.lang.NoClassDefFoundError: Could not initialize class org.junit.internal.runners.ErrorReportingRunner
03-Jul-2019 18:29:36         at org.junit.runners.model.RunnerBuilder.safeRunnerForClass(RunnerBuilder.java:61)
03-Jul-2019 18:29:36         at org.junit.internal.requests.ClassRequest.getRunner(ClassRequest.java:33)
03-Jul-2019 18:29:36         at org.apache.maven.surefire.junit4.JUnit4Provider.execute(JUnit4Provider.java:250)
03-Jul-2019 18:29:36         at org.apache.maven.surefire.junit4.JUnit4Provider.executeTestSet(JUnit4Provider.java:141)
03-Jul-2019 18:29:36         at org.apache.maven.surefire.junit4.JUnit4Provider.invoke(JUnit4Provider.java:112)
03-Jul-2019 18:29:36         at java.base/jdk.internal.reflect.NativeMethodAccessorImpl.invoke0(Native Method)
03-Jul-2019 18:29:36         at java.base/jdk.internal.reflect.NativeMethodAccessorImpl.invoke(NativeMethodAccessorImpl.java:62)
03-Jul-2019 18:29:36         at java.base/jdk.internal.reflect.DelegatingMethodAccessorImpl.invoke(DelegatingMethodAccessorImpl.java:43)
03-Jul-2019 18:29:36         at java.base/java.lang.reflect.Method.invoke(Method.java:567)
03-Jul-2019 18:29:36         at org.apache.maven.surefire.util.ReflectionUtils.invokeMethodWithArray(ReflectionUtils.java:189)
03-Jul-2019 18:29:36         at org.apache.maven.surefire.booter.ProviderFactory$ProviderProxy.invoke(ProviderFactory.java:165)
03-Jul-2019 18:29:36         at org.apache.maven.surefire.booter.ProviderFactory.invokeProvider(ProviderFactory.java:85)
03-Jul-2019 18:29:36         at org.apache.maven.surefire.booter.ForkedBooter.runSuitesInProcess(ForkedBooter.java:115)
03-Jul-2019 18:29:36         at org.apache.maven.surefire.booter.ForkedBooter.main(ForkedBooter.java:75)
03-Jul-2019 18:29:36
03-Jul-2019 18:29:36 Running org.springframework.cloud.task.TaskRepositoryInitializerNoDataSourceTaskConfigurerTests
03-Jul-2019 18:29:36 Tests run: 1, Failures: 0, Errors: 1, Skipped: 0, Time elapsed: 0 sec <<< FAILURE!
03-Jul-2019 18:29:36 org.springframework.cloud.task.TaskRepositoryInitializerNoDataSourceTaskConfigurerTests  Time elapsed: 0 sec  <<< ERROR!
03-Jul-2019 18:29:36 java.lang.NoClassDefFoundError: Could not initialize class org.junit.internal.runners.ErrorReportingRunner
03-Jul-2019 18:29:36         at org.junit.runners.model.RunnerBuilder.safeRunnerForClass(RunnerBuilder.java:61)
03-Jul-2019 18:29:36         at org.junit.internal.requests.ClassRequest.getRunner(ClassRequest.java:33)
03-Jul-2019 18:29:36         at org.apache.maven.surefire.junit4.JUnit4Provider.execute(JUnit4Provider.java:250)
03-Jul-2019 18:29:36         at org.apache.maven.surefire.junit4.JUnit4Provider.executeTestSet(JUnit4Provider.java:141)
03-Jul-2019 18:29:36         at org.apache.maven.surefire.junit4.JUnit4Provider.invoke(JUnit4Provider.java:112)
03-Jul-2019 18:29:36         at java.base/jdk.internal.reflect.NativeMethodAccessorImpl.invoke0(Native Method)
03-Jul-2019 18:29:36         at java.base/jdk.internal.reflect.NativeMethodAccessorImpl.invoke(NativeMethodAccessorImpl.java:62)
03-Jul-2019 18:29:36         at java.base/jdk.internal.reflect.DelegatingMethodAccessorImpl.invoke(DelegatingMethodAccessorImpl.java:43)
03-Jul-2019 18:29:36         at java.base/java.lang.reflect.Method.invoke(Method.java:567)
03-Jul-2019 18:29:36         at org.apache.maven.surefire.util.ReflectionUtils.invokeMethodWithArray(ReflectionUtils.java:189)
03-Jul-2019 18:29:36         at org.apache.maven.surefire.booter.ProviderFactory$ProviderProxy.invoke(ProviderFactory.java:165)
03-Jul-2019 18:29:36         at org.apache.maven.surefire.booter.ProviderFactory.invokeProvider(ProviderFactory.java:85)
03-Jul-2019 18:29:36         at org.apache.maven.surefire.booter.ForkedBooter.runSuitesInProcess(ForkedBooter.java:115)
03-Jul-2019 18:29:36         at org.apache.maven.surefire.booter.ForkedBooter.main(ForkedBooter.java:75)
03-Jul-2019 18:29:36
03-Jul-2019 18:29:36 Running org.springframework.cloud.task.SimpleSingleTaskAutoConfigurationWithDataSourceTests
03-Jul-2019 18:29:36 Tests run: 1, Failures: 0, Errors: 1, Skipped: 0, Time elapsed: 0 sec <<< FAILURE!
03-Jul-2019 18:29:36 org.springframework.cloud.task.SimpleSingleTaskAutoConfigurationWithDataSourceTests  Time elapsed: 0 sec  <<< ERROR!
03-Jul-2019 18:29:36 java.lang.NoClassDefFoundError: Could not initialize class org.junit.internal.runners.ErrorReportingRunner
03-Jul-2019 18:29:36         at org.junit.runners.model.RunnerBuilder.safeRunnerForClass(RunnerBuilder.java:61)
03-Jul-2019 18:29:36         at org.junit.internal.requests.ClassRequest.getRunner(ClassRequest.java:33)
03-Jul-2019 18:29:36         at org.apache.maven.surefire.junit4.JUnit4Provider.execute(JUnit4Provider.java:250)
03-Jul-2019 18:29:36         at org.apache.maven.surefire.junit4.JUnit4Provider.executeTestSet(JUnit4Provider.java:141)
03-Jul-2019 18:29:36         at org.apache.maven.surefire.junit4.JUnit4Provider.invoke(JUnit4Provider.java:112)
03-Jul-2019 18:29:36         at java.base/jdk.internal.reflect.NativeMethodAccessorImpl.invoke0(Native Method)
03-Jul-2019 18:29:36         at java.base/jdk.internal.reflect.NativeMethodAccessorImpl.invoke(NativeMethodAccessorImpl.java:62)
03-Jul-2019 18:29:36         at java.base/jdk.internal.reflect.DelegatingMethodAccessorImpl.invoke(DelegatingMethodAccessorImpl.java:43)
03-Jul-2019 18:29:36         at java.base/java.lang.reflect.Method.invoke(Method.java:567)
03-Jul-2019 18:29:36         at org.apache.maven.surefire.util.ReflectionUtils.invokeMethodWithArray(ReflectionUtils.java:189)
03-Jul-2019 18:29:36         at org.apache.maven.surefire.booter.ProviderFactory$ProviderProxy.invoke(ProviderFactory.java:165)
03-Jul-2019 18:29:36         at org.apache.maven.surefire.booter.ProviderFactory.invokeProvider(ProviderFactory.java:85)
03-Jul-2019 18:29:36         at org.apache.maven.surefire.booter.ForkedBooter.runSuitesInProcess(ForkedBooter.java:115)
03-Jul-2019 18:29:36         at org.apache.maven.surefire.booter.ForkedBooter.main(ForkedBooter.java:75)
03-Jul-2019 18:29:36
03-Jul-2019 18:29:36 Running org.springframework.cloud.task.repository.support.SimpleTaskExplorerTests
03-Jul-2019 18:29:36 Tests run: 1, Failures: 0, Errors: 1, Skipped: 0, Time elapsed: 0.004 sec <<< FAILURE!
03-Jul-2019 18:29:36 org.springframework.cloud.task.repository.support.SimpleTaskExplorerTests  Time elapsed: 0.004 sec  <<< ERROR!
03-Jul-2019 18:29:36 java.lang.NoClassDefFoundError: Could not initialize class org.junit.internal.runners.ErrorReportingRunner
03-Jul-2019 18:29:36         at org.junit.runners.model.RunnerBuilder.safeRunnerForClass(RunnerBuilder.java:61)
03-Jul-2019 18:29:36         at org.junit.internal.requests.ClassRequest.getRunner(ClassRequest.java:33)
03-Jul-2019 18:29:36         at org.apache.maven.surefire.junit4.JUnit4Provider.execute(JUnit4Provider.java:250)
03-Jul-2019 18:29:36         at org.apache.maven.surefire.junit4.JUnit4Provider.executeTestSet(JUnit4Provider.java:141)
03-Jul-2019 18:29:36         at org.apache.maven.surefire.junit4.JUnit4Provider.invoke(JUnit4Provider.java:112)
03-Jul-2019 18:29:36         at java.base/jdk.internal.reflect.NativeMethodAccessorImpl.invoke0(Native Method)
03-Jul-2019 18:29:36         at java.base/jdk.internal.reflect.NativeMethodAccessorImpl.invoke(NativeMethodAccessorImpl.java:62)
03-Jul-2019 18:29:36         at java.base/jdk.internal.reflect.DelegatingMethodAccessorImpl.invoke(DelegatingMethodAccessorImpl.java:43)
03-Jul-2019 18:29:36         at java.base/java.lang.reflect.Method.invoke(Method.java:567)
03-Jul-2019 18:29:36         at org.apache.maven.surefire.util.ReflectionUtils.invokeMethodWithArray(ReflectionUtils.java:189)
03-Jul-2019 18:29:36         at org.apache.maven.surefire.booter.ProviderFactory$ProviderProxy.invoke(ProviderFactory.java:165)
03-Jul-2019 18:29:36         at org.apache.maven.surefire.booter.ProviderFactory.invokeProvider(ProviderFactory.java:85)
03-Jul-2019 18:29:36         at org.apache.maven.surefire.booter.ForkedBooter.runSuitesInProcess(ForkedBooter.java:115)
03-Jul-2019 18:29:36         at org.apache.maven.surefire.booter.ForkedBooter.main(ForkedBooter.java:75)
03-Jul-2019 18:29:36
03-Jul-2019 18:29:36 Running org.springframework.cloud.task.repository.support.SimpleTaskRepositoryJdbcTests
03-Jul-2019 18:29:36 Tests run: 1, Failures: 0, Errors: 1, Skipped: 0, Time elapsed: 0 sec <<< FAILURE!
03-Jul-2019 18:29:36 org.springframework.cloud.task.repository.support.SimpleTaskRepositoryJdbcTests  Time elapsed: 0 sec  <<< ERROR!
03-Jul-2019 18:29:36 java.lang.NoClassDefFoundError: Could not initialize class org.junit.internal.runners.ErrorReportingRunner
03-Jul-2019 18:29:36         at org.junit.runners.model.RunnerBuilder.safeRunnerForClass(RunnerBuilder.java:61)
03-Jul-2019 18:29:36         at org.junit.internal.requests.ClassRequest.getRunner(ClassRequest.java:33)
03-Jul-2019 18:29:36         at org.apache.maven.surefire.junit4.JUnit4Provider.execute(JUnit4Provider.java:250)
03-Jul-2019 18:29:36         at org.apache.maven.surefire.junit4.JUnit4Provider.executeTestSet(JUnit4Provider.java:141)
03-Jul-2019 18:29:36         at org.apache.maven.surefire.junit4.JUnit4Provider.invoke(JUnit4Provider.java:112)
03-Jul-2019 18:29:36         at java.base/jdk.internal.reflect.NativeMethodAccessorImpl.invoke0(Native Method)
03-Jul-2019 18:29:36         at java.base/jdk.internal.reflect.NativeMethodAccessorImpl.invoke(NativeMethodAccessorImpl.java:62)
03-Jul-2019 18:29:36         at java.base/jdk.internal.reflect.DelegatingMethodAccessorImpl.invoke(DelegatingMethodAccessorImpl.java:43)
03-Jul-2019 18:29:36         at java.base/java.lang.reflect.Method.invoke(Method.java:567)
03-Jul-2019 18:29:36         at org.apache.maven.surefire.util.ReflectionUtils.invokeMethodWithArray(ReflectionUtils.java:189)
03-Jul-2019 18:29:36         at org.apache.maven.surefire.booter.ProviderFactory$ProviderProxy.invoke(ProviderFactory.java:165)
03-Jul-2019 18:29:36         at org.apache.maven.surefire.booter.ProviderFactory.invokeProvider(ProviderFactory.java:85)
03-Jul-2019 18:29:36         at org.apache.maven.surefire.booter.ForkedBooter.runSuitesInProcess(ForkedBooter.java:115)
03-Jul-2019 18:29:36         at org.apache.maven.surefire.booter.ForkedBooter.main(ForkedBooter.java:75)
03-Jul-2019 18:29:36
03-Jul-2019 18:29:36 Running org.springframework.cloud.task.repository.support.SimpleTaskNameResolverTests
03-Jul-2019 18:29:36 Tests run: 1, Failures: 0, Errors: 1, Skipped: 0, Time elapsed: 0 sec <<< FAILURE!
03-Jul-2019 18:29:36 org.springframework.cloud.task.repository.support.SimpleTaskNameResolverTests  Time elapsed: 0 sec  <<< ERROR!
03-Jul-2019 18:29:36 java.lang.NoClassDefFoundError: Could not initialize class org.junit.internal.runners.ErrorReportingRunner
03-Jul-2019 18:29:36         at org.junit.runners.model.RunnerBuilder.safeRunnerForClass(RunnerBuilder.java:61)
03-Jul-2019 18:29:36         at org.junit.internal.requests.ClassRequest.getRunner(ClassRequest.java:33)
03-Jul-2019 18:29:36         at org.apache.maven.surefire.junit4.JUnit4Provider.execute(JUnit4Provider.java:250)
03-Jul-2019 18:29:36         at org.apache.maven.surefire.junit4.JUnit4Provider.executeTestSet(JUnit4Provider.java:141)
03-Jul-2019 18:29:36         at org.apache.maven.surefire.junit4.JUnit4Provider.invoke(JUnit4Provider.java:112)
03-Jul-2019 18:29:36         at java.base/jdk.internal.reflect.NativeMethodAccessorImpl.invoke0(Native Method)
03-Jul-2019 18:29:36         at java.base/jdk.internal.reflect.NativeMethodAccessorImpl.invoke(NativeMethodAccessorImpl.java:62)
03-Jul-2019 18:29:36         at java.base/jdk.internal.reflect.DelegatingMethodAccessorImpl.invoke(DelegatingMethodAccessorImpl.java:43)
03-Jul-2019 18:29:36         at java.base/java.lang.reflect.Method.invoke(Method.java:567)
03-Jul-2019 18:29:36         at org.apache.maven.surefire.util.ReflectionUtils.invokeMethodWithArray(ReflectionUtils.java:189)
03-Jul-2019 18:29:36         at org.apache.maven.surefire.booter.ProviderFactory$ProviderProxy.invoke(ProviderFactory.java:165)
03-Jul-2019 18:29:36         at org.apache.maven.surefire.booter.ProviderFactory.invokeProvider(ProviderFactory.java:85)
03-Jul-2019 18:29:36         at org.apache.maven.surefire.booter.ForkedBooter.runSuitesInProcess(ForkedBooter.java:115)
03-Jul-2019 18:29:36         at org.apache.maven.surefire.booter.ForkedBooter.main(ForkedBooter.java:75)
03-Jul-2019 18:29:36
03-Jul-2019 18:29:36 Running org.springframework.cloud.task.repository.support.SimpleTaskRepositoryMapTests
03-Jul-2019 18:29:36 Tests run: 1, Failures: 0, Errors: 1, Skipped: 0, Time elapsed: 0 sec <<< FAILURE!
03-Jul-2019 18:29:36 org.springframework.cloud.task.repository.support.SimpleTaskRepositoryMapTests  Time elapsed: 0 sec  <<< ERROR!
03-Jul-2019 18:29:36 java.lang.NoClassDefFoundError: Could not initialize class org.junit.internal.runners.ErrorReportingRunner
03-Jul-2019 18:29:36         at org.junit.runners.model.RunnerBuilder.safeRunnerForClass(RunnerBuilder.java:61)
03-Jul-2019 18:29:36         at org.junit.internal.requests.ClassRequest.getRunner(ClassRequest.java:33)
03-Jul-2019 18:29:36         at org.apache.maven.surefire.junit4.JUnit4Provider.execute(JUnit4Provider.java:250)
03-Jul-2019 18:29:36         at org.apache.maven.surefire.junit4.JUnit4Provider.executeTestSet(JUnit4Provider.java:141)
03-Jul-2019 18:29:36         at org.apache.maven.surefire.junit4.JUnit4Provider.invoke(JUnit4Provider.java:112)
03-Jul-2019 18:29:36         at java.base/jdk.internal.reflect.NativeMethodAccessorImpl.invoke0(Native Method)
03-Jul-2019 18:29:36         at java.base/jdk.internal.reflect.NativeMethodAccessorImpl.invoke(NativeMethodAccessorImpl.java:62)
03-Jul-2019 18:29:36         at java.base/jdk.internal.reflect.DelegatingMethodAccessorImpl.invoke(DelegatingMethodAccessorImpl.java:43)
03-Jul-2019 18:29:36         at java.base/java.lang.reflect.Method.invoke(Method.java:567)
03-Jul-2019 18:29:36         at org.apache.maven.surefire.util.ReflectionUtils.invokeMethodWithArray(ReflectionUtils.java:189)
03-Jul-2019 18:29:36         at org.apache.maven.surefire.booter.ProviderFactory$ProviderProxy.invoke(ProviderFactory.java:165)
03-Jul-2019 18:29:36         at org.apache.maven.surefire.booter.ProviderFactory.invokeProvider(ProviderFactory.java:85)
03-Jul-2019 18:29:36         at org.apache.maven.surefire.booter.ForkedBooter.runSuitesInProcess(ForkedBooter.java:115)
03-Jul-2019 18:29:36         at org.apache.maven.surefire.booter.ForkedBooter.main(ForkedBooter.java:75)
03-Jul-2019 18:29:36
03-Jul-2019 18:29:36 Running org.springframework.cloud.task.repository.support.DatabaseTypeTests
03-Jul-2019 18:29:36 Tests run: 1, Failures: 0, Errors: 1, Skipped: 0, Time elapsed: 0 sec <<< FAILURE!
03-Jul-2019 18:29:36 org.springframework.cloud.task.repository.support.DatabaseTypeTests  Time elapsed: 0 sec  <<< ERROR!
03-Jul-2019 18:29:36 java.lang.NoClassDefFoundError: Could not initialize class org.junit.internal.runners.ErrorReportingRunner
03-Jul-2019 18:29:36         at org.junit.runners.model.RunnerBuilder.safeRunnerForClass(RunnerBuilder.java:61)
03-Jul-2019 18:29:36         at org.junit.internal.requests.ClassRequest.getRunner(ClassRequest.java:33)
03-Jul-2019 18:29:36         at org.apache.maven.surefire.junit4.JUnit4Provider.execute(JUnit4Provider.java:250)
03-Jul-2019 18:29:36         at org.apache.maven.surefire.junit4.JUnit4Provider.executeTestSet(JUnit4Provider.java:141)
03-Jul-2019 18:29:36         at org.apache.maven.surefire.junit4.JUnit4Provider.invoke(JUnit4Provider.java:112)
03-Jul-2019 18:29:36         at java.base/jdk.internal.reflect.NativeMethodAccessorImpl.invoke0(Native Method)
03-Jul-2019 18:29:36         at java.base/jdk.internal.reflect.NativeMethodAccessorImpl.invoke(NativeMethodAccessorImpl.java:62)
03-Jul-2019 18:29:36         at java.base/jdk.internal.reflect.DelegatingMethodAccessorImpl.invoke(DelegatingMethodAccessorImpl.java:43)
03-Jul-2019 18:29:36         at java.base/java.lang.reflect.Method.invoke(Method.java:567)
03-Jul-2019 18:29:36         at org.apache.maven.surefire.util.ReflectionUtils.invokeMethodWithArray(ReflectionUtils.java:189)
03-Jul-2019 18:29:36         at org.apache.maven.surefire.booter.ProviderFactory$ProviderProxy.invoke(ProviderFactory.java:165)
03-Jul-2019 18:29:36         at org.apache.maven.surefire.booter.ProviderFactory.invokeProvider(ProviderFactory.java:85)
03-Jul-2019 18:29:36         at org.apache.maven.surefire.booter.ForkedBooter.runSuitesInProcess(ForkedBooter.java:115)
03-Jul-2019 18:29:36         at org.apache.maven.surefire.booter.ForkedBooter.main(ForkedBooter.java:75)
03-Jul-2019 18:29:36
03-Jul-2019 18:29:36 Running org.springframework.cloud.task.repository.support.TaskExecutionDaoFactoryBeanTests
03-Jul-2019 18:29:36 Tests run: 1, Failures: 0, Errors: 1, Skipped: 0, Time elapsed: 0.002 sec <<< FAILURE!
03-Jul-2019 18:29:36 org.springframework.cloud.task.repository.support.TaskExecutionDaoFactoryBeanTests  Time elapsed: 0.002 sec  <<< ERROR!
03-Jul-2019 18:29:36 java.lang.NoClassDefFoundError: Could not initialize class org.junit.internal.runners.ErrorReportingRunner
03-Jul-2019 18:29:36         at org.junit.runners.model.RunnerBuilder.safeRunnerForClass(RunnerBuilder.java:61)
03-Jul-2019 18:29:36         at org.junit.internal.requests.ClassRequest.getRunner(ClassRequest.java:33)
03-Jul-2019 18:29:36         at org.apache.maven.surefire.junit4.JUnit4Provider.execute(JUnit4Provider.java:250)
03-Jul-2019 18:29:36         at org.apache.maven.surefire.junit4.JUnit4Provider.executeTestSet(JUnit4Provider.java:141)
03-Jul-2019 18:29:36         at org.apache.maven.surefire.junit4.JUnit4Provider.invoke(JUnit4Provider.java:112)
03-Jul-2019 18:29:36         at java.base/jdk.internal.reflect.NativeMethodAccessorImpl.invoke0(Native Method)
03-Jul-2019 18:29:36         at java.base/jdk.internal.reflect.NativeMethodAccessorImpl.invoke(NativeMethodAccessorImpl.java:62)
03-Jul-2019 18:29:36         at java.base/jdk.internal.reflect.DelegatingMethodAccessorImpl.invoke(DelegatingMethodAccessorImpl.java:43)
03-Jul-2019 18:29:36         at java.base/java.lang.reflect.Method.invoke(Method.java:567)
03-Jul-2019 18:29:36         at org.apache.maven.surefire.util.ReflectionUtils.invokeMethodWithArray(ReflectionUtils.java:189)
03-Jul-2019 18:29:36         at org.apache.maven.surefire.booter.ProviderFactory$ProviderProxy.invoke(ProviderFactory.java:165)
03-Jul-2019 18:29:36         at org.apache.maven.surefire.booter.ProviderFactory.invokeProvider(ProviderFactory.java:85)
03-Jul-2019 18:29:36         at org.apache.maven.surefire.booter.ForkedBooter.runSuitesInProcess(ForkedBooter.java:115)
03-Jul-2019 18:29:36         at org.apache.maven.surefire.booter.ForkedBooter.main(ForkedBooter.java:75)
03-Jul-2019 18:29:36
03-Jul-2019 18:29:36 Running org.springframework.cloud.task.repository.support.TaskDatabaseInitializerTests
03-Jul-2019 18:29:36 Tests run: 1, Failures: 0, Errors: 1, Skipped: 0, Time elapsed: 0 sec <<< FAILURE!
03-Jul-2019 18:29:36 org.springframework.cloud.task.repository.support.TaskDatabaseInitializerTests  Time elapsed: 0 sec  <<< ERROR!
03-Jul-2019 18:29:36 java.lang.NoClassDefFoundError: Could not initialize class org.junit.internal.runners.ErrorReportingRunner
03-Jul-2019 18:29:36         at org.junit.runners.model.RunnerBuilder.safeRunnerForClass(RunnerBuilder.java:61)
03-Jul-2019 18:29:36         at org.junit.internal.requests.ClassRequest.getRunner(ClassRequest.java:33)
03-Jul-2019 18:29:36         at org.apache.maven.surefire.junit4.JUnit4Provider.execute(JUnit4Provider.java:250)
03-Jul-2019 18:29:36         at org.apache.maven.surefire.junit4.JUnit4Provider.executeTestSet(JUnit4Provider.java:141)
03-Jul-2019 18:29:36         at org.apache.maven.surefire.junit4.JUnit4Provider.invoke(JUnit4Provider.java:112)
03-Jul-2019 18:29:36         at java.base/jdk.internal.reflect.NativeMethodAccessorImpl.invoke0(Native Method)
03-Jul-2019 18:29:36         at java.base/jdk.internal.reflect.NativeMethodAccessorImpl.invoke(NativeMethodAccessorImpl.java:62)
03-Jul-2019 18:29:36         at java.base/jdk.internal.reflect.DelegatingMethodAccessorImpl.invoke(DelegatingMethodAccessorImpl.java:43)
03-Jul-2019 18:29:36         at java.base/java.lang.reflect.Method.invoke(Method.java:567)
03-Jul-2019 18:29:36         at org.apache.maven.surefire.util.ReflectionUtils.invokeMethodWithArray(ReflectionUtils.java:189)
03-Jul-2019 18:29:36         at org.apache.maven.surefire.booter.ProviderFactory$ProviderProxy.invoke(ProviderFactory.java:165)
03-Jul-2019 18:29:36         at org.apache.maven.surefire.booter.ProviderFactory.invokeProvider(ProviderFactory.java:85)
03-Jul-2019 18:29:36         at org.apache.maven.surefire.booter.ForkedBooter.runSuitesInProcess(ForkedBooter.java:115)
03-Jul-2019 18:29:36         at org.apache.maven.surefire.booter.ForkedBooter.main(ForkedBooter.java:75)
03-Jul-2019 18:29:36
03-Jul-2019 18:29:36 Running org.springframework.cloud.task.repository.database.support.WhereClausePagingQueryProviderTests
03-Jul-2019 18:29:36 Tests run: 1, Failures: 0, Errors: 1, Skipped: 0, Time elapsed: 0 sec <<< FAILURE!
03-Jul-2019 18:29:36 org.springframework.cloud.task.repository.database.support.WhereClausePagingQueryProviderTests  Time elapsed: 0 sec  <<< ERROR!
03-Jul-2019 18:29:36 java.lang.NoClassDefFoundError: Could not initialize class org.junit.internal.runners.ErrorReportingRunner
03-Jul-2019 18:29:36         at org.junit.runners.model.RunnerBuilder.safeRunnerForClass(RunnerBuilder.java:61)
03-Jul-2019 18:29:36         at org.junit.internal.requests.ClassRequest.getRunner(ClassRequest.java:33)
03-Jul-2019 18:29:36         at org.apache.maven.surefire.junit4.JUnit4Provider.execute(JUnit4Provider.java:250)
03-Jul-2019 18:29:36         at org.apache.maven.surefire.junit4.JUnit4Provider.executeTestSet(JUnit4Provider.java:141)
03-Jul-2019 18:29:36         at org.apache.maven.surefire.junit4.JUnit4Provider.invoke(JUnit4Provider.java:112)
03-Jul-2019 18:29:36         at java.base/jdk.internal.reflect.NativeMethodAccessorImpl.invoke0(Native Method)
03-Jul-2019 18:29:36         at java.base/jdk.internal.reflect.NativeMethodAccessorImpl.invoke(NativeMethodAccessorImpl.java:62)
03-Jul-2019 18:29:36         at java.base/jdk.internal.reflect.DelegatingMethodAccessorImpl.invoke(DelegatingMethodAccessorImpl.java:43)
03-Jul-2019 18:29:36         at java.base/java.lang.reflect.Method.invoke(Method.java:567)
03-Jul-2019 18:29:36         at org.apache.maven.surefire.util.ReflectionUtils.invokeMethodWithArray(ReflectionUtils.java:189)
03-Jul-2019 18:29:36         at org.apache.maven.surefire.booter.ProviderFactory$ProviderProxy.invoke(ProviderFactory.java:165)
03-Jul-2019 18:29:36         at org.apache.maven.surefire.booter.ProviderFactory.invokeProvider(ProviderFactory.java:85)
03-Jul-2019 18:29:36         at org.apache.maven.surefire.booter.ForkedBooter.runSuitesInProcess(ForkedBooter.java:115)
03-Jul-2019 18:29:36         at org.apache.maven.surefire.booter.ForkedBooter.main(ForkedBooter.java:75)
03-Jul-2019 18:29:36
03-Jul-2019 18:29:36 Running org.springframework.cloud.task.repository.database.support.SqlPagingQueryProviderFactoryBeanTests
03-Jul-2019 18:29:36 Tests run: 1, Failures: 0, Errors: 1, Skipped: 0, Time elapsed: 0.002 sec <<< FAILURE!
03-Jul-2019 18:29:36 org.springframework.cloud.task.repository.database.support.SqlPagingQueryProviderFactoryBeanTests  Time elapsed: 0.002 sec  <<< ERROR!
03-Jul-2019 18:29:36 java.lang.NoClassDefFoundError: Could not initialize class org.junit.internal.runners.ErrorReportingRunner
03-Jul-2019 18:29:36         at org.junit.runners.model.RunnerBuilder.safeRunnerForClass(RunnerBuilder.java:61)
03-Jul-2019 18:29:36         at org.junit.internal.requests.ClassRequest.getRunner(ClassRequest.java:33)
03-Jul-2019 18:29:36         at org.apache.maven.surefire.junit4.JUnit4Provider.execute(JUnit4Provider.java:250)
03-Jul-2019 18:29:36         at org.apache.maven.surefire.junit4.JUnit4Provider.executeTestSet(JUnit4Provider.java:141)
03-Jul-2019 18:29:36         at org.apache.maven.surefire.junit4.JUnit4Provider.invoke(JUnit4Provider.java:112)
03-Jul-2019 18:29:36         at java.base/jdk.internal.reflect.NativeMethodAccessorImpl.invoke0(Native Method)
03-Jul-2019 18:29:36         at java.base/jdk.internal.reflect.NativeMethodAccessorImpl.invoke(NativeMethodAccessorImpl.java:62)
03-Jul-2019 18:29:36         at java.base/jdk.internal.reflect.DelegatingMethodAccessorImpl.invoke(DelegatingMethodAccessorImpl.java:43)
03-Jul-2019 18:29:36         at java.base/java.lang.reflect.Method.invoke(Method.java:567)
03-Jul-2019 18:29:36         at org.apache.maven.surefire.util.ReflectionUtils.invokeMethodWithArray(ReflectionUtils.java:189)
03-Jul-2019 18:29:36         at org.apache.maven.surefire.booter.ProviderFactory$ProviderProxy.invoke(ProviderFactory.java:165)
03-Jul-2019 18:29:36         at org.apache.maven.surefire.booter.ProviderFactory.invokeProvider(ProviderFactory.java:85)
03-Jul-2019 18:29:36         at org.apache.maven.surefire.booter.ForkedBooter.runSuitesInProcess(ForkedBooter.java:115)
03-Jul-2019 18:29:36         at org.apache.maven.surefire.booter.ForkedBooter.main(ForkedBooter.java:75)
03-Jul-2019 18:29:36
03-Jul-2019 18:29:36 Running org.springframework.cloud.task.repository.database.support.InvalidPagingQueryProviderTests
03-Jul-2019 18:29:36 Tests run: 1, Failures: 0, Errors: 1, Skipped: 0, Time elapsed: 0.001 sec <<< FAILURE!
03-Jul-2019 18:29:36 org.springframework.cloud.task.repository.database.support.InvalidPagingQueryProviderTests  Time elapsed: 0.001 sec  <<< ERROR!
03-Jul-2019 18:29:36 java.lang.NoClassDefFoundError: Could not initialize class org.junit.internal.runners.ErrorReportingRunner
03-Jul-2019 18:29:36         at org.junit.runners.model.RunnerBuilder.safeRunnerForClass(RunnerBuilder.java:61)
03-Jul-2019 18:29:36         at org.junit.internal.requests.ClassRequest.getRunner(ClassRequest.java:33)
03-Jul-2019 18:29:36         at org.apache.maven.surefire.junit4.JUnit4Provider.execute(JUnit4Provider.java:250)
03-Jul-2019 18:29:36         at org.apache.maven.surefire.junit4.JUnit4Provider.executeTestSet(JUnit4Provider.java:141)
03-Jul-2019 18:29:36         at org.apache.maven.surefire.junit4.JUnit4Provider.invoke(JUnit4Provider.java:112)
03-Jul-2019 18:29:36         at java.base/jdk.internal.reflect.NativeMethodAccessorImpl.invoke0(Native Method)
03-Jul-2019 18:29:36         at java.base/jdk.internal.reflect.NativeMethodAccessorImpl.invoke(NativeMethodAccessorImpl.java:62)
03-Jul-2019 18:29:36         at java.base/jdk.internal.reflect.DelegatingMethodAccessorImpl.invoke(DelegatingMethodAccessorImpl.java:43)
03-Jul-2019 18:29:36         at java.base/java.lang.reflect.Method.invoke(Method.java:567)
03-Jul-2019 18:29:36         at org.apache.maven.surefire.util.ReflectionUtils.invokeMethodWithArray(ReflectionUtils.java:189)
03-Jul-2019 18:29:36         at org.apache.maven.surefire.booter.ProviderFactory$ProviderProxy.invoke(ProviderFactory.java:165)
03-Jul-2019 18:29:36         at org.apache.maven.surefire.booter.ProviderFactory.invokeProvider(ProviderFactory.java:85)
03-Jul-2019 18:29:36         at org.apache.maven.surefire.booter.ForkedBooter.runSuitesInProcess(ForkedBooter.java:115)
03-Jul-2019 18:29:36         at org.apache.maven.surefire.booter.ForkedBooter.main(ForkedBooter.java:75)
03-Jul-2019 18:29:36
03-Jul-2019 18:29:36 Running org.springframework.cloud.task.repository.database.support.FindAllPagingQueryProviderTests
03-Jul-2019 18:29:36 Tests run: 1, Failures: 0, Errors: 1, Skipped: 0, Time elapsed: 0 sec <<< FAILURE!
03-Jul-2019 18:29:36 org.springframework.cloud.task.repository.database.support.FindAllPagingQueryProviderTests  Time elapsed: 0 sec  <<< ERROR!
03-Jul-2019 18:29:36 java.lang.NoClassDefFoundError: Could not initialize class org.junit.internal.runners.ErrorReportingRunner
03-Jul-2019 18:29:36         at org.junit.runners.model.RunnerBuilder.safeRunnerForClass(RunnerBuilder.java:61)
03-Jul-2019 18:29:36         at org.junit.internal.requests.ClassRequest.getRunner(ClassRequest.java:33)
03-Jul-2019 18:29:36         at org.apache.maven.surefire.junit4.JUnit4Provider.execute(JUnit4Provider.java:250)
03-Jul-2019 18:29:36         at org.apache.maven.surefire.junit4.JUnit4Provider.executeTestSet(JUnit4Provider.java:141)
03-Jul-2019 18:29:36         at org.apache.maven.surefire.junit4.JUnit4Provider.invoke(JUnit4Provider.java:112)
03-Jul-2019 18:29:36         at java.base/jdk.internal.reflect.NativeMethodAccessorImpl.invoke0(Native Method)
03-Jul-2019 18:29:36         at java.base/jdk.internal.reflect.NativeMethodAccessorImpl.invoke(NativeMethodAccessorImpl.java:62)
03-Jul-2019 18:29:36         at java.base/jdk.internal.reflect.DelegatingMethodAccessorImpl.invoke(DelegatingMethodAccessorImpl.java:43)
03-Jul-2019 18:29:36         at java.base/java.lang.reflect.Method.invoke(Method.java:567)
03-Jul-2019 18:29:36         at org.apache.maven.surefire.util.ReflectionUtils.invokeMethodWithArray(ReflectionUtils.java:189)
03-Jul-2019 18:29:36         at org.apache.maven.surefire.booter.ProviderFactory$ProviderProxy.invoke(ProviderFactory.java:165)
03-Jul-2019 18:29:36         at org.apache.maven.surefire.booter.ProviderFactory.invokeProvider(ProviderFactory.java:85)
03-Jul-2019 18:29:36         at org.apache.maven.surefire.booter.ForkedBooter.runSuitesInProcess(ForkedBooter.java:115)
03-Jul-2019 18:29:36         at org.apache.maven.surefire.booter.ForkedBooter.main(ForkedBooter.java:75)
03-Jul-2019 18:29:36
03-Jul-2019 18:29:36 Running org.springframework.cloud.task.repository.dao.JdbcTaskExecutionDaoTests
03-Jul-2019 18:29:36 Tests run: 1, Failures: 0, Errors: 1, Skipped: 0, Time elapsed: 0.005 sec <<< FAILURE!
03-Jul-2019 18:29:36 org.springframework.cloud.task.repository.dao.JdbcTaskExecutionDaoTests  Time elapsed: 0.005 sec  <<< ERROR!
03-Jul-2019 18:29:36 java.lang.NoClassDefFoundError: Could not initialize class org.junit.internal.runners.ErrorReportingRunner
03-Jul-2019 18:29:36         at org.junit.runners.model.RunnerBuilder.safeRunnerForClass(RunnerBuilder.java:61)
03-Jul-2019 18:29:36         at org.junit.internal.requests.ClassRequest.getRunner(ClassRequest.java:33)
03-Jul-2019 18:29:36         at org.apache.maven.surefire.junit4.JUnit4Provider.execute(JUnit4Provider.java:250)
03-Jul-2019 18:29:36         at org.apache.maven.surefire.junit4.JUnit4Provider.executeTestSet(JUnit4Provider.java:141)
03-Jul-2019 18:29:36         at org.apache.maven.surefire.junit4.JUnit4Provider.invoke(JUnit4Provider.java:112)
03-Jul-2019 18:29:36         at java.base/jdk.internal.reflect.NativeMethodAccessorImpl.invoke0(Native Method)
03-Jul-2019 18:29:36         at java.base/jdk.internal.reflect.NativeMethodAccessorImpl.invoke(NativeMethodAccessorImpl.java:62)
03-Jul-2019 18:29:36         at java.base/jdk.internal.reflect.DelegatingMethodAccessorImpl.invoke(DelegatingMethodAccessorImpl.java:43)
03-Jul-2019 18:29:36         at java.base/java.lang.reflect.Method.invoke(Method.java:567)
03-Jul-2019 18:29:36         at org.apache.maven.surefire.util.ReflectionUtils.invokeMethodWithArray(ReflectionUtils.java:189)
03-Jul-2019 18:29:36         at org.apache.maven.surefire.booter.ProviderFactory$ProviderProxy.invoke(ProviderFactory.java:165)
03-Jul-2019 18:29:36         at org.apache.maven.surefire.booter.ProviderFactory.invokeProvider(ProviderFactory.java:85)
03-Jul-2019 18:29:36         at org.apache.maven.surefire.booter.ForkedBooter.runSuitesInProcess(ForkedBooter.java:115)
03-Jul-2019 18:29:36         at org.apache.maven.surefire.booter.ForkedBooter.main(ForkedBooter.java:75)
03-Jul-2019 18:29:36
03-Jul-2019 18:29:36 Running org.springframework.cloud.task.repository.dao.MapTaskExecutionDaoTests
03-Jul-2019 18:29:36 Tests run: 1, Failures: 0, Errors: 1, Skipped: 0, Time elapsed: 0 sec <<< FAILURE!
03-Jul-2019 18:29:36 org.springframework.cloud.task.repository.dao.MapTaskExecutionDaoTests  Time elapsed: 0 sec  <<< ERROR!
03-Jul-2019 18:29:36 java.lang.NoClassDefFoundError: Could not initialize class org.junit.internal.runners.ErrorReportingRunner
03-Jul-2019 18:29:36         at org.junit.runners.model.RunnerBuilder.safeRunnerForClass(RunnerBuilder.java:61)
03-Jul-2019 18:29:36         at org.junit.internal.requests.ClassRequest.getRunner(ClassRequest.java:33)
03-Jul-2019 18:29:36         at org.apache.maven.surefire.junit4.JUnit4Provider.execute(JUnit4Provider.java:250)
03-Jul-2019 18:29:36         at org.apache.maven.surefire.junit4.JUnit4Provider.executeTestSet(JUnit4Provider.java:141)
03-Jul-2019 18:29:36         at org.apache.maven.surefire.junit4.JUnit4Provider.invoke(JUnit4Provider.java:112)
03-Jul-2019 18:29:36         at java.base/jdk.internal.reflect.NativeMethodAccessorImpl.invoke0(Native Method)
03-Jul-2019 18:29:36         at java.base/jdk.internal.reflect.NativeMethodAccessorImpl.invoke(NativeMethodAccessorImpl.java:62)
03-Jul-2019 18:29:36         at java.base/jdk.internal.reflect.DelegatingMethodAccessorImpl.invoke(DelegatingMethodAccessorImpl.java:43)
03-Jul-2019 18:29:36         at java.base/java.lang.reflect.Method.invoke(Method.java:567)
03-Jul-2019 18:29:36         at org.apache.maven.surefire.util.ReflectionUtils.invokeMethodWithArray(ReflectionUtils.java:189)
03-Jul-2019 18:29:36         at org.apache.maven.surefire.booter.ProviderFactory$ProviderProxy.invoke(ProviderFactory.java:165)
03-Jul-2019 18:29:36         at org.apache.maven.surefire.booter.ProviderFactory.invokeProvider(ProviderFactory.java:85)
03-Jul-2019 18:29:36         at org.apache.maven.surefire.booter.ForkedBooter.runSuitesInProcess(ForkedBooter.java:115)
03-Jul-2019 18:29:36         at org.apache.maven.surefire.booter.ForkedBooter.main(ForkedBooter.java:75)
03-Jul-2019 18:29:36
03-Jul-2019 18:29:36 Running org.springframework.cloud.task.SimpleTaskAutoConfigurationTests
03-Jul-2019 18:29:36 Tests run: 1, Failures: 0, Errors: 1, Skipped: 0, Time elapsed: 0 sec <<< FAILURE!
03-Jul-2019 18:29:36 org.springframework.cloud.task.SimpleTaskAutoConfigurationTests  Time elapsed: 0 sec  <<< ERROR!
03-Jul-2019 18:29:36 java.lang.NoClassDefFoundError: Could not initialize class org.junit.internal.runners.ErrorReportingRunner
03-Jul-2019 18:29:36         at org.junit.runners.model.RunnerBuilder.safeRunnerForClass(RunnerBuilder.java:61)
03-Jul-2019 18:29:36         at org.junit.internal.requests.ClassRequest.getRunner(ClassRequest.java:33)
03-Jul-2019 18:29:36         at org.apache.maven.surefire.junit4.JUnit4Provider.execute(JUnit4Provider.java:250)
03-Jul-2019 18:29:36         at org.apache.maven.surefire.junit4.JUnit4Provider.executeTestSet(JUnit4Provider.java:141)
03-Jul-2019 18:29:36         at org.apache.maven.surefire.junit4.JUnit4Provider.invoke(JUnit4Provider.java:112)
03-Jul-2019 18:29:36         at java.base/jdk.internal.reflect.NativeMethodAccessorImpl.invoke0(Native Method)
03-Jul-2019 18:29:36         at java.base/jdk.internal.reflect.NativeMethodAccessorImpl.invoke(NativeMethodAccessorImpl.java:62)
03-Jul-2019 18:29:36         at java.base/jdk.internal.reflect.DelegatingMethodAccessorImpl.invoke(DelegatingMethodAccessorImpl.java:43)
03-Jul-2019 18:29:36         at java.base/java.lang.reflect.Method.invoke(Method.java:567)
03-Jul-2019 18:29:36         at org.apache.maven.surefire.util.ReflectionUtils.invokeMethodWithArray(ReflectionUtils.java:189)
03-Jul-2019 18:29:36         at org.apache.maven.surefire.booter.ProviderFactory$ProviderProxy.invoke(ProviderFactory.java:165)
03-Jul-2019 18:29:36         at org.apache.maven.surefire.booter.ProviderFactory.invokeProvider(ProviderFactory.java:85)
03-Jul-2019 18:29:36         at org.apache.maven.surefire.booter.ForkedBooter.runSuitesInProcess(ForkedBooter.java:115)
03-Jul-2019 18:29:36         at org.apache.maven.surefire.booter.ForkedBooter.main(ForkedBooter.java:75)
03-Jul-2019 18:29:36
03-Jul-2019 18:29:36 Running org.springframework.cloud.task.SimpleSingleTaskAutoConfigurationTests
03-Jul-2019 18:29:36 Tests run: 1, Failures: 0, Errors: 1, Skipped: 0, Time elapsed: 0 sec <<< FAILURE!
03-Jul-2019 18:29:36 org.springframework.cloud.task.SimpleSingleTaskAutoConfigurationTests  Time elapsed: 0 sec  <<< ERROR!
03-Jul-2019 18:29:36 java.lang.NoClassDefFoundError: Could not initialize class org.junit.internal.runners.ErrorReportingRunner
03-Jul-2019 18:29:36         at org.junit.runners.model.RunnerBuilder.safeRunnerForClass(RunnerBuilder.java:61)
03-Jul-2019 18:29:36         at org.junit.internal.requests.ClassRequest.getRunner(ClassRequest.java:33)
03-Jul-2019 18:29:36         at org.apache.maven.surefire.junit4.JUnit4Provider.execute(JUnit4Provider.java:250)
03-Jul-2019 18:29:36         at org.apache.maven.surefire.junit4.JUnit4Provider.executeTestSet(JUnit4Provider.java:141)
03-Jul-2019 18:29:36         at org.apache.maven.surefire.junit4.JUnit4Provider.invoke(JUnit4Provider.java:112)
03-Jul-2019 18:29:36         at java.base/jdk.internal.reflect.NativeMethodAccessorImpl.invoke0(Native Method)
03-Jul-2019 18:29:36         at java.base/jdk.internal.reflect.NativeMethodAccessorImpl.invoke(NativeMethodAccessorImpl.java:62)
03-Jul-2019 18:29:36         at java.base/jdk.internal.reflect.DelegatingMethodAccessorImpl.invoke(DelegatingMethodAccessorImpl.java:43)
03-Jul-2019 18:29:36         at java.base/java.lang.reflect.Method.invoke(Method.java:567)
03-Jul-2019 18:29:36         at org.apache.maven.surefire.util.ReflectionUtils.invokeMethodWithArray(ReflectionUtils.java:189)
03-Jul-2019 18:29:36         at org.apache.maven.surefire.booter.ProviderFactory$ProviderProxy.invoke(ProviderFactory.java:165)
03-Jul-2019 18:29:36         at org.apache.maven.surefire.booter.ProviderFactory.invokeProvider(ProviderFactory.java:85)
03-Jul-2019 18:29:36         at org.apache.maven.surefire.booter.ForkedBooter.runSuitesInProcess(ForkedBooter.java:115)
03-Jul-2019 18:29:36         at org.apache.maven.surefire.booter.ForkedBooter.main(ForkedBooter.java:75)
03-Jul-2019 18:29:36
03-Jul-2019 18:29:36 Running org.springframework.cloud.task.configuration.DefaultTaskConfigurerTests
03-Jul-2019 18:29:36 Tests run: 1, Failures: 0, Errors: 1, Skipped: 0, Time elapsed: 0.001 sec <<< FAILURE!
03-Jul-2019 18:29:36 org.springframework.cloud.task.configuration.DefaultTaskConfigurerTests  Time elapsed: 0.001 sec  <<< ERROR!
03-Jul-2019 18:29:36 java.lang.NoClassDefFoundError: Could not initialize class org.junit.internal.runners.ErrorReportingRunner
03-Jul-2019 18:29:36         at org.junit.runners.model.RunnerBuilder.safeRunnerForClass(RunnerBuilder.java:61)
03-Jul-2019 18:29:36         at org.junit.internal.requests.ClassRequest.getRunner(ClassRequest.java:33)
03-Jul-2019 18:29:36         at org.apache.maven.surefire.junit4.JUnit4Provider.execute(JUnit4Provider.java:250)
03-Jul-2019 18:29:36         at org.apache.maven.surefire.junit4.JUnit4Provider.executeTestSet(JUnit4Provider.java:141)
03-Jul-2019 18:29:36         at org.apache.maven.surefire.junit4.JUnit4Provider.invoke(JUnit4Provider.java:112)
03-Jul-2019 18:29:36         at java.base/jdk.internal.reflect.NativeMethodAccessorImpl.invoke0(Native Method)
03-Jul-2019 18:29:36         at java.base/jdk.internal.reflect.NativeMethodAccessorImpl.invoke(NativeMethodAccessorImpl.java:62)
03-Jul-2019 18:29:36         at java.base/jdk.internal.reflect.DelegatingMethodAccessorImpl.invoke(DelegatingMethodAccessorImpl.java:43)
03-Jul-2019 18:29:36         at java.base/java.lang.reflect.Method.invoke(Method.java:567)
03-Jul-2019 18:29:36         at org.apache.maven.surefire.util.ReflectionUtils.invokeMethodWithArray(ReflectionUtils.java:189)
03-Jul-2019 18:29:36         at org.apache.maven.surefire.booter.ProviderFactory$ProviderProxy.invoke(ProviderFactory.java:165)
03-Jul-2019 18:29:36         at org.apache.maven.surefire.booter.ProviderFactory.invokeProvider(ProviderFactory.java:85)
03-Jul-2019 18:29:36         at org.apache.maven.surefire.booter.ForkedBooter.runSuitesInProcess(ForkedBooter.java:115)
03-Jul-2019 18:29:36         at org.apache.maven.surefire.booter.ForkedBooter.main(ForkedBooter.java:75)
03-Jul-2019 18:29:36
03-Jul-2019 18:29:36 Running org.springframework.cloud.task.configuration.TaskPropertiesTests
03-Jul-2019 18:29:36 Tests run: 1, Failures: 0, Errors: 1, Skipped: 0, Time elapsed: 0 sec <<< FAILURE!
03-Jul-2019 18:29:36 org.springframework.cloud.task.configuration.TaskPropertiesTests  Time elapsed: 0 sec  <<< ERROR!
03-Jul-2019 18:29:36 java.lang.NoClassDefFoundError: Could not initialize class org.junit.internal.runners.ErrorReportingRunner
03-Jul-2019 18:29:36         at org.junit.runners.model.RunnerBuilder.safeRunnerForClass(RunnerBuilder.java:61)
03-Jul-2019 18:29:36         at org.junit.internal.requests.ClassRequest.getRunner(ClassRequest.java:33)
03-Jul-2019 18:29:36         at org.apache.maven.surefire.junit4.JUnit4Provider.execute(JUnit4Provider.java:250)
03-Jul-2019 18:29:36         at org.apache.maven.surefire.junit4.JUnit4Provider.executeTestSet(JUnit4Provider.java:141)
03-Jul-2019 18:29:36         at org.apache.maven.surefire.junit4.JUnit4Provider.invoke(JUnit4Provider.java:112)
03-Jul-2019 18:29:36         at java.base/jdk.internal.reflect.NativeMethodAccessorImpl.invoke0(Native Method)
03-Jul-2019 18:29:36         at java.base/jdk.internal.reflect.NativeMethodAccessorImpl.invoke(NativeMethodAccessorImpl.java:62)
03-Jul-2019 18:29:36         at java.base/jdk.internal.reflect.DelegatingMethodAccessorImpl.invoke(DelegatingMethodAccessorImpl.java:43)
03-Jul-2019 18:29:36         at java.base/java.lang.reflect.Method.invoke(Method.java:567)
03-Jul-2019 18:29:36         at org.apache.maven.surefire.util.ReflectionUtils.invokeMethodWithArray(ReflectionUtils.java:189)
03-Jul-2019 18:29:36         at org.apache.maven.surefire.booter.ProviderFactory$ProviderProxy.invoke(ProviderFactory.java:165)
03-Jul-2019 18:29:36         at org.apache.maven.surefire.booter.ProviderFactory.invokeProvider(ProviderFactory.java:85)
03-Jul-2019 18:29:36         at org.apache.maven.surefire.booter.ForkedBooter.runSuitesInProcess(ForkedBooter.java:115)
03-Jul-2019 18:29:36         at org.apache.maven.surefire.booter.ForkedBooter.main(ForkedBooter.java:75)
03-Jul-2019 18:29:36
03-Jul-2019 18:29:36 Running org.springframework.cloud.task.TaskRepositoryInitializerDefaultTaskConfigurerTests
03-Jul-2019 18:29:36 Tests run: 1, Failures: 0, Errors: 1, Skipped: 0, Time elapsed: 0 sec <<< FAILURE!
03-Jul-2019 18:29:36 org.springframework.cloud.task.TaskRepositoryInitializerDefaultTaskConfigurerTests  Time elapsed: 0 sec  <<< ERROR!
03-Jul-2019 18:29:36 java.lang.NoClassDefFoundError: Could not initialize class org.junit.internal.runners.ErrorReportingRunner
03-Jul-2019 18:29:36         at org.junit.runners.model.RunnerBuilder.safeRunnerForClass(RunnerBuilder.java:61)
03-Jul-2019 18:29:36         at org.junit.internal.requests.ClassRequest.getRunner(ClassRequest.java:33)
03-Jul-2019 18:29:36         at org.apache.maven.surefire.junit4.JUnit4Provider.execute(JUnit4Provider.java:250)
03-Jul-2019 18:29:36         at org.apache.maven.surefire.junit4.JUnit4Provider.executeTestSet(JUnit4Provider.java:141)
03-Jul-2019 18:29:36         at org.apache.maven.surefire.junit4.JUnit4Provider.invoke(JUnit4Provider.java:112)
03-Jul-2019 18:29:36         at java.base/jdk.internal.reflect.NativeMethodAccessorImpl.invoke0(Native Method)
03-Jul-2019 18:29:36         at java.base/jdk.internal.reflect.NativeMethodAccessorImpl.invoke(NativeMethodAccessorImpl.java:62)
03-Jul-2019 18:29:36         at java.base/jdk.internal.reflect.DelegatingMethodAccessorImpl.invoke(DelegatingMethodAccessorImpl.java:43)
03-Jul-2019 18:29:36         at java.base/java.lang.reflect.Method.invoke(Method.java:567)
03-Jul-2019 18:29:36         at org.apache.maven.surefire.util.ReflectionUtils.invokeMethodWithArray(ReflectionUtils.java:189)
03-Jul-2019 18:29:36         at org.apache.maven.surefire.booter.ProviderFactory$ProviderProxy.invoke(ProviderFactory.java:165)
03-Jul-2019 18:29:36         at org.apache.maven.surefire.booter.ProviderFactory.invokeProvider(ProviderFactory.java:85)
03-Jul-2019 18:29:36         at org.apache.maven.surefire.booter.ForkedBooter.runSuitesInProcess(ForkedBooter.java:115)
03-Jul-2019 18:29:36         at org.apache.maven.surefire.booter.ForkedBooter.main(ForkedBooter.java:75)
03-Jul-2019 18:29:36
03-Jul-2019 18:29:36
03-Jul-2019 18:29:36 Results :
03-Jul-2019 18:29:36
03-Jul-2019 18:29:36 Tests in error:
03-Jul-2019 18:29:36   org.springframework.cloud.task.listener.TaskLifecycleListenerTests: Could not initialize class org.junit.internal.runners.ErrorReportingRunner
03-Jul-2019 18:29:36   org.springframework.cloud.task.listener.TaskExecutionListenerTests: Could not initialize class org.junit.internal.runners.ErrorReportingRunner
03-Jul-2019 18:29:36   org.springframework.cloud.task.listener.TaskListenerExecutorObjectFactoryTests: Could not initialize class org.junit.internal.runners.ErrorReportingRunner
03-Jul-2019 18:29:36   org.springframework.cloud.task.listener.TaskExceptionTests: Could not initialize class org.junit.internal.runners.ErrorReportingRunner
03-Jul-2019 18:29:36   org.springframework.cloud.task.micrometer.TaskMetricsTests: Could not initialize class org.junit.internal.runners.ErrorReportingRunner
03-Jul-2019 18:29:36   org.springframework.cloud.task.TaskCoreTests: Could not initialize class org.junit.internal.runners.ErrorReportingRunner
03-Jul-2019 18:29:36   org.springframework.cloud.task.TaskRepositoryInitializerNoDataSourceTaskConfigurerTests: Could not initialize class org.junit.internal.runners.ErrorReportingRunner
03-Jul-2019 18:29:36   org.springframework.cloud.task.SimpleSingleTaskAutoConfigurationWithDataSourceTests: Could not initialize class org.junit.internal.runners.ErrorReportingRunner
03-Jul-2019 18:29:36   org.springframework.cloud.task.repository.support.SimpleTaskExplorerTests: Could not initialize class org.junit.internal.runners.ErrorReportingRunner
03-Jul-2019 18:29:36   org.springframework.cloud.task.repository.support.SimpleTaskRepositoryJdbcTests: Could not initialize class org.junit.internal.runners.ErrorReportingRunner
03-Jul-2019 18:29:36   org.springframework.cloud.task.repository.support.SimpleTaskNameResolverTests: Could not initialize class org.junit.internal.runners.ErrorReportingRunner
03-Jul-2019 18:29:36   org.springframework.cloud.task.repository.support.SimpleTaskRepositoryMapTests: Could not initialize class org.junit.internal.runners.ErrorReportingRunner
03-Jul-2019 18:29:36   org.springframework.cloud.task.repository.support.DatabaseTypeTests: Could not initialize class org.junit.internal.runners.ErrorReportingRunner
03-Jul-2019 18:29:36   org.springframework.cloud.task.repository.support.TaskExecutionDaoFactoryBeanTests: Could not initialize class org.junit.internal.runners.ErrorReportingRunner
03-Jul-2019 18:29:36   org.springframework.cloud.task.repository.support.TaskDatabaseInitializerTests: Could not initialize class org.junit.internal.runners.ErrorReportingRunner
03-Jul-2019 18:29:36   org.springframework.cloud.task.repository.database.support.WhereClausePagingQueryProviderTests: Could not initialize class org.junit.internal.runners.ErrorReportingRunner
03-Jul-2019 18:29:36   org.springframework.cloud.task.repository.database.support.SqlPagingQueryProviderFactoryBeanTests: Could not initialize class org.junit.internal.runners.ErrorReportingRunner
03-Jul-2019 18:29:36   org.springframework.cloud.task.repository.database.support.InvalidPagingQueryProviderTests: Could not initialize class org.junit.internal.runners.ErrorReportingRunner
03-Jul-2019 18:29:36   org.springframework.cloud.task.repository.database.support.FindAllPagingQueryProviderTests: Could not initialize class org.junit.internal.runners.ErrorReportingRunner
03-Jul-2019 18:29:36   org.springframework.cloud.task.repository.dao.JdbcTaskExecutionDaoTests: Could not initialize class org.junit.internal.runners.ErrorReportingRunner
03-Jul-2019 18:29:36   org.springframework.cloud.task.repository.dao.MapTaskExecutionDaoTests: Could not initialize class org.junit.internal.runners.ErrorReportingRunner
03-Jul-2019 18:29:36   org.springframework.cloud.task.SimpleTaskAutoConfigurationTests: Could not initialize class org.junit.internal.runners.ErrorReportingRunner
03-Jul-2019 18:29:36   org.springframework.cloud.task.SimpleSingleTaskAutoConfigurationTests: Could not initialize class org.junit.internal.runners.ErrorReportingRunner
03-Jul-2019 18:29:36   org.springframework.cloud.task.configuration.DefaultTaskConfigurerTests: Could not initialize class org.junit.internal.runners.ErrorReportingRunner
03-Jul-2019 18:29:36   org.springframework.cloud.task.configuration.TaskPropertiesTests: Could not initialize class org.junit.internal.runners.ErrorReportingRunner
03-Jul-2019 18:29:36   org.springframework.cloud.task.TaskRepositoryInitializerDefaultTaskConfigurerTests: Could not initialize class org.junit.internal.runners.ErrorReportingRunner
03-Jul-2019 18:29:36
03-Jul-2019 18:29:36 Tests run: 26, Failures: 0, Errors: 26, Skipped: 0
03-Jul-2019 18:29:36
03-Jul-2019 18:29:36 [INFO]
03-Jul-2019 18:29:36 [INFO] ------------------------------------------------------------------------
03-Jul-2019 18:29:36 [INFO] Skipping Spring Cloud Task Build
03-Jul-2019 18:29:36 [INFO] This project has been banned from the build due to previous failures.
03-Jul-2019 18:29:36 [INFO] ------------------------------------------------------------------------
03-Jul-2019 18:29:36 [INFO] ------------------------------------------------------------------------
03-Jul-2019 18:29:36 [INFO] Reactor Summary:
03-Jul-2019 18:29:36 [INFO]
03-Jul-2019 18:29:36 [INFO] Spring Cloud Task Dependencies ..................... SUCCESS [  0.058 s]
03-Jul-2019 18:29:36 [INFO] Spring Cloud Task Build 2.2.0.BUILD-SNAPSHOT ....... SUCCESS [ 30.806 s]
03-Jul-2019 18:29:36 [INFO] Spring Cloud Task Core ............................. FAILURE [  3.027 s]
03-Jul-2019 18:29:36 [INFO] Spring Cloud Task Batch ............................ SKIPPED
03-Jul-2019 18:29:36 [INFO] Spring Cloud Task Stream ........................... SKIPPED
03-Jul-2019 18:29:36 [INFO] Spring Cloud Task Starter .......................... SKIPPED
03-Jul-2019 18:29:36 [INFO] Timestamp Task ..................................... SKIPPED
03-Jul-2019 18:29:36 [INFO] Batch Job Sample Application ....................... SKIPPED
03-Jul-2019 18:29:36 [INFO] Task Sink Sample Application ....................... SKIPPED
03-Jul-2019 18:29:36 [INFO] Task Processor Sample Application .................. SKIPPED
03-Jul-2019 18:29:36 [INFO] Partitioned Batch Job .............................. SKIPPED
03-Jul-2019 18:29:36 [INFO] Task Events ........................................ SKIPPED
03-Jul-2019 18:29:36 [INFO] Batch Events Sample Application .................... SKIPPED
03-Jul-2019 18:29:36 [INFO] Spring Cloud Task JPA Sample Application ........... SKIPPED
03-Jul-2019 18:29:36 [INFO] Spring Cloud Task Multiple DataSources Application . SKIPPED
03-Jul-2019 18:29:36 [INFO] Spring Cloud Task Samples .......................... SKIPPED
03-Jul-2019 18:29:36 [INFO] Spring Cloud Task Integration Tests ................ SKIPPED
03-Jul-2019 18:29:36 [INFO] Spring Cloud Task Docs 2.2.0.BUILD-SNAPSHOT ........ SKIPPED
03-Jul-2019 18:29:36 [INFO] ------------------------------------------------------------------------
03-Jul-2019 18:29:36 [INFO] BUILD FAILURE
03-Jul-2019 18:29:36 [INFO] ------------------------------------------------------------------------
03-Jul-2019 18:29:36 [INFO] Total time: 35.927 s
03-Jul-2019 18:29:36 [INFO] Finished at: 2019-07-03T18:29:36Z
03-Jul-2019 18:29:36 [INFO] ------------------------------------------------------------------------
03-Jul-2019 18:29:36 [ERROR] Failed to execute goal org.apache.maven.plugins:maven-surefire-plugin:2.12.4:test (default-test) on project spring-cloud-task-core: There are test failures.
03-Jul-2019 18:29:36 [ERROR]
03-Jul-2019 18:29:36 [ERROR] Please refer to /opt/bamboo-home/xml-data/build-dir/SCT-SLJ-JOB1/spring-cloud-task-core/target/surefire-reports for the individual test results.
03-Jul-2019 18:29:36 [ERROR] -> [Help 1]
03-Jul-2019 18:29:36 [ERROR]
03-Jul-2019 18:29:36 [ERROR] To see the full stack trace of the errors, re-run Maven with the -e switch.
03-Jul-2019 18:29:36 [ERROR] Re-run Maven using the -X switch to enable full debug logging.
03-Jul-2019 18:29:36 [ERROR]
03-Jul-2019 18:29:36 [ERROR] For more information about the errors and possible solutions, please read the following articles:
03-Jul-2019 18:29:36 [ERROR] [Help 1] http://cwiki.apache.org/confluence/display/MAVEN/MojoFailureException
03-Jul-2019 18:29:36 [ERROR]
03-Jul-2019 18:29:36 [ERROR] After correcting the problems, you can resume the build with the command
03-Jul-2019 18:29:36 [ERROR]   mvn <goals> -rf :spring-cloud-task-core
03-Jul-2019 18:29:36
03-Jul-2019 18:29:36 Failing task since return code of [/opt/jdk-12/bin/java -cp /opt/maven-3.5/boot/plexus-classworlds-2.5.2.jar -Dclassworlds.conf=/tmp/artifactoryM27957949465436987220conf -DbuildInfoConfig.propertiesFile=/tmp/buildInfo2973870828165533238.properties -Xmx2048m -XX:MaxPermSize=2048m -Dmaven.home=/opt/maven-3.5 -Dmaven.multiModuleProjectDirectory=/opt/bamboo-home/xml-data/build-dir/SCT-SLJ-JOB1 org.codehaus.plexus.classworlds.launcher.Launcher clean package -Pfull,skipIntegrationTests javadoc:aggregate -Dartifactory.publish.password=********] was 1 while expected 0
03-Jul-2019 18:29:36 Parsing test results under /opt/bamboo-home/xml-data/build-dir/SCT-SLJ-JOB1...
03-Jul-2019 18:29:37 Finished task 'Build and publish Spring Cloud Task Modules' with result: Failed
03-Jul-2019 18:29:37 Running post build plugin 'Docker Container Cleanup'
03-Jul-2019 18:29:37 Running post build plugin 'NCover Results Collector'
03-Jul-2019 18:29:37 Running post build plugin 'Artifactory Release Management Staging'
03-Jul-2019 18:29:37 Running post build plugin 'Artifactory Build Info Copier'
03-Jul-2019 18:29:37 Running post build plugin 'Artifactory Gradle Properties Info Copier'
03-Jul-2019 18:29:37 Running post build plugin 'Clover Results Collector'
03-Jul-2019 18:29:37 Running post build plugin 'npm Cache Cleanup'
03-Jul-2019 18:29:37 Running post build plugin 'Artifact Copier'
03-Jul-2019 18:29:37 Publishing an artifact: Test Results
03-Jul-2019 18:29:37 Finished publishing of artifact Non required shared artifact: [Test Results], pattern: [**/target/surefire-reports/**/*.*] in 64.12 ms
03-Jul-2019 18:29:37 Successfully removed working directory at '/opt/bamboo-home/xml-data/build-dir/SCT-SLJ-JOB1'
03-Jul-2019 18:29:37 Finalising the build...
03-Jul-2019 18:29:37 Stopping timer.
03-Jul-2019 18:29:37 Build SCT-SLJ-JOB1-55 completed.
03-Jul-2019 18:29:36 Running on server: post build plugin 'NCover Results Collector'
03-Jul-2019 18:29:36 Running on server: post build plugin 'Build Hanging Detection Configuration'
03-Jul-2019 18:29:36 Running on server: post build plugin 'Clover Delta Calculator'
03-Jul-2019 18:29:36 Running on server: post build plugin 'Maven Dependencies Postprocessor'
03-Jul-2019 18:29:36 All post build plugins have finished
03-Jul-2019 18:29:36 Generating build results summary...
03-Jul-2019 18:29:36 Saving build results to disk...
03-Jul-2019 18:29:36 Logging substituted variables...
03-Jul-2019 18:29:36 Indexing build results...
03-Jul-2019 18:29:36 Finished building SCT-SLJ-JOB1-55.