Build #299

Builds the Spring Cloud Task project

Build: #299 failed Rebuilt by Glenn Renfro

Logs

The following logs have been generated by the jobs in this plan.
  • Expand all
  • Collapse all
Job Logs
Collapse Build Spring Cloud Task Project Default Stage Download or View
12-Apr-2017 15:56:37 [INFO] Task Events ........................................ SUCCESS [  1.359 s]
12-Apr-2017 15:56:37 [INFO] Batch Events Sample Application .................... FAILURE [ 14.699 s]
12-Apr-2017 15:56:37 [INFO] Spring Cloud Task Samples .......................... SKIPPED
12-Apr-2017 15:56:37 [INFO] Spring Cloud Task Integration Tests ................ SKIPPED
12-Apr-2017 15:56:37 [INFO] Spring Cloud Task Docs ............................. SKIPPED
12-Apr-2017 15:56:37 [INFO] ------------------------------------------------------------------------
12-Apr-2017 15:56:37 [INFO] BUILD FAILURE
12-Apr-2017 15:56:37 [INFO] ------------------------------------------------------------------------
12-Apr-2017 15:56:37 [INFO] Total time: 03:15 min
12-Apr-2017 15:56:37 [INFO] Finished at: 2017-04-12T15:56:37+00:00
12-Apr-2017 15:56:37 [INFO] Final Memory: 103M/553M
12-Apr-2017 15:56:37 [INFO] ------------------------------------------------------------------------
12-Apr-2017 15:56:37 [ERROR] Failed to execute goal org.apache.maven.plugins:maven-surefire-plugin:2.18.1:test (default-test) on project batch-events: There are test failures.
12-Apr-2017 15:56:37 [ERROR]
12-Apr-2017 15:56:37 [ERROR] Please refer to /opt/bamboo-home/xml-data/build-dir/SCT-STASK-JOB1/spring-cloud-task-samples/batch-events/target/surefire-reports for the individual test results.
12-Apr-2017 15:56:37 [ERROR] -> [Help 1]
12-Apr-2017 15:56:37 [ERROR]
12-Apr-2017 15:56:37 [ERROR] To see the full stack trace of the errors, re-run Maven with the -e switch.
12-Apr-2017 15:56:37 [ERROR] Re-run Maven using the -X switch to enable full debug logging.
12-Apr-2017 15:56:37 [ERROR]
12-Apr-2017 15:56:37 [ERROR] For more information about the errors and possible solutions, please read the following articles:
12-Apr-2017 15:56:37 [ERROR] [Help 1] http://cwiki.apache.org/confluence/display/MAVEN/MojoFailureException
12-Apr-2017 15:56:37 [ERROR]
12-Apr-2017 15:56:37 [ERROR] After correcting the problems, you can resume the build with the command
12-Apr-2017 15:56:37 [ERROR]   mvn <goals> -rf :batch-events