Build #304

Builds the Spring Cloud Task project

Build: #304 failed Changes by Glenn Renfro

Logs

The following logs have been generated by the jobs in this plan.
  • Expand all
  • Collapse all
Job Logs
Collapse Build Spring Cloud Task Project Default Stage Download or View
13-Apr-2017 20:57:49 [INFO] Task Events ........................................ SUCCESS [  1.404 s]
13-Apr-2017 20:57:49 [INFO] Batch Events Sample Application .................... FAILURE [01:09 min]
13-Apr-2017 20:57:49 [INFO] Spring Cloud Task Samples .......................... SKIPPED
13-Apr-2017 20:57:49 [INFO] Spring Cloud Task Integration Tests ................ SKIPPED
13-Apr-2017 20:57:49 [INFO] Spring Cloud Task Docs ............................. SKIPPED
13-Apr-2017 20:57:49 [INFO] ------------------------------------------------------------------------
13-Apr-2017 20:57:49 [INFO] BUILD FAILURE
13-Apr-2017 20:57:49 [INFO] ------------------------------------------------------------------------
13-Apr-2017 20:57:49 [INFO] Total time: 03:24 min
13-Apr-2017 20:57:49 [INFO] Finished at: 2017-04-13T20:57:49+00:00
13-Apr-2017 20:57:49 [INFO] Final Memory: 109M/802M
13-Apr-2017 20:57:49 [INFO] ------------------------------------------------------------------------
13-Apr-2017 20:57:49 [ERROR] Failed to execute goal org.apache.maven.plugins:maven-surefire-plugin:2.18.1:test (default-test) on project batch-events: There are test failures.
13-Apr-2017 20:57:49 [ERROR]
13-Apr-2017 20:57:49 [ERROR] Please refer to /opt/bamboo-home/xml-data/build-dir/SCT-STASK-JOB1/spring-cloud-task-samples/batch-events/target/surefire-reports for the individual test results.
13-Apr-2017 20:57:49 [ERROR] -> [Help 1]
13-Apr-2017 20:57:49 [ERROR]
13-Apr-2017 20:57:49 [ERROR] To see the full stack trace of the errors, re-run Maven with the -e switch.
13-Apr-2017 20:57:49 [ERROR] Re-run Maven using the -X switch to enable full debug logging.
13-Apr-2017 20:57:49 [ERROR]
13-Apr-2017 20:57:49 [ERROR] For more information about the errors and possible solutions, please read the following articles:
13-Apr-2017 20:57:49 [ERROR] [Help 1] http://cwiki.apache.org/confluence/display/MAVEN/MojoFailureException
13-Apr-2017 20:57:49 [ERROR]
13-Apr-2017 20:57:49 [ERROR] After correcting the problems, you can resume the build with the command
13-Apr-2017 20:57:49 [ERROR]   mvn <goals> -rf :batch-events