Build #311

Builds the Spring Cloud Task project

Build: #311 failed Manual run by Glenn Renfro

Logs

The following logs have been generated by the jobs in this plan.
  • Expand all
  • Collapse all
Job Logs
Collapse Build Spring Cloud Task Project Default Stage Download or View
14-Apr-2017 17:24:14 [INFO] Task Events ........................................ SUCCESS [  1.344 s]
14-Apr-2017 17:24:14 [INFO] Batch Events Sample Application .................... FAILURE [01:09 min]
14-Apr-2017 17:24:14 [INFO] Spring Cloud Task Samples .......................... SKIPPED
14-Apr-2017 17:24:14 [INFO] Spring Cloud Task Integration Tests ................ SKIPPED
14-Apr-2017 17:24:14 [INFO] Spring Cloud Task Docs ............................. SKIPPED
14-Apr-2017 17:24:14 [INFO] ------------------------------------------------------------------------
14-Apr-2017 17:24:14 [INFO] BUILD FAILURE
14-Apr-2017 17:24:14 [INFO] ------------------------------------------------------------------------
14-Apr-2017 17:24:14 [INFO] Total time: 03:22 min
14-Apr-2017 17:24:14 [INFO] Finished at: 2017-04-14T17:24:14+00:00
14-Apr-2017 17:24:14 [INFO] Final Memory: 110M/761M
14-Apr-2017 17:24:14 [INFO] ------------------------------------------------------------------------
14-Apr-2017 17:24:14 [ERROR] Failed to execute goal org.apache.maven.plugins:maven-surefire-plugin:2.18.1:test (default-test) on project batch-events: There are test failures.
14-Apr-2017 17:24:14 [ERROR]
14-Apr-2017 17:24:14 [ERROR] Please refer to /opt/bamboo-home/xml-data/build-dir/SCT-STASK-JOB1/spring-cloud-task-samples/batch-events/target/surefire-reports for the individual test results.
14-Apr-2017 17:24:14 [ERROR] -> [Help 1]
14-Apr-2017 17:24:14 [ERROR]
14-Apr-2017 17:24:14 [ERROR] To see the full stack trace of the errors, re-run Maven with the -e switch.
14-Apr-2017 17:24:14 [ERROR] Re-run Maven using the -X switch to enable full debug logging.
14-Apr-2017 17:24:14 [ERROR]
14-Apr-2017 17:24:14 [ERROR] For more information about the errors and possible solutions, please read the following articles:
14-Apr-2017 17:24:14 [ERROR] [Help 1] http://cwiki.apache.org/confluence/display/MAVEN/MojoFailureException
14-Apr-2017 17:24:14 [ERROR]
14-Apr-2017 17:24:14 [ERROR] After correcting the problems, you can resume the build with the command
14-Apr-2017 17:24:14 [ERROR]   mvn <goals> -rf :batch-events