Build #336

Builds the Spring Cloud Task project

Build: #336 failed Changes by Michael Minella and Glenn Renfro

Logs

The following logs have been generated by the jobs in this plan.
  • Expand all
  • Collapse all
Job Logs
Collapse Build Spring Cloud Task Project Default Stage Download or View
13-Jul-2017 00:36:51 [ERROR] [ERROR] Some problems were encountered while processing the POMs:
13-Jul-2017 00:36:51 [FATAL] Non-resolvable parent POM for io.spring.cloud:timestamp-task:2.0.0.BUILD-SNAPSHOT: Could not find artifact org.springframework.boot:spring-boot-starter-parent:pom:2.0.0.BUILD-SNAPSHOT and 'parent.relativePath' points at no local POM @ line 13, column 10
13-Jul-2017 00:36:51 [FATAL] Non-resolvable parent POM for io.spring.cloud:batch-job:2.0.0.BUILD-SNAPSHOT: Could not find artifact org.springframework.boot:spring-boot-starter-parent:pom:2.0.0.BUILD-SNAPSHOT and 'parent.relativePath' points at no local POM @ line 13, column 10
13-Jul-2017 00:36:51 [ERROR] Non-resolvable import POM: Could not find artifact org.springframework.cloud:spring-cloud-task-dependencies:pom:1.2.2.BUILD-SNAPSHOT @ line 41, column 16
13-Jul-2017 00:36:51 [ERROR] 'dependencies.dependency.version' for org.springframework.cloud:spring-cloud-starter-task:jar is missing. @ line 52, column 15
13-Jul-2017 00:36:51 [WARNING] 'build.plugins.plugin.version' for org.codehaus.mojo:build-helper-maven-plugin is missing. @ org.springframework.cloud:spring-cloud-task-docs:[unknown-version], /opt/bamboo-home/xml-data/build-dir/SCT-STASK-JOB1/spring-cloud-task-docs/pom.xml, line 295, column 14
13-Jul-2017 00:36:51 @
13-Jul-2017 00:36:51 [ERROR] The build could not read 3 projects -> [Help 1]
13-Jul-2017 00:36:51 [ERROR]   
13-Jul-2017 00:36:51 [ERROR]   The project io.spring.cloud:timestamp-task:2.0.0.BUILD-SNAPSHOT (/opt/bamboo-home/xml-data/build-dir/SCT-STASK-JOB1/spring-cloud-task-samples/timestamp/pom.xml) has 1 error
13-Jul-2017 00:36:51 [ERROR]     Non-resolvable parent POM for io.spring.cloud:timestamp-task:2.0.0.BUILD-SNAPSHOT: Could not find artifact org.springframework.boot:spring-boot-starter-parent:pom:2.0.0.BUILD-SNAPSHOT and 'parent.relativePath' points at no local POM @ line 13, column 10 -> [Help 2]
13-Jul-2017 00:36:51 [ERROR]   
13-Jul-2017 00:36:51 [ERROR]   The project io.spring.cloud:batch-job:2.0.0.BUILD-SNAPSHOT (/opt/bamboo-home/xml-data/build-dir/SCT-STASK-JOB1/spring-cloud-task-samples/batch-job/pom.xml) has 1 error
13-Jul-2017 00:36:51 [ERROR]     Non-resolvable parent POM for io.spring.cloud:batch-job:2.0.0.BUILD-SNAPSHOT: Could not find artifact org.springframework.boot:spring-boot-starter-parent:pom:2.0.0.BUILD-SNAPSHOT and 'parent.relativePath' points at no local POM @ line 13, column 10 -> [Help 2]
13-Jul-2017 00:36:51 [ERROR]   
13-Jul-2017 00:36:51 [ERROR]   The project io.spring.cloud:jpa-sample:1.2.2.BUILD-SNAPSHOT (/opt/bamboo-home/xml-data/build-dir/SCT-STASK-JOB1/spring-cloud-task-samples/jpa-sample/pom.xml) has 2 errors
13-Jul-2017 00:36:51 [ERROR]     Non-resolvable import POM: Could not find artifact org.springframework.cloud:spring-cloud-task-dependencies:pom:1.2.2.BUILD-SNAPSHOT @ line 41, column 16 -> [Help 2]
13-Jul-2017 00:36:51 [ERROR]     'dependencies.dependency.version' for org.springframework.cloud:spring-cloud-starter-task:jar is missing. @ line 52, column 15
13-Jul-2017 00:36:51 [ERROR]
13-Jul-2017 00:36:51 [ERROR] To see the full stack trace of the errors, re-run Maven with the -e switch.
13-Jul-2017 00:36:51 [ERROR] Re-run Maven using the -X switch to enable full debug logging.
13-Jul-2017 00:36:51 [ERROR]
13-Jul-2017 00:36:51 [ERROR] For more information about the errors and possible solutions, please read the following articles:
13-Jul-2017 00:36:51 [ERROR] [Help 1] http://cwiki.apache.org/confluence/display/MAVEN/ProjectBuildingException
13-Jul-2017 00:36:51 [ERROR] [Help 2] http://cwiki.apache.org/confluence/display/MAVEN/UnresolvableModelException