Build #362

Builds the Spring Cloud Task project

Build: #362 failed Changes by Glenn Renfro

Logs

The following logs have been generated by the jobs in this plan.
  • Expand all
  • Collapse all
Job Logs
Collapse Build Spring Cloud Task Project Default Stage Download or View
25-Jan-2018 19:42:49 [INFO] Task Processor Sample Application .................. SKIPPED
25-Jan-2018 19:42:49 [INFO] Partitioned Batch Job .............................. SKIPPED
25-Jan-2018 19:42:49 [INFO] Task Events ........................................ SKIPPED
25-Jan-2018 19:42:49 [INFO] Batch Events Sample Application .................... SKIPPED
25-Jan-2018 19:42:49 [INFO] Spring Cloud Task JPA Sample Application ........... SKIPPED
25-Jan-2018 19:42:49 [INFO] Spring Cloud Task Samples .......................... SKIPPED
25-Jan-2018 19:42:49 [INFO] Spring Cloud Task Integration Tests ................ SKIPPED
25-Jan-2018 19:42:49 [INFO] Spring Cloud Task Docs ............................. SKIPPED
25-Jan-2018 19:42:49 [INFO] ------------------------------------------------------------------------
25-Jan-2018 19:42:49 [INFO] BUILD FAILURE
25-Jan-2018 19:42:49 [INFO] ------------------------------------------------------------------------
25-Jan-2018 19:42:49 [INFO] Total time: 9.905 s
25-Jan-2018 19:42:49 [INFO] Finished at: 2018-01-25T19:42:49Z
25-Jan-2018 19:42:50 [INFO] Final Memory: 72M/323M
25-Jan-2018 19:42:50 [INFO] ------------------------------------------------------------------------
25-Jan-2018 19:42:50 [ERROR] Failed to execute goal on project spring-cloud-task-core: Could not resolve dependencies for project org.springframework.cloud:spring-cloud-task-core:jar:2.0.0.BUILD-SNAPSHOT: The following artifacts could not be resolved: org.springframework.boot:spring-boot-autoconfigure:jar:2.0.0.BUILD-SNAPSHOT, org.springframework.boot:spring-boot:jar:2.0.0.BUILD-SNAPSHOT, org.springframework.boot:spring-boot-starter-test:jar:2.0.0.BUILD-SNAPSHOT, org.springframework.boot:spring-boot-starter:jar:2.0.0.BUILD-SNAPSHOT, org.springframework.boot:spring-boot-starter-logging:jar:2.0.0.BUILD-SNAPSHOT, org.springframework.boot:spring-boot-configuration-processor:jar:2.0.0.BUILD-SNAPSHOT: Could not find artifact org.springframework.boot:spring-boot-autoconfigure:jar:2.0.0.BUILD-20180124.225756-411 in spring-snapshots (https://repo.spring.io/libs-snapshot-local) -> [Help 1]
25-Jan-2018 19:42:50 [ERROR]
25-Jan-2018 19:42:50 [ERROR] To see the full stack trace of the errors, re-run Maven with the -e switch.
25-Jan-2018 19:42:50 [ERROR] Re-run Maven using the -X switch to enable full debug logging.
25-Jan-2018 19:42:50 [ERROR]
25-Jan-2018 19:42:50 [ERROR] For more information about the errors and possible solutions, please read the following articles:
25-Jan-2018 19:42:50 [ERROR] [Help 1] http://cwiki.apache.org/confluence/display/MAVEN/DependencyResolutionException
25-Jan-2018 19:42:50 [ERROR]
25-Jan-2018 19:42:50 [ERROR] After correcting the problems, you can resume the build with the command
25-Jan-2018 19:42:50 [ERROR]   mvn <goals> -rf :spring-cloud-task-core