Build #365

Builds the Spring Cloud Task project

Build: #365 failed Manual run by Glenn Renfro

Logs

The following logs have been generated by the jobs in this plan.
  • Expand all
  • Collapse all
Job Logs
Collapse Build Spring Cloud Task Project Default Stage Download or View
26-Jan-2018 22:59:27 [INFO] Batch Events Sample Application .................... SKIPPED
26-Jan-2018 22:59:27 [INFO] Spring Cloud Task JPA Sample Application ........... SKIPPED
26-Jan-2018 22:59:27 [INFO] Spring Cloud Task Samples .......................... SKIPPED
26-Jan-2018 22:59:27 [INFO] Spring Cloud Task Integration Tests ................ SKIPPED
26-Jan-2018 22:59:27 [INFO] Spring Cloud Task Docs ............................. SKIPPED
26-Jan-2018 22:59:27 [INFO] ------------------------------------------------------------------------
26-Jan-2018 22:59:27 [INFO] BUILD FAILURE
26-Jan-2018 22:59:27 [INFO] ------------------------------------------------------------------------
26-Jan-2018 22:59:27 [INFO] Total time: 02:18 min
26-Jan-2018 22:59:27 [INFO] Finished at: 2018-01-26T22:59:27Z
26-Jan-2018 22:59:28 [INFO] Final Memory: 94M/556M
26-Jan-2018 22:59:28 [INFO] ------------------------------------------------------------------------
26-Jan-2018 22:59:28 [ERROR] Failed to execute goal org.apache.maven.plugins:maven-surefire-plugin:2.12.4:test (default-test) on project spring-cloud-task-stream: There are test failures.
26-Jan-2018 22:59:28 [ERROR]
26-Jan-2018 22:59:28 [ERROR] Please refer to /opt/bamboo-home/xml-data/build-dir/SCT-STASK-JOB1/spring-cloud-task-stream/target/surefire-reports for the individual test results.
26-Jan-2018 22:59:28 [ERROR] -> [Help 1]
26-Jan-2018 22:59:28 [ERROR]
26-Jan-2018 22:59:28 [ERROR] To see the full stack trace of the errors, re-run Maven with the -e switch.
26-Jan-2018 22:59:28 [ERROR] Re-run Maven using the -X switch to enable full debug logging.
26-Jan-2018 22:59:28 [ERROR]
26-Jan-2018 22:59:28 [ERROR] For more information about the errors and possible solutions, please read the following articles:
26-Jan-2018 22:59:28 [ERROR] [Help 1] http://cwiki.apache.org/confluence/display/MAVEN/MojoFailureException
26-Jan-2018 22:59:28 [ERROR]
26-Jan-2018 22:59:28 [ERROR] After correcting the problems, you can resume the build with the command
26-Jan-2018 22:59:28 [ERROR]   mvn <goals> -rf :spring-cloud-task-stream