Build #479

Builds the Spring Cloud Task project

Build: #479 failed Manual run by Glenn Renfro

Logs

The following logs have been generated by the jobs in this plan.
  • Expand all
  • Collapse all
Job Logs
Collapse Build Spring Cloud Task Project Default Stage Download or View
21-May-2019 14:38:24 [INFO] Spring Cloud Task Multiple DataSources Application . SKIPPED
21-May-2019 14:38:24 [INFO] Spring Cloud Task Samples .......................... SKIPPED
21-May-2019 14:38:24 [INFO] Spring Cloud Task Integration Tests ................ SKIPPED
21-May-2019 14:38:24 [INFO] Spring Cloud Task Docs ............................. SKIPPED
21-May-2019 14:38:24 [INFO] ------------------------------------------------------------------------
21-May-2019 14:38:24 [INFO] BUILD FAILURE
21-May-2019 14:38:24 [INFO] ------------------------------------------------------------------------
21-May-2019 14:38:24 [INFO] Total time: 03:57 min
21-May-2019 14:38:24 [INFO] Finished at: 2019-05-21T14:38:24Z
21-May-2019 14:38:25 [INFO] Final Memory: 532M/1476M
21-May-2019 14:38:25 [INFO] ------------------------------------------------------------------------
21-May-2019 14:38:25 [ERROR] Failed to execute goal org.apache.maven.plugins:maven-surefire-plugin:2.22.2:test (default-test) on project batch-events: There are test failures.
21-May-2019 14:38:25 [ERROR]
21-May-2019 14:38:25 [ERROR] Please refer to /opt/bamboo-home/xml-data/build-dir/SCT-STASK-JOB1/spring-cloud-task-samples/batch-events/target/surefire-reports for the individual test results.
21-May-2019 14:38:25 [ERROR] Please refer to dump files (if any exist) [date].dump, [date]-jvmRun[N].dump and [date].dumpstream.
21-May-2019 14:38:25 [ERROR] -> [Help 1]
21-May-2019 14:38:25 [ERROR]
21-May-2019 14:38:25 [ERROR] To see the full stack trace of the errors, re-run Maven with the -e switch.
21-May-2019 14:38:25 [ERROR] Re-run Maven using the -X switch to enable full debug logging.
21-May-2019 14:38:25 [ERROR]
21-May-2019 14:38:25 [ERROR] For more information about the errors and possible solutions, please read the following articles:
21-May-2019 14:38:25 [ERROR] [Help 1] http://cwiki.apache.org/confluence/display/MAVEN/MojoFailureException
21-May-2019 14:38:25 [ERROR]
21-May-2019 14:38:25 [ERROR] After correcting the problems, you can resume the build with the command
21-May-2019 14:38:25 [ERROR]   mvn <goals> -rf :batch-events