Build #493

Builds the Spring Cloud Task project

Build: #493 failed Scheduled

Build result summary

Details

Completed
Duration
5 minutes
Labels
None
Agent
bamboo-16.af.pivotal.io
Revision
320a864112406dfbefa743c30519a8b9ab7913f8 320a864112406dfbefa743c30519a8b9ab7913f8
Total tests
321
Fixed in
#495 (Scheduled)

Tests

Responsible

No one has taken responsibility for this failure

Tests

New test failures 16
Status Test View job Duration
Collapse Failed JobExecutionEventTests testDisabledItemProcessListener History
Build Spring Cloud Task Project < 1 sec
java.lang.IllegalStateException: Unstarted application context org.springframework.boot.test.context.assertj.AssertableApplicationContext[startupFailure=org.springframework.beans.factory.BeanCreationException] failed to start
	at org.springframework.boot.test.context.assertj.AssertProviderApplicationContextInvocationHandler.getStartedApplicationContext(AssertProviderApplicationContextInvocationHandler.java:156)
	at org.springframework.boot.test.context.assertj.AssertProviderApplicationContextInvocationHandler.invokeApplicationContextMethod(AssertProviderApplicationContextInvocationHandler.java:147)
	at org.springframework.boot.test.context.assertj.AssertProviderApplicationContextInvocationHandler.invoke(AssertProviderApplicationContextInvocationHandler.java:85)
	at com.sun.proxy.$Proxy67.getBean(Unknown Source)
	at org.springframework.cloud.task.batch.listener.JobExecutionEventTests.lambda$testDisabledConfiguration$1(JobExecutionEventTests.java:369)
	at org.springframework.boot.test.context.runner.AbstractApplicationContextRunner.accept(AbstractApplicationContextRunner.java:424)
	at org.springframework.boot.test.context.runner.AbstractApplicationContextRunner.lambda$null$0(AbstractApplicationContextRunner.java:359)
(88 more lines...)
Collapse Failed JobExecutionEventTests testDisabledItemReadListener History
Build Spring Cloud Task Project < 1 sec
java.lang.IllegalStateException: Unstarted application context org.springframework.boot.test.context.assertj.AssertableApplicationContext[startupFailure=org.springframework.beans.factory.BeanCreationException] failed to start
	at org.springframework.boot.test.context.assertj.AssertProviderApplicationContextInvocationHandler.getStartedApplicationContext(AssertProviderApplicationContextInvocationHandler.java:156)
	at org.springframework.boot.test.context.assertj.AssertProviderApplicationContextInvocationHandler.invokeApplicationContextMethod(AssertProviderApplicationContextInvocationHandler.java:147)
	at org.springframework.boot.test.context.assertj.AssertProviderApplicationContextInvocationHandler.invoke(AssertProviderApplicationContextInvocationHandler.java:85)
	at com.sun.proxy.$Proxy67.getBean(Unknown Source)
	at org.springframework.cloud.task.batch.listener.JobExecutionEventTests.lambda$testDisabledConfiguration$1(JobExecutionEventTests.java:369)
	at org.springframework.boot.test.context.runner.AbstractApplicationContextRunner.accept(AbstractApplicationContextRunner.java:424)
	at org.springframework.boot.test.context.runner.AbstractApplicationContextRunner.lambda$null$0(AbstractApplicationContextRunner.java:359)
(88 more lines...)
Collapse Failed JobExecutionEventTests testOrderConfiguration History
Build Spring Cloud Task Project < 1 sec
java.lang.IllegalStateException: Unstarted application context org.springframework.boot.test.context.assertj.AssertableApplicationContext[startupFailure=org.springframework.beans.factory.BeanCreationException] failed to start
	at org.springframework.boot.test.context.assertj.AssertProviderApplicationContextInvocationHandler.getStartedApplicationContext(AssertProviderApplicationContextInvocationHandler.java:156)
	at org.springframework.boot.test.context.assertj.AssertProviderApplicationContextInvocationHandler.invokeApplicationContextMethod(AssertProviderApplicationContextInvocationHandler.java:147)
	at org.springframework.boot.test.context.assertj.AssertProviderApplicationContextInvocationHandler.invoke(AssertProviderApplicationContextInvocationHandler.java:85)
	at com.sun.proxy.$Proxy67.getBean(Unknown Source)
	at org.springframework.cloud.task.batch.listener.JobExecutionEventTests.lambda$testOrderConfiguration$0(JobExecutionEventTests.java:334)
	at org.springframework.boot.test.context.runner.AbstractApplicationContextRunner.accept(AbstractApplicationContextRunner.java:424)
	at org.springframework.boot.test.context.runner.AbstractApplicationContextRunner.lambda$null$0(AbstractApplicationContextRunner.java:359)
(87 more lines...)
Collapse Failed JobExecutionEventTests testDisabledItemWriteListener History
Build Spring Cloud Task Project < 1 sec
java.lang.IllegalStateException: Unstarted application context org.springframework.boot.test.context.assertj.AssertableApplicationContext[startupFailure=org.springframework.beans.factory.BeanCreationException] failed to start
	at org.springframework.boot.test.context.assertj.AssertProviderApplicationContextInvocationHandler.getStartedApplicationContext(AssertProviderApplicationContextInvocationHandler.java:156)
	at org.springframework.boot.test.context.assertj.AssertProviderApplicationContextInvocationHandler.invokeApplicationContextMethod(AssertProviderApplicationContextInvocationHandler.java:147)
	at org.springframework.boot.test.context.assertj.AssertProviderApplicationContextInvocationHandler.invoke(AssertProviderApplicationContextInvocationHandler.java:85)
	at com.sun.proxy.$Proxy67.getBean(Unknown Source)
	at org.springframework.cloud.task.batch.listener.JobExecutionEventTests.lambda$testDisabledConfiguration$1(JobExecutionEventTests.java:369)
	at org.springframework.boot.test.context.runner.AbstractApplicationContextRunner.accept(AbstractApplicationContextRunner.java:424)
	at org.springframework.boot.test.context.runner.AbstractApplicationContextRunner.lambda$null$0(AbstractApplicationContextRunner.java:359)
(88 more lines...)
Collapse Failed JobExecutionEventTests testDisabledSkipEventListener History
Build Spring Cloud Task Project < 1 sec
java.lang.IllegalStateException: Unstarted application context org.springframework.boot.test.context.assertj.AssertableApplicationContext[startupFailure=org.springframework.beans.factory.BeanCreationException] failed to start
	at org.springframework.boot.test.context.assertj.AssertProviderApplicationContextInvocationHandler.getStartedApplicationContext(AssertProviderApplicationContextInvocationHandler.java:156)
	at org.springframework.boot.test.context.assertj.AssertProviderApplicationContextInvocationHandler.invokeApplicationContextMethod(AssertProviderApplicationContextInvocationHandler.java:147)
	at org.springframework.boot.test.context.assertj.AssertProviderApplicationContextInvocationHandler.invoke(AssertProviderApplicationContextInvocationHandler.java:85)
	at com.sun.proxy.$Proxy67.getBean(Unknown Source)
	at org.springframework.cloud.task.batch.listener.JobExecutionEventTests.lambda$testDisabledConfiguration$1(JobExecutionEventTests.java:369)
	at org.springframework.boot.test.context.runner.AbstractApplicationContextRunner.accept(AbstractApplicationContextRunner.java:424)
	at org.springframework.boot.test.context.runner.AbstractApplicationContextRunner.lambda$null$0(AbstractApplicationContextRunner.java:359)
(88 more lines...)
Collapse Failed JobExecutionEventTests testDisabledStepExecutionListener History
Build Spring Cloud Task Project < 1 sec
java.lang.IllegalStateException: Unstarted application context org.springframework.boot.test.context.assertj.AssertableApplicationContext[startupFailure=org.springframework.beans.factory.BeanCreationException] failed to start
	at org.springframework.boot.test.context.assertj.AssertProviderApplicationContextInvocationHandler.getStartedApplicationContext(AssertProviderApplicationContextInvocationHandler.java:156)
	at org.springframework.boot.test.context.assertj.AssertProviderApplicationContextInvocationHandler.invokeApplicationContextMethod(AssertProviderApplicationContextInvocationHandler.java:147)
	at org.springframework.boot.test.context.assertj.AssertProviderApplicationContextInvocationHandler.invoke(AssertProviderApplicationContextInvocationHandler.java:85)
	at com.sun.proxy.$Proxy67.getBean(Unknown Source)
	at org.springframework.cloud.task.batch.listener.JobExecutionEventTests.lambda$testDisabledConfiguration$1(JobExecutionEventTests.java:369)
	at org.springframework.boot.test.context.runner.AbstractApplicationContextRunner.accept(AbstractApplicationContextRunner.java:424)
	at org.springframework.boot.test.context.runner.AbstractApplicationContextRunner.lambda$null$0(AbstractApplicationContextRunner.java:359)
(88 more lines...)
Collapse Failed JobExecutionEventTests testDisabledChunkListener History
Build Spring Cloud Task Project < 1 sec
java.lang.IllegalStateException: Unstarted application context org.springframework.boot.test.context.assertj.AssertableApplicationContext[startupFailure=org.springframework.beans.factory.BeanCreationException] failed to start
	at org.springframework.boot.test.context.assertj.AssertProviderApplicationContextInvocationHandler.getStartedApplicationContext(AssertProviderApplicationContextInvocationHandler.java:156)
	at org.springframework.boot.test.context.assertj.AssertProviderApplicationContextInvocationHandler.invokeApplicationContextMethod(AssertProviderApplicationContextInvocationHandler.java:147)
	at org.springframework.boot.test.context.assertj.AssertProviderApplicationContextInvocationHandler.invoke(AssertProviderApplicationContextInvocationHandler.java:85)
	at com.sun.proxy.$Proxy67.getBean(Unknown Source)
	at org.springframework.cloud.task.batch.listener.JobExecutionEventTests.lambda$testDisabledConfiguration$1(JobExecutionEventTests.java:369)
	at org.springframework.boot.test.context.runner.AbstractApplicationContextRunner.accept(AbstractApplicationContextRunner.java:424)
	at org.springframework.boot.test.context.runner.AbstractApplicationContextRunner.lambda$null$0(AbstractApplicationContextRunner.java:359)
(88 more lines...)
Collapse Failed JobExecutionEventTests testDefaultConfiguration History
Build Spring Cloud Task Project < 1 sec
java.lang.IllegalStateException: Unstarted application context org.springframework.boot.test.context.assertj.AssertableApplicationContext[startupFailure=org.springframework.beans.factory.BeanCreationException] failed to start
	at org.springframework.boot.test.context.assertj.AssertProviderApplicationContextInvocationHandler.getStartedApplicationContext(AssertProviderApplicationContextInvocationHandler.java:156)
	at org.springframework.boot.test.context.assertj.AssertProviderApplicationContextInvocationHandler.invokeApplicationContextMethod(AssertProviderApplicationContextInvocationHandler.java:147)
	at org.springframework.boot.test.context.assertj.AssertProviderApplicationContextInvocationHandler.invoke(AssertProviderApplicationContextInvocationHandler.java:85)
	at com.sun.proxy.$Proxy67.getBean(Unknown Source)
	at org.springframework.cloud.task.batch.listener.JobExecutionEventTests.lambda$testDisabledConfiguration$1(JobExecutionEventTests.java:369)
	at org.springframework.boot.test.context.runner.AbstractApplicationContextRunner.accept(AbstractApplicationContextRunner.java:424)
	at org.springframework.boot.test.context.runner.AbstractApplicationContextRunner.lambda$null$0(AbstractApplicationContextRunner.java:359)
(88 more lines...)
Collapse Failed JobExecutionEventTests testDisabledJobExecutionListener History
Build Spring Cloud Task Project < 1 sec
java.lang.IllegalStateException: Unstarted application context org.springframework.boot.test.context.assertj.AssertableApplicationContext[startupFailure=org.springframework.beans.factory.BeanCreationException] failed to start
	at org.springframework.boot.test.context.assertj.AssertProviderApplicationContextInvocationHandler.getStartedApplicationContext(AssertProviderApplicationContextInvocationHandler.java:156)
	at org.springframework.boot.test.context.assertj.AssertProviderApplicationContextInvocationHandler.invokeApplicationContextMethod(AssertProviderApplicationContextInvocationHandler.java:147)
	at org.springframework.boot.test.context.assertj.AssertProviderApplicationContextInvocationHandler.invoke(AssertProviderApplicationContextInvocationHandler.java:85)
	at com.sun.proxy.$Proxy67.getBean(Unknown Source)
	at org.springframework.cloud.task.batch.listener.JobExecutionEventTests.lambda$testDisabledConfiguration$1(JobExecutionEventTests.java:359)
	at org.springframework.boot.test.context.runner.AbstractApplicationContextRunner.accept(AbstractApplicationContextRunner.java:424)
	at org.springframework.boot.test.context.runner.AbstractApplicationContextRunner.lambda$null$0(AbstractApplicationContextRunner.java:359)
(88 more lines...)
Collapse Failed TaskBatchEventListenerBeanPostProcessorTests testPostProcessor History
Build Spring Cloud Task Project < 1 sec
java.lang.IllegalStateException: Failed to load ApplicationContext
	at org.springframework.test.context.cache.DefaultCacheAwareContextLoaderDelegate.loadContext(DefaultCacheAwareContextLoaderDelegate.java:132)
	at org.springframework.test.context.support.DefaultTestContext.getApplicationContext(DefaultTestContext.java:122)
	at org.springframework.boot.test.mock.mockito.MockitoTestExecutionListener.postProcessFields(MockitoTestExecutionListener.java:95)
	at org.springframework.boot.test.mock.mockito.MockitoTestExecutionListener.injectFields(MockitoTestExecutionListener.java:79)
	at org.springframework.boot.test.mock.mockito.MockitoTestExecutionListener.prepareTestInstance(MockitoTestExecutionListener.java:54)
	at org.springframework.test.context.TestContextManager.prepareTestInstance(TestContextManager.java:244)
	at org.springframework.test.context.junit4.SpringJUnit4ClassRunner.createTest(SpringJUnit4ClassRunner.java:227)
(77 more lines...)
Collapse Failed TaskLauncherSinkTests testNoRun History
Build Spring Cloud Task Project < 1 sec
java.lang.IllegalStateException: Failed to load ApplicationContext
	at org.springframework.test.context.cache.DefaultCacheAwareContextLoaderDelegate.loadContext(DefaultCacheAwareContextLoaderDelegate.java:132)
	at org.springframework.test.context.support.DefaultTestContext.getApplicationContext(DefaultTestContext.java:122)
	at org.springframework.test.context.support.DependencyInjectionTestExecutionListener.injectDependencies(DependencyInjectionTestExecutionListener.java:118)
	at org.springframework.test.context.support.DependencyInjectionTestExecutionListener.prepareTestInstance(DependencyInjectionTestExecutionListener.java:83)
	at org.springframework.boot.test.autoconfigure.SpringBootDependencyInjectionTestExecutionListener.prepareTestInstance(SpringBootDependencyInjectionTestExecutionListener.java:43)
	at org.springframework.test.context.TestContextManager.prepareTestInstance(TestContextManager.java:244)
	at org.springframework.test.context.junit4.SpringJUnit4ClassRunner.createTest(SpringJUnit4ClassRunner.java:227)
(101 more lines...)
Collapse Failed TaskLauncherSinkTests testSuccessWithAppName History
Build Spring Cloud Task Project < 1 sec
java.lang.IllegalStateException: Failed to load ApplicationContext
	at org.springframework.test.context.cache.DefaultCacheAwareContextLoaderDelegate.loadContext(DefaultCacheAwareContextLoaderDelegate.java:132)
	at org.springframework.test.context.support.DefaultTestContext.getApplicationContext(DefaultTestContext.java:122)
	at org.springframework.test.context.support.DependencyInjectionTestExecutionListener.injectDependencies(DependencyInjectionTestExecutionListener.java:118)
	at org.springframework.test.context.support.DependencyInjectionTestExecutionListener.prepareTestInstance(DependencyInjectionTestExecutionListener.java:83)
	at org.springframework.boot.test.autoconfigure.SpringBootDependencyInjectionTestExecutionListener.prepareTestInstance(SpringBootDependencyInjectionTestExecutionListener.java:43)
	at org.springframework.test.context.TestContextManager.prepareTestInstance(TestContextManager.java:244)
	at org.springframework.test.context.junit4.SpringJUnit4ClassRunner.createTest(SpringJUnit4ClassRunner.java:227)
(101 more lines...)
Collapse Failed TaskLauncherSinkTests testSuccessWithParams History
Build Spring Cloud Task Project < 1 sec
java.lang.IllegalStateException: Failed to load ApplicationContext
	at org.springframework.test.context.cache.DefaultCacheAwareContextLoaderDelegate.loadContext(DefaultCacheAwareContextLoaderDelegate.java:132)
	at org.springframework.test.context.support.DefaultTestContext.getApplicationContext(DefaultTestContext.java:122)
	at org.springframework.test.context.support.DependencyInjectionTestExecutionListener.injectDependencies(DependencyInjectionTestExecutionListener.java:118)
	at org.springframework.test.context.support.DependencyInjectionTestExecutionListener.prepareTestInstance(DependencyInjectionTestExecutionListener.java:83)
	at org.springframework.boot.test.autoconfigure.SpringBootDependencyInjectionTestExecutionListener.prepareTestInstance(SpringBootDependencyInjectionTestExecutionListener.java:43)
	at org.springframework.test.context.TestContextManager.prepareTestInstance(TestContextManager.java:244)
	at org.springframework.test.context.junit4.SpringJUnit4ClassRunner.createTest(SpringJUnit4ClassRunner.java:227)
(101 more lines...)
Collapse Failed TaskLauncherSinkTests testSuccessNoParams History
Build Spring Cloud Task Project < 1 sec
java.lang.IllegalStateException: Failed to load ApplicationContext
	at org.springframework.test.context.cache.DefaultCacheAwareContextLoaderDelegate.loadContext(DefaultCacheAwareContextLoaderDelegate.java:132)
	at org.springframework.test.context.support.DefaultTestContext.getApplicationContext(DefaultTestContext.java:122)
	at org.springframework.test.context.support.DependencyInjectionTestExecutionListener.injectDependencies(DependencyInjectionTestExecutionListener.java:118)
	at org.springframework.test.context.support.DependencyInjectionTestExecutionListener.prepareTestInstance(DependencyInjectionTestExecutionListener.java:83)
	at org.springframework.boot.test.autoconfigure.SpringBootDependencyInjectionTestExecutionListener.prepareTestInstance(SpringBootDependencyInjectionTestExecutionListener.java:43)
	at org.springframework.test.context.TestContextManager.prepareTestInstance(TestContextManager.java:244)
	at org.springframework.test.context.junit4.SpringJUnit4ClassRunner.createTest(SpringJUnit4ClassRunner.java:227)
(101 more lines...)
Collapse Failed TaskLauncherSinkTests testInvalidJar History
Build Spring Cloud Task Project < 1 sec
java.lang.IllegalStateException: Failed to load ApplicationContext
	at org.springframework.test.context.cache.DefaultCacheAwareContextLoaderDelegate.loadContext(DefaultCacheAwareContextLoaderDelegate.java:132)
	at org.springframework.test.context.support.DefaultTestContext.getApplicationContext(DefaultTestContext.java:122)
	at org.springframework.test.context.support.DependencyInjectionTestExecutionListener.injectDependencies(DependencyInjectionTestExecutionListener.java:118)
	at org.springframework.test.context.support.DependencyInjectionTestExecutionListener.prepareTestInstance(DependencyInjectionTestExecutionListener.java:83)
	at org.springframework.boot.test.autoconfigure.SpringBootDependencyInjectionTestExecutionListener.prepareTestInstance(SpringBootDependencyInjectionTestExecutionListener.java:43)
	at org.springframework.test.context.TestContextManager.prepareTestInstance(TestContextManager.java:244)
	at org.springframework.test.context.junit4.SpringJUnit4ClassRunner.createTest(SpringJUnit4ClassRunner.java:227)
(101 more lines...)
Collapse Failed TaskEventTests testDefaultConfiguration History
Build Spring Cloud Task Project 2 secs
java.lang.IllegalStateException: Unstarted application context org.springframework.boot.test.context.assertj.AssertableApplicationContext[startupFailure=org.springframework.beans.factory.BeanCreationException] failed to start
	at org.springframework.boot.test.context.assertj.AssertProviderApplicationContextInvocationHandler.getStartedApplicationContext(AssertProviderApplicationContextInvocationHandler.java:156)
	at org.springframework.boot.test.context.assertj.AssertProviderApplicationContextInvocationHandler.invokeApplicationContextMethod(AssertProviderApplicationContextInvocationHandler.java:147)
	at org.springframework.boot.test.context.assertj.AssertProviderApplicationContextInvocationHandler.invoke(AssertProviderApplicationContextInvocationHandler.java:85)
	at com.sun.proxy.$Proxy67.getBean(Unknown Source)
	at org.springframework.cloud.task.listener.TaskEventTests.lambda$testDefaultConfiguration$0(TaskEventTests.java:58)
	at org.springframework.boot.test.context.runner.AbstractApplicationContextRunner.accept(AbstractApplicationContextRunner.java:424)
	at org.springframework.boot.test.context.runner.AbstractApplicationContextRunner.lambda$null$0(AbstractApplicationContextRunner.java:359)
(86 more lines...)