Build #597

Builds the Spring Cloud Task project

Build: #597 failed Scheduled

Logs

The following logs have been generated by the jobs in this plan.
  • Expand all
  • Collapse all
Job Logs
Collapse Build Spring Cloud Task Project Default Stage Download or View
15-Sep-2019 03:47:58 [INFO] Spring Cloud Task JPA Sample Application ........... SKIPPED
15-Sep-2019 03:47:58 [INFO] Spring Cloud Task Multiple DataSources Application . SKIPPED
15-Sep-2019 03:47:58 [INFO] Spring Cloud Task Samples .......................... SKIPPED
15-Sep-2019 03:47:58 [INFO] Spring Cloud Task Integration Tests ................ SKIPPED
15-Sep-2019 03:47:58 [INFO] Spring Cloud Task Docs 2.2.0.BUILD-SNAPSHOT ........ SKIPPED
15-Sep-2019 03:47:58 [INFO] ------------------------------------------------------------------------
15-Sep-2019 03:47:58 [INFO] BUILD FAILURE
15-Sep-2019 03:47:58 [INFO] ------------------------------------------------------------------------
15-Sep-2019 03:47:58 [INFO] Total time: 02:44 min
15-Sep-2019 03:47:58 [INFO] Finished at: 2019-09-15T03:47:58Z
15-Sep-2019 03:47:58 [INFO] ------------------------------------------------------------------------
15-Sep-2019 03:47:58 [ERROR] Failed to execute goal org.apache.maven.plugins:maven-surefire-plugin:2.22.2:test (default-test) on project spring-cloud-task-stream: There are test failures.
15-Sep-2019 03:47:58 [ERROR]
15-Sep-2019 03:47:58 [ERROR] Please refer to /opt/bamboo-home/xml-data/build-dir/SCT-STASK-JOB1/spring-cloud-task-stream/target/surefire-reports for the individual test results.
15-Sep-2019 03:47:58 [ERROR] Please refer to dump files (if any exist) [date].dump, [date]-jvmRun[N].dump and [date].dumpstream.
15-Sep-2019 03:47:58 [ERROR] -> [Help 1]
15-Sep-2019 03:47:58 [ERROR]
15-Sep-2019 03:47:58 [ERROR] To see the full stack trace of the errors, re-run Maven with the -e switch.
15-Sep-2019 03:47:58 [ERROR] Re-run Maven using the -X switch to enable full debug logging.
15-Sep-2019 03:47:58 [ERROR]
15-Sep-2019 03:47:58 [ERROR] For more information about the errors and possible solutions, please read the following articles:
15-Sep-2019 03:47:58 [ERROR] [Help 1] http://cwiki.apache.org/confluence/display/MAVEN/MojoFailureException
15-Sep-2019 03:47:58 [ERROR]
15-Sep-2019 03:47:58 [ERROR] After correcting the problems, you can resume the build with the command
15-Sep-2019 03:47:58 [ERROR]   mvn <goals> -rf :spring-cloud-task-stream