Build #336

Builds the Spring Cloud Task project

Build: #336 failed

Job: Build Spring Cloud Task Project failed

Stages & jobs

  1. Default Stage

Build log

The build generated 626 lines of output. Download or view full build log

13-Jul-2017 00:36:37 Build Spring Cloud Task - SCT Main - Build Spring Cloud Task Project #336 (SCT-STASK-JOB1-336) started building on agent bamboo-07.af.pivotal.io
13-Jul-2017 00:36:37 Remote agent on host bamboo-07.af.pivotal.io
13-Jul-2017 00:36:37 Build working directory is /opt/bamboo-home/xml-data/build-dir/SCT-STASK-JOB1
13-Jul-2017 00:36:37 Executing build Spring Cloud Task - SCT Main - Build Spring Cloud Task Project #336 (SCT-STASK-JOB1-336)
13-Jul-2017 00:36:37 Starting task 'Checkout Default Repository' of type 'com.atlassian.bamboo.plugins.vcs:task.vcs.checkout'
13-Jul-2017 00:36:37 Build always requires a clean checkout
13-Jul-2017 00:36:37 Cleaning build directory '/opt/bamboo-home/xml-data/build-dir/SCT-STASK-JOB1'
13-Jul-2017 00:36:37 Updating source code to revision: 2c2712ada4a8a624db16e2e48333724c7532d082
13-Jul-2017 00:36:37 Creating local git repository in '/opt/bamboo-home/xml-data/build-dir/SCT-STASK-JOB1/.git'.
13-Jul-2017 00:36:37 Initialized empty Git repository in /opt/bamboo-home/xml-data/build-dir/SCT-STASK-JOB1/.git/
13-Jul-2017 00:36:37 Fetching 'refs/heads/master' from 'https://github.com/spring-cloud/spring-cloud-task.git'.
13-Jul-2017 00:36:38 From https://github.com/spring-cloud/spring-cloud-task
13-Jul-2017 00:36:38 * [new branch]      master     -> master
13-Jul-2017 00:36:38 * [new tag]         1.0.1.RELEASE -> 1.0.1.RELEASE
13-Jul-2017 00:36:38 Checking out revision 2c2712ada4a8a624db16e2e48333724c7532d082.
13-Jul-2017 00:36:38 Already on 'master'
13-Jul-2017 00:36:38 Updated source code to revision: 2c2712ada4a8a624db16e2e48333724c7532d082
13-Jul-2017 00:36:38 Finished task 'Checkout Default Repository' with result: Success
13-Jul-2017 00:36:38 Running pre-build action: Artifactory Release Staging
13-Jul-2017 00:36:38 Running pre-build action: VCS Version Collector
13-Jul-2017 00:36:38 Running pre-build action: Hung Build Killer PreBuildAction
13-Jul-2017 00:36:38 Starting task 'Build and publish Spring Cloud Task Modules' of type 'org.jfrog.bamboo.bamboo-artifactory-plugin:maven3Task'
13-Jul-2017 00:36:38 Bamboo Artifactory Plugin version: 2.1.0
13-Jul-2017 00:36:38
Beginning to execute external process for build 'Spring Cloud Task - SCT Main - Build Spring Cloud Task Project #336 (SCT-STASK-JOB1-336)'
... running command line:
/opt/jdk-8/bin/java -cp /opt/maven-3.5/boot/plexus-classworlds-2.5.2.jar -Dclassworlds.conf=/tmp/artifactoryM28510330492013963776conf -DbuildInfoConfig.propertiesFile=/tmp/buildInfo740196879857821325properties -Xmx2048m -XX:MaxPermSize=2048m -Dmaven.home=/opt/maven-3.5 -Dmaven.multiModuleProjectDirectory=/opt/bamboo-home/xml-data/build-dir/SCT-STASK-JOB1 org.codehaus.plexus.classworlds.launcher.Launcher clean install -Pfull,skipIntegrationTests
... in: /opt/bamboo-home/xml-data/build-dir/SCT-STASK-JOB1
... using extra environment variables:
bamboo_planRepository_1_branch=master
IRBRC=/home/bamboo/.rvm/rubies/ruby-2.3.0/.irbrc
bamboo_signing_store_password=********
bamboo_capability_system_builder_ant_Ant_1_9=/opt/ant-1.9
bamboo_capability_system_builder_ant_Ant_1_8=/opt/ant-1.8
bamboo_planRepository_1_branchDisplayName=master
bamboo_repository_revision_number=2c2712ada4a8a624db16e2e48333724c7532d082
bamboo_repository_193953865_git_branch=master
bamboo_RIAK_BIN=/usr/sbin/riak
bamboo_capability_system_builder_node_Node_js_6=/usr/bin/node
WRAPPER_BITS=32
bamboo_buildKey=SCT-STASK-JOB1
rvm_loaded_flag=1
bamboo_sonar_token_password=********
rvm_version=1.27.0 (latest)
PWD=/opt/bamboo-home/bin
bamboo_shortJobName=Build Spring Cloud Task Project
bamboo_buildResultsUrl=https://build.spring.io/browse/SCT-STASK-JOB1-336
bamboo_capability_system_builder_gradle___gradlew=./gradlew
bamboo_capability_system_builder_mvn3_Maven_3_3=/opt/maven-3.3
bamboo_capability_system_builder_mvn3_Maven_3_2=/opt/maven-3.2
bamboo_planRepository_repositoryUrl=https://github.com/spring-cloud/spring-cloud-task.git
bamboo_capability_system_builder_mvn3_Maven_3_1=/opt/maven-3.1
bamboo_capability_system_builder_mvn3_Maven_3_5=/opt/maven-3.5
bamboo_agentId=208568329
MY_RUBY_HOME=/home/bamboo/.rvm/rubies/ruby-2.3.0
bamboo_capability_system_builder_mvn3_Maven_3_0=/opt/maven-3.0
rvm_path=/home/bamboo/.rvm
bamboo_planRepository_revision=2c2712ada4a8a624db16e2e48333724c7532d082
bamboo_planRepository_previousRevision=54bce9a590bae59374a1466a59fbafe70249b2b0
bamboo_capability_remote_build=true
bamboo_repository_branch_name=master
SHLVL=1
bamboo_org_jfrog_bamboo_buildInfo_serverUrl=https://repo.spring.io
bamboo_scdf_acceptance_tests_password=********
WRAPPER_OS=linux
JAVA_HOME=/opt/jdk-8
EC2_HOME=/opt/ec2-api-tools
XDG_SESSION_ID=c1
bamboo_planRepository_branch=master
bamboo_org_jfrog_bamboo_release_activated=false
bamboo_planRepository_1_type=gitv2
bamboo_planRepository_branchName=master
WRAPPER_FILE_SEPARATOR=/
_=/opt/bamboo-home/bin/bamboo-agent.sh
WRAPPER_PATH_SEPARATOR=:
bamboo_sonar_password=********
bamboo_repository_193953865_previous_revision_number=54bce9a590bae59374a1466a59fbafe70249b2b0
bamboo_planRepository_type=gitv2
bamboo_planRepository_1_username=spring-buildmaster
rvm_stored_umask=0002
GEM_PATH=/home/bamboo/.rvm/gems/ruby-2.3.0:/home/bamboo/.rvm/gems/ruby-2.3.0@global
bamboo_planKey=SCT-STASK
bamboo_JDK8_HOME=/opt/jdk-8
bamboo_planRepository_username=spring-buildmaster
NLSPATH=/usr/dt/lib/nls/msg/%L/%N.cat
bamboo_planRepository_1_branchName=master
bamboo_sonar_version=5.6.3
bamboo_repository_193953865_name=Git
bamboo_resultsUrl=https://build.spring.io/browse/SCT-STASK-JOB1-336
bamboo_planRepository_1_name=Git
bamboo_build_working_directory=/opt/bamboo-home/xml-data/build-dir/SCT-STASK-JOB1
bamboo_capability_system_os=ubuntu1604
bamboo_repository_193953865_git_username=spring-buildmaster
bamboo_repository_193953865_git_repositoryUrl=https://github.com/spring-cloud/spring-cloud-task.git
bamboo_nexusPush_stagingProfile=buildmaster
bamboo_shortPlanName=SCT Main
MAIL=/var/mail/bamboo
bamboo_planRepository_name=Git
LOGNAME=bamboo
bamboo_buildNumber=336
rvm_user_install_flag=1
SHELL=/bin/bash
bamboo_repository_193953865_revision_number=2c2712ada4a8a624db16e2e48333724c7532d082
bamboo_JDK7_HOME=/opt/jdk-7
bamboo_planName=Spring Cloud Task - SCT Main
bamboo_shortPlanKey=STASK
OLDPWD=/opt/users/bamboo
GEM_HOME=/home/bamboo/.rvm/gems/ruby-2.3.0
bamboo_shortJobKey=JOB1
bamboo_repository_previous_revision_number=54bce9a590bae59374a1466a59fbafe70249b2b0
bamboo_buildTimeStamp=2017-07-13T00:36:37.047Z
RUBY_VERSION=ruby-2.3.0
bamboo_sonar_username=buildmaster
_system_name=Ubuntu
bamboo_buildResultKey=SCT-STASK-JOB1-336
bamboo_repository_git_branch=master
bamboo_nexusPush_close=true
bamboo_buildPlanName=Spring Cloud Task - SCT Main - Build Spring Cloud Task Project
bamboo_planRepository_1_revision=2c2712ada4a8a624db16e2e48333724c7532d082
_system_arch=x86_64
bamboo_repository_name=Git
rvm_bin_path=/home/bamboo/.rvm/bin
bamboo_signing_key_password=********
XFILESEARCHPATH=/usr/dt/app-defaults/%L/Dt
rvm_prefix=/home/bamboo
LANG=en_US.UTF-8
bamboo_capability_system_docker_executable=/usr/bin/docker
DISPLAY=localhost:1.0
bamboo_capability_system_builder_groovy_Groovy_2_4=/opt/groovy-2.4
bamboo_capability_system_builder_command_Bash=/bin/bash
bamboo_agentWorkingDirectory=/opt/bamboo-home/xml-data/build-dir
bamboo_capability_system_git_executable=/usr/bin/git
bamboo_planRepository_1_previousRevision=54bce9a590bae59374a1466a59fbafe70249b2b0
bamboo_repository_git_username=spring-buildmaster
bamboo_capability_os_family=unix
NVM_NODEJS_ORG_MIRROR=http://nodejs.org/dist
bamboo_planRepository_branchDisplayName=master
NODE_PATH=/usr/lib/nodejs:/usr/lib/node_modules:/usr/share/javascript
bamboo_capability_system_builder_maven_Artifactory_Maven_3_5=/opt/maven-3.5
GIT_SSL_NO_VERIFY=true
bamboo_capability_system_builder_maven_Artifactory_Maven_3_3=/opt/maven-3.3
NVM_DIR=/home/bamboo/.nvm
bamboo_s3_properties=/home/bamboo/tools/s3.properties
bamboo_capability_system_builder_maven_Artifactory_Maven_3_2=/opt/maven-3.2
bamboo_capability_system_builder_maven_Artifactory_Maven_3_1=/opt/maven-3.1
bamboo_capability_system_builder_maven_Artifactory_Maven_3_0=/opt/maven-3.0
_system_type=Linux
bamboo_plan_storageTag=SCT-STASK
_system_version=16.04
bamboo_repository_193953865_branch_name=master
USER=bamboo
bamboo_repository_git_repositoryUrl=https://github.com/spring-cloud/spring-cloud-task.git
bamboo_org_jfrog_bamboo_buildInfo_activated=true
bamboo_working_directory=/opt/bamboo-home/xml-data/build-dir/SCT-STASK-JOB1
bamboo_planRepository_1_repositoryUrl=https://github.com/spring-cloud/spring-cloud-task.git
bamboo_capability_system_jdk_JDK_1_8=/opt/jdk-8
bamboo_capability_system_jdk_JDK_1_9=/opt/jdk-9
WRAPPER_ARCH=x86
bamboo_capability_system_jdk_JDK_1_6=/opt/jdk-6
bamboo_sonar_ip=10.194.6.9
bamboo_capability_system_jdk_JDK_1_7=/opt/jdk-7
XDG_RUNTIME_DIR=/run/user/505
HOME=/home/bamboo
PATH=$PATH:/opt/jdk-8/bin:/bin:/home/bamboo/.rvm/gems/ruby-2.3.0/bin:/home/bamboo/.rvm/gems/ruby-2.3.0@global/bin:/home/bamboo/.rvm/rubies/ruby-2.3.0/bin:/home/bamboo/bin:/usr/local/bin:/usr/bin:/bin:/usr/local/games:/usr/games:/snap/bin:/home/bamboo/bin:/usr/local/bin:/opt/ec2-api-tools/bin:/home/bamboo/.rvm/bin
13-Jul-2017 00:36:38 Java HotSpot(TM) 64-Bit Server VM warning: ignoring option MaxPermSize=2048m; support was removed in 8.0
13-Jul-2017 00:36:40 [INFO] Scanning for projects...
13-Jul-2017 00:36:41 Downloading: https://repo.spring.io/libs-snapshot-local/org/springframework/cloud/spring-cloud-build/2.0.0.BUILD-SNAPSHOT/maven-metadata.xml
13-Jul-2017 00:36:41 Progress (1): 636 B
13-Jul-2017 00:36:41                    
13-Jul-2017 00:36:41 Downloaded: https://repo.spring.io/libs-snapshot-local/org/springframework/cloud/spring-cloud-build/2.0.0.BUILD-SNAPSHOT/maven-metadata.xml (636 B at 1.5 kB/s)
13-Jul-2017 00:36:41 Downloading: https://repo.spring.io/libs-snapshot-local/org/springframework/cloud/spring-cloud-build/2.0.0.BUILD-SNAPSHOT/spring-cloud-build-2.0.0.BUILD-20170713.002112-344.pom
13-Jul-2017 00:36:41 Progress (1): 0.8/25 kB
13-Jul-2017 00:36:41 Progress (1): 2.2/25 kB
13-Jul-2017 00:36:41 Progress (1): 3.5/25 kB
13-Jul-2017 00:36:41 Progress (1): 4.9/25 kB
13-Jul-2017 00:36:41 Progress (1): 6.3/25 kB
13-Jul-2017 00:36:41 Progress (1): 7.6/25 kB
13-Jul-2017 00:36:41 Progress (1): 9.0/25 kB
13-Jul-2017 00:36:41 Progress (1): 10/25 kB
13-Jul-2017 00:36:41 Progress (1): 12/25 kB
13-Jul-2017 00:36:41 Progress (1): 13/25 kB
13-Jul-2017 00:36:41 Progress (1): 15/25 kB
13-Jul-2017 00:36:41 Progress (1): 16/25 kB
13-Jul-2017 00:36:41 Progress (1): 17/25 kB
13-Jul-2017 00:36:41 Progress (1): 19/25 kB
13-Jul-2017 00:36:41 Progress (1): 20/25 kB
13-Jul-2017 00:36:41 Progress (1): 21/25 kB
13-Jul-2017 00:36:41 Progress (1): 23/25 kB
13-Jul-2017 00:36:41 Progress (1): 24/25 kB
13-Jul-2017 00:36:41 Progress (1): 25/25 kB
13-Jul-2017 00:36:41 Progress (1): 25 kB   
13-Jul-2017 00:36:41                    
13-Jul-2017 00:36:41 Downloaded: https://repo.spring.io/libs-snapshot-local/org/springframework/cloud/spring-cloud-build/2.0.0.BUILD-SNAPSHOT/spring-cloud-build-2.0.0.BUILD-20170713.002112-344.pom (25 kB at 146 kB/s)
13-Jul-2017 00:36:41 Downloading: https://repo.spring.io/libs-snapshot-local/org/springframework/cloud/spring-cloud-dependencies-parent/2.0.0.BUILD-SNAPSHOT/maven-metadata.xml
13-Jul-2017 00:36:41 Progress (1): 650 B
13-Jul-2017 00:36:41                    
13-Jul-2017 00:36:41 Downloaded: https://repo.spring.io/libs-snapshot-local/org/springframework/cloud/spring-cloud-dependencies-parent/2.0.0.BUILD-SNAPSHOT/maven-metadata.xml (650 B at 4.0 kB/s)
13-Jul-2017 00:36:42 Downloading: https://repo.spring.io/libs-snapshot-local/org/springframework/cloud/spring-cloud-dependencies-parent/2.0.0.BUILD-SNAPSHOT/spring-cloud-dependencies-parent-2.0.0.BUILD-20170713.002110-344.pom
13-Jul-2017 00:36:42 Progress (1): 0.8/6.5 kB
13-Jul-2017 00:36:42 Progress (1): 2.2/6.5 kB
13-Jul-2017 00:36:42 Progress (1): 3.5/6.5 kB
13-Jul-2017 00:36:42 Progress (1): 4.9/6.5 kB
13-Jul-2017 00:36:42 Progress (1): 6.3/6.5 kB
13-Jul-2017 00:36:42 Progress (1): 6.5 kB   
13-Jul-2017 00:36:42                    
13-Jul-2017 00:36:42 Downloaded: https://repo.spring.io/libs-snapshot-local/org/springframework/cloud/spring-cloud-dependencies-parent/2.0.0.BUILD-SNAPSHOT/spring-cloud-dependencies-parent-2.0.0.BUILD-20170713.002110-344.pom (6.5 kB at 39 kB/s)
13-Jul-2017 00:36:42 Downloading: https://repo.spring.io/libs-snapshot-local/org/springframework/boot/spring-boot-starter-parent/2.0.0.BUILD-SNAPSHOT/maven-metadata.xml
13-Jul-2017 00:36:42 Progress (1): 643 B
13-Jul-2017 00:36:42                    
13-Jul-2017 00:36:42 Downloaded: https://repo.spring.io/libs-snapshot-local/org/springframework/boot/spring-boot-starter-parent/2.0.0.BUILD-SNAPSHOT/maven-metadata.xml (643 B at 4.0 kB/s)
13-Jul-2017 00:36:42 Downloading: https://repo.spring.io/libs-snapshot-local/org/springframework/boot/spring-boot-starter-parent/2.0.0.BUILD-SNAPSHOT/spring-boot-starter-parent-2.0.0.BUILD-20170712.162639-777.pom
13-Jul-2017 00:36:42 Progress (1): 0.8/7.4 kB
13-Jul-2017 00:36:42 Progress (1): 2.2/7.4 kB
13-Jul-2017 00:36:42 Progress (1): 3.5/7.4 kB
13-Jul-2017 00:36:42 Progress (1): 4.9/7.4 kB
13-Jul-2017 00:36:42 Progress (1): 6.3/7.4 kB
13-Jul-2017 00:36:42 Progress (1): 7.4 kB   
13-Jul-2017 00:36:42                    
13-Jul-2017 00:36:42 Downloaded: https://repo.spring.io/libs-snapshot-local/org/springframework/boot/spring-boot-starter-parent/2.0.0.BUILD-SNAPSHOT/spring-boot-starter-parent-2.0.0.BUILD-20170712.162639-777.pom (7.4 kB at 45 kB/s)
13-Jul-2017 00:36:42 Downloading: https://repo.spring.io/libs-snapshot-local/org/springframework/boot/spring-boot-dependencies/2.0.0.BUILD-SNAPSHOT/maven-metadata.xml
13-Jul-2017 00:36:42 Progress (1): 641 B
13-Jul-2017 00:36:42                    
13-Jul-2017 00:36:42 Downloaded: https://repo.spring.io/libs-snapshot-local/org/springframework/boot/spring-boot-dependencies/2.0.0.BUILD-SNAPSHOT/maven-metadata.xml (641 B at 4.0 kB/s)
13-Jul-2017 00:36:42 Downloading: https://repo.spring.io/libs-snapshot-local/org/springframework/boot/spring-boot-dependencies/2.0.0.BUILD-SNAPSHOT/spring-boot-dependencies-2.0.0.BUILD-20170712.162639-777.pom
13-Jul-2017 00:36:42 Progress (1): 0.8/92 kB
13-Jul-2017 00:36:42 Progress (1): 2.2/92 kB
13-Jul-2017 00:36:42 Progress (1): 3.5/92 kB
13-Jul-2017 00:36:42 Progress (1): 4.9/92 kB
13-Jul-2017 00:36:42 Progress (1): 6.3/92 kB
13-Jul-2017 00:36:42 Progress (1): 7.6/92 kB
13-Jul-2017 00:36:42 Progress (1): 9.0/92 kB
13-Jul-2017 00:36:42 Progress (1): 10/92 kB
13-Jul-2017 00:36:42 Progress (1): 12/92 kB
13-Jul-2017 00:36:42 Progress (1): 13/92 kB
13-Jul-2017 00:36:42 Progress (1): 14/92 kB
13-Jul-2017 00:36:42 Progress (1): 16/92 kB
13-Jul-2017 00:36:42 Progress (1): 17/92 kB
13-Jul-2017 00:36:42 Progress (1): 19/92 kB
13-Jul-2017 00:36:42 Progress (1): 20/92 kB
13-Jul-2017 00:36:42 Progress (1): 21/92 kB
13-Jul-2017 00:36:42 Progress (1): 23/92 kB
13-Jul-2017 00:36:42 Progress (1): 24/92 kB
13-Jul-2017 00:36:42 Progress (1): 25/92 kB
13-Jul-2017 00:36:42 Progress (1): 27/92 kB
13-Jul-2017 00:36:42 Progress (1): 28/92 kB
13-Jul-2017 00:36:42 Progress (1): 29/92 kB
13-Jul-2017 00:36:42 Progress (1): 31/92 kB
13-Jul-2017 00:36:42 Progress (1): 32/92 kB
13-Jul-2017 00:36:42 Progress (1): 34/92 kB
13-Jul-2017 00:36:42 Progress (1): 35/92 kB
13-Jul-2017 00:36:42 Progress (1): 36/92 kB
13-Jul-2017 00:36:42 Progress (1): 38/92 kB
13-Jul-2017 00:36:42 Progress (1): 39/92 kB
13-Jul-2017 00:36:42 Progress (1): 40/92 kB
13-Jul-2017 00:36:42 Progress (1): 42/92 kB
13-Jul-2017 00:36:42 Progress (1): 43/92 kB
13-Jul-2017 00:36:42 Progress (1): 44/92 kB
13-Jul-2017 00:36:42 Progress (1): 46/92 kB
13-Jul-2017 00:36:42 Progress (1): 47/92 kB
13-Jul-2017 00:36:42 Progress (1): 49/92 kB
13-Jul-2017 00:36:42 Progress (1): 50/92 kB
13-Jul-2017 00:36:42 Progress (1): 51/92 kB
13-Jul-2017 00:36:42 Progress (1): 53/92 kB
13-Jul-2017 00:36:42 Progress (1): 54/92 kB
13-Jul-2017 00:36:42 Progress (1): 55/92 kB
13-Jul-2017 00:36:42 Progress (1): 57/92 kB
13-Jul-2017 00:36:42 Progress (1): 58/92 kB
13-Jul-2017 00:36:42 Progress (1): 60/92 kB
13-Jul-2017 00:36:42 Progress (1): 61/92 kB
13-Jul-2017 00:36:42 Progress (1): 62/92 kB
13-Jul-2017 00:36:42 Progress (1): 64/92 kB
13-Jul-2017 00:36:42 Progress (1): 64/92 kB
13-Jul-2017 00:36:42 Progress (1): 65/92 kB
13-Jul-2017 00:36:42 Progress (1): 66/92 kB
13-Jul-2017 00:36:42 Progress (1): 68/92 kB
13-Jul-2017 00:36:42 Progress (1): 69/92 kB
13-Jul-2017 00:36:42 Progress (1): 70/92 kB
13-Jul-2017 00:36:42 Progress (1): 72/92 kB
13-Jul-2017 00:36:42 Progress (1): 73/92 kB
13-Jul-2017 00:36:42 Progress (1): 75/92 kB
13-Jul-2017 00:36:42 Progress (1): 76/92 kB
13-Jul-2017 00:36:42 Progress (1): 77/92 kB
13-Jul-2017 00:36:42 Progress (1): 79/92 kB
13-Jul-2017 00:36:42 Progress (1): 80/92 kB
13-Jul-2017 00:36:42 Progress (1): 81/92 kB
13-Jul-2017 00:36:42 Progress (1): 83/92 kB
13-Jul-2017 00:36:42 Progress (1): 84/92 kB
13-Jul-2017 00:36:42 Progress (1): 85/92 kB
13-Jul-2017 00:36:42 Progress (1): 87/92 kB
13-Jul-2017 00:36:42 Progress (1): 88/92 kB
13-Jul-2017 00:36:42 Progress (1): 90/92 kB
13-Jul-2017 00:36:42 Progress (1): 91/92 kB
13-Jul-2017 00:36:42 Progress (1): 92 kB   
13-Jul-2017 00:36:42                    
13-Jul-2017 00:36:42 Downloaded: https://repo.spring.io/libs-snapshot-local/org/springframework/boot/spring-boot-dependencies/2.0.0.BUILD-SNAPSHOT/spring-boot-dependencies-2.0.0.BUILD-20170712.162639-777.pom (92 kB at 368 kB/s)
13-Jul-2017 00:36:42 Downloading: https://repo.maven.apache.org/maven2/org/springframework/boot/spring-boot-starter-parent/1.5.2.RELEASE/spring-boot-starter-parent-1.5.2.RELEASE.pom
13-Jul-2017 00:36:43 Progress (1): 2.2/7.5 kB
13-Jul-2017 00:36:43 Progress (1): 4.9/7.5 kB
13-Jul-2017 00:36:43 Progress (1): 7.5 kB   
13-Jul-2017 00:36:43                    
13-Jul-2017 00:36:43 Downloaded: https://repo.maven.apache.org/maven2/org/springframework/boot/spring-boot-starter-parent/1.5.2.RELEASE/spring-boot-starter-parent-1.5.2.RELEASE.pom (7.5 kB at 197 kB/s)
13-Jul-2017 00:36:43 Downloading: https://repo.maven.apache.org/maven2/org/springframework/boot/spring-boot-dependencies/1.5.2.RELEASE/spring-boot-dependencies-1.5.2.RELEASE.pom
13-Jul-2017 00:36:43 Progress (1): 2.1/89 kB
13-Jul-2017 00:36:43 Progress (1): 4.9/89 kB
13-Jul-2017 00:36:43 Progress (1): 7.7/89 kB
13-Jul-2017 00:36:43 Progress (1): 10/89 kB
13-Jul-2017 00:36:43 Progress (1): 13/89 kB
13-Jul-2017 00:36:43 Progress (1): 16/89 kB
13-Jul-2017 00:36:43 Progress (1): 19/89 kB
13-Jul-2017 00:36:43 Progress (1): 21/89 kB
13-Jul-2017 00:36:43 Progress (1): 24/89 kB
13-Jul-2017 00:36:43 Progress (1): 27/89 kB
13-Jul-2017 00:36:43 Progress (1): 30/89 kB
13-Jul-2017 00:36:43 Progress (1): 32/89 kB
13-Jul-2017 00:36:43 Progress (1): 36/89 kB
13-Jul-2017 00:36:43 Progress (1): 40/89 kB
13-Jul-2017 00:36:43 Progress (1): 44/89 kB
13-Jul-2017 00:36:43 Progress (1): 49/89 kB
13-Jul-2017 00:36:43 Progress (1): 53/89 kB
13-Jul-2017 00:36:43 Progress (1): 57/89 kB
13-Jul-2017 00:36:43 Progress (1): 61/89 kB
13-Jul-2017 00:36:43 Progress (1): 65/89 kB
13-Jul-2017 00:36:43 Progress (1): 69/89 kB
13-Jul-2017 00:36:43 Progress (1): 73/89 kB
13-Jul-2017 00:36:43 Progress (1): 77/89 kB
13-Jul-2017 00:36:43 Progress (1): 81/89 kB
13-Jul-2017 00:36:43 Progress (1): 85/89 kB
13-Jul-2017 00:36:43 Progress (1): 89 kB   
13-Jul-2017 00:36:43                    
13-Jul-2017 00:36:43 Downloaded: https://repo.maven.apache.org/maven2/org/springframework/boot/spring-boot-dependencies/1.5.2.RELEASE/spring-boot-dependencies-1.5.2.RELEASE.pom (89 kB at 4.7 MB/s)
13-Jul-2017 00:36:43 Downloading: https://repo.spring.io/libs-snapshot-local/org/springframework/cloud/spring-cloud-build-dependencies/2.0.0.BUILD-SNAPSHOT/maven-metadata.xml
13-Jul-2017 00:36:43 Progress (1): 649 B
13-Jul-2017 00:36:43                    
13-Jul-2017 00:36:43 Downloaded: https://repo.spring.io/libs-snapshot-local/org/springframework/cloud/spring-cloud-build-dependencies/2.0.0.BUILD-SNAPSHOT/maven-metadata.xml (649 B at 3.1 kB/s)
13-Jul-2017 00:36:43 Downloading: https://repo.spring.io/libs-snapshot-local/org/springframework/cloud/spring-cloud-build-dependencies/2.0.0.BUILD-SNAPSHOT/spring-cloud-build-dependencies-2.0.0.BUILD-20170713.002108-344.pom
13-Jul-2017 00:36:43 Progress (1): 0.8/5.0 kB
13-Jul-2017 00:36:43 Progress (1): 2.2/5.0 kB
13-Jul-2017 00:36:43 Progress (1): 3.5/5.0 kB
13-Jul-2017 00:36:43 Progress (1): 4.9/5.0 kB
13-Jul-2017 00:36:43 Progress (1): 5.0 kB   
13-Jul-2017 00:36:43                    
13-Jul-2017 00:36:43 Downloaded: https://repo.spring.io/libs-snapshot-local/org/springframework/cloud/spring-cloud-build-dependencies/2.0.0.BUILD-SNAPSHOT/spring-cloud-build-dependencies-2.0.0.BUILD-20170713.002108-344.pom (5.0 kB at 29 kB/s)
13-Jul-2017 00:36:43 Downloading: https://repo.spring.io/libs-snapshot-local/org/springframework/boot/spring-boot-dependencies/2.0.0.M2/spring-boot-dependencies-2.0.0.M2.pom
13-Jul-2017 00:36:43 Downloading: https://repo.spring.io/libs-milestone-local/org/springframework/boot/spring-boot-dependencies/2.0.0.M2/spring-boot-dependencies-2.0.0.M2.pom
13-Jul-2017 00:36:43 Progress (1): 0.8/91 kB
13-Jul-2017 00:36:43 Progress (1): 2.2/91 kB
13-Jul-2017 00:36:43 Progress (1): 3.5/91 kB
13-Jul-2017 00:36:43 Progress (1): 4.9/91 kB
13-Jul-2017 00:36:43 Progress (1): 6.3/91 kB
13-Jul-2017 00:36:43 Progress (1): 7.6/91 kB
13-Jul-2017 00:36:43 Progress (1): 9.0/91 kB
13-Jul-2017 00:36:43 Progress (1): 10/91 kB
13-Jul-2017 00:36:43 Progress (1): 12/91 kB
13-Jul-2017 00:36:43 Progress (1): 13/91 kB
13-Jul-2017 00:36:43 Progress (1): 14/91 kB
13-Jul-2017 00:36:43 Progress (1): 15/91 kB
13-Jul-2017 00:36:43 Progress (1): 16/91 kB
13-Jul-2017 00:36:43 Progress (1): 18/91 kB
13-Jul-2017 00:36:43 Progress (1): 19/91 kB
13-Jul-2017 00:36:43 Progress (1): 20/91 kB
13-Jul-2017 00:36:43 Progress (1): 22/91 kB
13-Jul-2017 00:36:43 Progress (1): 23/91 kB
13-Jul-2017 00:36:43 Progress (1): 24/91 kB
13-Jul-2017 00:36:43 Progress (1): 26/91 kB
13-Jul-2017 00:36:43 Progress (1): 27/91 kB
13-Jul-2017 00:36:43 Progress (1): 29/91 kB
13-Jul-2017 00:36:43 Progress (1): 30/91 kB
13-Jul-2017 00:36:43 Progress (1): 31/91 kB
13-Jul-2017 00:36:43 Progress (1): 33/91 kB
13-Jul-2017 00:36:43 Progress (1): 34/91 kB
13-Jul-2017 00:36:43 Progress (1): 35/91 kB
13-Jul-2017 00:36:43 Progress (1): 37/91 kB
13-Jul-2017 00:36:43 Progress (1): 38/91 kB
13-Jul-2017 00:36:43 Progress (1): 39/91 kB
13-Jul-2017 00:36:43 Progress (1): 41/91 kB
13-Jul-2017 00:36:43 Progress (1): 42/91 kB
13-Jul-2017 00:36:43 Progress (1): 43/91 kB
13-Jul-2017 00:36:43 Progress (1): 44/91 kB
13-Jul-2017 00:36:43 Progress (1): 46/91 kB
13-Jul-2017 00:36:43 Progress (1): 47/91 kB
13-Jul-2017 00:36:43 Progress (1): 49/91 kB
13-Jul-2017 00:36:43 Progress (1): 50/91 kB
13-Jul-2017 00:36:43 Progress (1): 51/91 kB
13-Jul-2017 00:36:43 Progress (1): 53/91 kB
13-Jul-2017 00:36:43 Progress (1): 54/91 kB
13-Jul-2017 00:36:43 Progress (1): 55/91 kB
13-Jul-2017 00:36:43 Progress (1): 57/91 kB
13-Jul-2017 00:36:43 Progress (1): 58/91 kB
13-Jul-2017 00:36:43 Progress (1): 59/91 kB
13-Jul-2017 00:36:43 Progress (1): 61/91 kB
13-Jul-2017 00:36:43 Progress (1): 62/91 kB
13-Jul-2017 00:36:43 Progress (1): 64/91 kB
13-Jul-2017 00:36:43 Progress (1): 64/91 kB
13-Jul-2017 00:36:43 Progress (1): 66/91 kB
13-Jul-2017 00:36:43 Progress (1): 66/91 kB
13-Jul-2017 00:36:43 Progress (1): 68/91 kB
13-Jul-2017 00:36:43 Progress (1): 69/91 kB
13-Jul-2017 00:36:43 Progress (1): 70/91 kB
13-Jul-2017 00:36:43 Progress (1): 72/91 kB
13-Jul-2017 00:36:43 Progress (1): 73/91 kB
13-Jul-2017 00:36:43 Progress (1): 74/91 kB
13-Jul-2017 00:36:43 Progress (1): 76/91 kB
13-Jul-2017 00:36:43 Progress (1): 77/91 kB
13-Jul-2017 00:36:43 Progress (1): 79/91 kB
13-Jul-2017 00:36:43 Progress (1): 80/91 kB
13-Jul-2017 00:36:43 Progress (1): 81/91 kB
13-Jul-2017 00:36:43 Progress (1): 83/91 kB
13-Jul-2017 00:36:43 Progress (1): 84/91 kB
13-Jul-2017 00:36:43 Progress (1): 85/91 kB
13-Jul-2017 00:36:43 Progress (1): 87/91 kB
13-Jul-2017 00:36:43 Progress (1): 88/91 kB
13-Jul-2017 00:36:43 Progress (1): 89/91 kB
13-Jul-2017 00:36:43 Progress (1): 91/91 kB
13-Jul-2017 00:36:43 Progress (1): 91 kB   
13-Jul-2017 00:36:43                    
13-Jul-2017 00:36:43 Downloaded: https://repo.spring.io/libs-milestone-local/org/springframework/boot/spring-boot-dependencies/2.0.0.M2/spring-boot-dependencies-2.0.0.M2.pom (91 kB at 349 kB/s)
13-Jul-2017 00:36:43 Downloading: https://repo.spring.io/libs-snapshot-local/com/fasterxml/jackson/jackson-bom/2.9.0.pr3/jackson-bom-2.9.0.pr3.pom
13-Jul-2017 00:36:43 Downloading: https://repo.spring.io/libs-milestone-local/com/fasterxml/jackson/jackson-bom/2.9.0.pr3/jackson-bom-2.9.0.pr3.pom
13-Jul-2017 00:36:44 Downloading: https://repo.spring.io/release/com/fasterxml/jackson/jackson-bom/2.9.0.pr3/jackson-bom-2.9.0.pr3.pom
13-Jul-2017 00:36:44 Downloading: https://repo.maven.apache.org/maven2/com/fasterxml/jackson/jackson-bom/2.9.0.pr3/jackson-bom-2.9.0.pr3.pom
13-Jul-2017 00:36:44 Progress (1): 2.2/12 kB
13-Jul-2017 00:36:44 Progress (1): 4.9/12 kB
13-Jul-2017 00:36:44 Progress (1): 7.7/12 kB
13-Jul-2017 00:36:44 Progress (1): 10/12 kB
13-Jul-2017 00:36:44 Progress (1): 12 kB   
13-Jul-2017 00:36:44                    
13-Jul-2017 00:36:44 Downloaded: https://repo.maven.apache.org/maven2/com/fasterxml/jackson/jackson-bom/2.9.0.pr3/jackson-bom-2.9.0.pr3.pom (12 kB at 1.2 MB/s)
13-Jul-2017 00:36:44 Downloading: https://repo.spring.io/libs-snapshot-local/com/fasterxml/jackson/jackson-parent/2.9/jackson-parent-2.9.pom
13-Jul-2017 00:36:44 Downloading: https://repo.spring.io/libs-milestone-local/com/fasterxml/jackson/jackson-parent/2.9/jackson-parent-2.9.pom
13-Jul-2017 00:36:44 Downloading: https://repo.spring.io/release/com/fasterxml/jackson/jackson-parent/2.9/jackson-parent-2.9.pom
13-Jul-2017 00:36:44 Downloading: https://repo.maven.apache.org/maven2/com/fasterxml/jackson/jackson-parent/2.9/jackson-parent-2.9.pom
13-Jul-2017 00:36:44 Progress (1): 2.1/7.8 kB
13-Jul-2017 00:36:44 Progress (1): 4.9/7.8 kB
13-Jul-2017 00:36:44 Progress (1): 7.7/7.8 kB
13-Jul-2017 00:36:44 Progress (1): 7.8 kB   
13-Jul-2017 00:36:44                    
13-Jul-2017 00:36:44 Downloaded: https://repo.maven.apache.org/maven2/com/fasterxml/jackson/jackson-parent/2.9/jackson-parent-2.9.pom (7.8 kB at 782 kB/s)
13-Jul-2017 00:36:44 Downloading: https://repo.spring.io/libs-snapshot-local/com/fasterxml/oss-parent/28/oss-parent-28.pom
13-Jul-2017 00:36:44 Downloading: https://repo.spring.io/libs-milestone-local/com/fasterxml/oss-parent/28/oss-parent-28.pom
13-Jul-2017 00:36:44 Downloading: https://repo.spring.io/release/com/fasterxml/oss-parent/28/oss-parent-28.pom
13-Jul-2017 00:36:44 Downloading: https://repo.maven.apache.org/maven2/com/fasterxml/oss-parent/28/oss-parent-28.pom
13-Jul-2017 00:36:44 Progress (1): 2.1/20 kB
13-Jul-2017 00:36:44 Progress (1): 4.9/20 kB
13-Jul-2017 00:36:44 Progress (1): 7.7/20 kB
13-Jul-2017 00:36:44 Progress (1): 10/20 kB
13-Jul-2017 00:36:44 Progress (1): 13/20 kB
13-Jul-2017 00:36:44 Progress (1): 16/20 kB
13-Jul-2017 00:36:44 Progress (1): 19/20 kB
13-Jul-2017 00:36:44 Progress (1): 20 kB   
13-Jul-2017 00:36:44                    
13-Jul-2017 00:36:44 Downloaded: https://repo.maven.apache.org/maven2/com/fasterxml/oss-parent/28/oss-parent-28.pom (20 kB at 1.8 MB/s)
13-Jul-2017 00:36:44 Downloading: https://repo.spring.io/libs-snapshot-local/io/netty/netty-bom/4.1.12.Final/netty-bom-4.1.12.Final.pom
13-Jul-2017 00:36:44 Downloading: https://repo.spring.io/libs-milestone-local/io/netty/netty-bom/4.1.12.Final/netty-bom-4.1.12.Final.pom
13-Jul-2017 00:36:44 Downloading: https://repo.spring.io/release/io/netty/netty-bom/4.1.12.Final/netty-bom-4.1.12.Final.pom
13-Jul-2017 00:36:45 Downloading: https://repo.maven.apache.org/maven2/io/netty/netty-bom/4.1.12.Final/netty-bom-4.1.12.Final.pom
13-Jul-2017 00:36:45 Progress (1): 2.1/6.9 kB
13-Jul-2017 00:36:45 Progress (1): 4.9/6.9 kB
13-Jul-2017 00:36:45 Progress (1): 6.9 kB   
13-Jul-2017 00:36:45                    
13-Jul-2017 00:36:45 Downloaded: https://repo.maven.apache.org/maven2/io/netty/netty-bom/4.1.12.Final/netty-bom-4.1.12.Final.pom (6.9 kB at 771 kB/s)
13-Jul-2017 00:36:45 Downloading: https://repo.spring.io/libs-snapshot-local/org/sonatype/oss/oss-parent/7/oss-parent-7.pom
13-Jul-2017 00:36:45 Downloading: https://repo.spring.io/libs-milestone-local/org/sonatype/oss/oss-parent/7/oss-parent-7.pom
13-Jul-2017 00:36:45 Downloading: https://repo.spring.io/release/org/sonatype/oss/oss-parent/7/oss-parent-7.pom
13-Jul-2017 00:36:45 Downloading: https://repo.maven.apache.org/maven2/org/sonatype/oss/oss-parent/7/oss-parent-7.pom
13-Jul-2017 00:36:45 Progress (1): 2.1/4.8 kB
13-Jul-2017 00:36:45 Progress (1): 4.8 kB   
13-Jul-2017 00:36:45                    
13-Jul-2017 00:36:45 Downloaded: https://repo.maven.apache.org/maven2/org/sonatype/oss/oss-parent/7/oss-parent-7.pom (4.8 kB at 482 kB/s)
13-Jul-2017 00:36:45 Downloading: https://repo.spring.io/libs-snapshot-local/io/projectreactor/reactor-bom/Bismuth-M2/reactor-bom-Bismuth-M2.pom
13-Jul-2017 00:36:45 Downloading: https://repo.spring.io/libs-milestone-local/io/projectreactor/reactor-bom/Bismuth-M2/reactor-bom-Bismuth-M2.pom
13-Jul-2017 00:36:45 Progress (1): 0.8/3.8 kB
13-Jul-2017 00:36:45 Progress (1): 2.2/3.8 kB
13-Jul-2017 00:36:45 Progress (1): 3.5/3.8 kB
13-Jul-2017 00:36:45 Progress (1): 3.8 kB   
13-Jul-2017 00:36:45                    
13-Jul-2017 00:36:45 Downloaded: https://repo.spring.io/libs-milestone-local/io/projectreactor/reactor-bom/Bismuth-M2/reactor-bom-Bismuth-M2.pom (3.8 kB at 21 kB/s)
13-Jul-2017 00:36:45 Downloading: https://repo.spring.io/libs-snapshot-local/org/apache/logging/log4j/log4j-bom/2.8.2/log4j-bom-2.8.2.pom
13-Jul-2017 00:36:45 Downloading: https://repo.spring.io/libs-milestone-local/org/apache/logging/log4j/log4j-bom/2.8.2/log4j-bom-2.8.2.pom
13-Jul-2017 00:36:45 Downloading: https://repo.spring.io/release/org/apache/logging/log4j/log4j-bom/2.8.2/log4j-bom-2.8.2.pom
13-Jul-2017 00:36:45 Downloading: https://repo.maven.apache.org/maven2/org/apache/logging/log4j/log4j-bom/2.8.2/log4j-bom-2.8.2.pom
13-Jul-2017 00:36:45 Progress (1): 2.2/5.6 kB
13-Jul-2017 00:36:45 Progress (1): 4.9/5.6 kB
13-Jul-2017 00:36:45 Progress (1): 5.6 kB   
13-Jul-2017 00:36:45                    
13-Jul-2017 00:36:45 Downloaded: https://repo.maven.apache.org/maven2/org/apache/logging/log4j/log4j-bom/2.8.2/log4j-bom-2.8.2.pom (5.6 kB at 624 kB/s)
13-Jul-2017 00:36:45 Downloading: https://repo.spring.io/libs-snapshot-local/org/apache/logging/logging-parent/1/logging-parent-1.pom
13-Jul-2017 00:36:46 Downloading: https://repo.spring.io/libs-milestone-local/org/apache/logging/logging-parent/1/logging-parent-1.pom
13-Jul-2017 00:36:46 Downloading: https://repo.spring.io/release/org/apache/logging/logging-parent/1/logging-parent-1.pom
13-Jul-2017 00:36:46 Downloading: https://repo.maven.apache.org/maven2/org/apache/logging/logging-parent/1/logging-parent-1.pom
13-Jul-2017 00:36:46 Progress (1): 2.1/3.2 kB
13-Jul-2017 00:36:46 Progress (1): 3.2 kB   
13-Jul-2017 00:36:46                    
13-Jul-2017 00:36:46 Downloaded: https://repo.maven.apache.org/maven2/org/apache/logging/logging-parent/1/logging-parent-1.pom (3.2 kB at 395 kB/s)
13-Jul-2017 00:36:46 Downloading: https://repo.spring.io/libs-snapshot-local/org/apache/apache/18/apache-18.pom
13-Jul-2017 00:36:46 Downloading: https://repo.spring.io/libs-milestone-local/org/apache/apache/18/apache-18.pom
13-Jul-2017 00:36:46 Downloading: https://repo.spring.io/release/org/apache/apache/18/apache-18.pom
13-Jul-2017 00:36:46 Downloading: https://repo.maven.apache.org/maven2/org/apache/apache/18/apache-18.pom
13-Jul-2017 00:36:46 Progress (1): 2.1/16 kB
13-Jul-2017 00:36:46 Progress (1): 4.9/16 kB
13-Jul-2017 00:36:46 Progress (1): 7.6/16 kB
13-Jul-2017 00:36:46 Progress (1): 10/16 kB
13-Jul-2017 00:36:46 Progress (1): 13/16 kB
13-Jul-2017 00:36:46 Progress (1): 16 kB   
13-Jul-2017 00:36:46                    
13-Jul-2017 00:36:46 Downloaded: https://repo.maven.apache.org/maven2/org/apache/apache/18/apache-18.pom (16 kB at 1.6 MB/s)
13-Jul-2017 00:36:46 Downloading: https://repo.spring.io/libs-snapshot-local/org/springframework/spring-framework-bom/5.0.0.RC2/spring-framework-bom-5.0.0.RC2.pom
13-Jul-2017 00:36:46 Downloading: https://repo.spring.io/libs-milestone-local/org/springframework/spring-framework-bom/5.0.0.RC2/spring-framework-bom-5.0.0.RC2.pom
13-Jul-2017 00:36:46 Progress (1): 0.8/5.4 kB
13-Jul-2017 00:36:46 Progress (1): 2.2/5.4 kB
13-Jul-2017 00:36:46 Progress (1): 3.5/5.4 kB
13-Jul-2017 00:36:46 Progress (1): 4.9/5.4 kB
13-Jul-2017 00:36:46 Progress (1): 5.4 kB   
13-Jul-2017 00:36:46                    
13-Jul-2017 00:36:46 Downloaded: https://repo.spring.io/libs-milestone-local/org/springframework/spring-framework-bom/5.0.0.RC2/spring-framework-bom-5.0.0.RC2.pom (5.4 kB at 26 kB/s)
13-Jul-2017 00:36:46 Downloading: https://repo.spring.io/libs-snapshot-local/org/springframework/data/spring-data-releasetrain/Kay-M4/spring-data-releasetrain-Kay-M4.pom
13-Jul-2017 00:36:46 Downloading: https://repo.spring.io/libs-milestone-local/org/springframework/data/spring-data-releasetrain/Kay-M4/spring-data-releasetrain-Kay-M4.pom
13-Jul-2017 00:36:47 Progress (1): 0.8/4.3 kB
13-Jul-2017 00:36:47 Progress (1): 2.2/4.3 kB
13-Jul-2017 00:36:47 Progress (1): 3.5/4.3 kB
13-Jul-2017 00:36:47 Progress (1): 4.3 kB   
13-Jul-2017 00:36:47                    
13-Jul-2017 00:36:47 Downloaded: https://repo.spring.io/libs-milestone-local/org/springframework/data/spring-data-releasetrain/Kay-M4/spring-data-releasetrain-Kay-M4.pom (4.3 kB at 21 kB/s)
13-Jul-2017 00:36:47 Downloading: https://repo.spring.io/libs-snapshot-local/org/springframework/data/build/spring-data-build/2.0.0.M4/spring-data-build-2.0.0.M4.pom
13-Jul-2017 00:36:47 Downloading: https://repo.spring.io/libs-milestone-local/org/springframework/data/build/spring-data-build/2.0.0.M4/spring-data-build-2.0.0.M4.pom
13-Jul-2017 00:36:47 Progress (1): 0.8/5.4 kB
13-Jul-2017 00:36:47 Progress (1): 2.2/5.4 kB
13-Jul-2017 00:36:47 Progress (1): 3.5/5.4 kB
13-Jul-2017 00:36:47 Progress (1): 4.9/5.4 kB
13-Jul-2017 00:36:47 Progress (1): 5.4 kB   
13-Jul-2017 00:36:47                    
13-Jul-2017 00:36:47 Downloaded: https://repo.spring.io/libs-milestone-local/org/springframework/data/build/spring-data-build/2.0.0.M4/spring-data-build-2.0.0.M4.pom (5.4 kB at 25 kB/s)
13-Jul-2017 00:36:47 Downloading: https://repo.spring.io/libs-snapshot-local/org/springframework/integration/spring-integration-bom/5.0.0.M5/spring-integration-bom-5.0.0.M5.pom
13-Jul-2017 00:36:47 Downloading: https://repo.spring.io/libs-milestone-local/org/springframework/integration/spring-integration-bom/5.0.0.M5/spring-integration-bom-5.0.0.M5.pom
13-Jul-2017 00:36:47 Progress (1): 0.8/8.5 kB
13-Jul-2017 00:36:47 Progress (1): 2.2/8.5 kB
13-Jul-2017 00:36:47 Progress (1): 3.5/8.5 kB
13-Jul-2017 00:36:47 Progress (1): 4.9/8.5 kB
13-Jul-2017 00:36:47 Progress (1): 6.3/8.5 kB
13-Jul-2017 00:36:47 Progress (1): 7.7/8.5 kB
13-Jul-2017 00:36:47 Progress (1): 8.5 kB   
13-Jul-2017 00:36:47                    
13-Jul-2017 00:36:47 Downloaded: https://repo.spring.io/libs-milestone-local/org/springframework/integration/spring-integration-bom/5.0.0.M5/spring-integration-bom-5.0.0.M5.pom (8.5 kB at 42 kB/s)
13-Jul-2017 00:36:47 Downloading: https://repo.spring.io/libs-snapshot-local/org/springframework/security/spring-security-bom/5.0.0.M2/spring-security-bom-5.0.0.M2.pom
13-Jul-2017 00:36:47 Downloading: https://repo.spring.io/libs-milestone-local/org/springframework/security/spring-security-bom/5.0.0.M2/spring-security-bom-5.0.0.M2.pom
13-Jul-2017 00:36:47 Progress (1): 0.8/3.7 kB
13-Jul-2017 00:36:47 Progress (1): 2.2/3.7 kB
13-Jul-2017 00:36:47 Progress (1): 3.5/3.7 kB
13-Jul-2017 00:36:47 Progress (1): 3.7 kB   
13-Jul-2017 00:36:48                    
13-Jul-2017 00:36:48 Downloaded: https://repo.spring.io/libs-milestone-local/org/springframework/security/spring-security-bom/5.0.0.M2/spring-security-bom-5.0.0.M2.pom (3.7 kB at 21 kB/s)
13-Jul-2017 00:36:48 Downloading: https://repo.spring.io/libs-snapshot-local/com/fasterxml/jackson/jackson-bom/2.9.0.pr4/jackson-bom-2.9.0.pr4.pom
13-Jul-2017 00:36:48 Downloading: https://repo.spring.io/libs-milestone-local/com/fasterxml/jackson/jackson-bom/2.9.0.pr4/jackson-bom-2.9.0.pr4.pom
13-Jul-2017 00:36:48 Downloading: https://repo.spring.io/release/com/fasterxml/jackson/jackson-bom/2.9.0.pr4/jackson-bom-2.9.0.pr4.pom
13-Jul-2017 00:36:48 Downloading: https://repo.maven.apache.org/maven2/com/fasterxml/jackson/jackson-bom/2.9.0.pr4/jackson-bom-2.9.0.pr4.pom
13-Jul-2017 00:36:48 Progress (1): 2.1/12 kB
13-Jul-2017 00:36:48 Progress (1): 4.9/12 kB
13-Jul-2017 00:36:48 Progress (1): 7.7/12 kB
13-Jul-2017 00:36:48 Progress (1): 10/12 kB
13-Jul-2017 00:36:48 Progress (1): 12 kB   
13-Jul-2017 00:36:48                    
13-Jul-2017 00:36:48 Downloaded: https://repo.maven.apache.org/maven2/com/fasterxml/jackson/jackson-bom/2.9.0.pr4/jackson-bom-2.9.0.pr4.pom (12 kB at 1.1 MB/s)
13-Jul-2017 00:36:48 Downloading: https://repo.spring.io/libs-snapshot-local/io/netty/netty-bom/4.1.13.Final/netty-bom-4.1.13.Final.pom
13-Jul-2017 00:36:48 Downloading: https://repo.spring.io/libs-milestone-local/io/netty/netty-bom/4.1.13.Final/netty-bom-4.1.13.Final.pom
13-Jul-2017 00:36:48 Downloading: https://repo.spring.io/release/io/netty/netty-bom/4.1.13.Final/netty-bom-4.1.13.Final.pom
13-Jul-2017 00:36:48 Downloading: https://repo.maven.apache.org/maven2/io/netty/netty-bom/4.1.13.Final/netty-bom-4.1.13.Final.pom
13-Jul-2017 00:36:48 Progress (1): 2.2/7.9 kB
13-Jul-2017 00:36:48 Progress (1): 4.9/7.9 kB
13-Jul-2017 00:36:48 Progress (1): 7.7/7.9 kB
13-Jul-2017 00:36:48 Progress (1): 7.9 kB   
13-Jul-2017 00:36:48                    
13-Jul-2017 00:36:48 Downloaded: https://repo.maven.apache.org/maven2/io/netty/netty-bom/4.1.13.Final/netty-bom-4.1.13.Final.pom (7.9 kB at 989 kB/s)
13-Jul-2017 00:36:48 Downloading: https://repo.spring.io/libs-snapshot-local/io/projectreactor/reactor-bom/Bismuth-BUILD-SNAPSHOT/maven-metadata.xml
13-Jul-2017 00:36:48 Progress (1): 799 B
13-Jul-2017 00:36:49                    
13-Jul-2017 00:36:49 Downloaded: https://repo.spring.io/libs-snapshot-local/io/projectreactor/reactor-bom/Bismuth-BUILD-SNAPSHOT/maven-metadata.xml (799 B at 4.6 kB/s)
13-Jul-2017 00:36:49 Downloading: https://repo.spring.io/libs-snapshot-local/io/projectreactor/reactor-bom/Bismuth-BUILD-SNAPSHOT/reactor-bom-Bismuth-BUILD-20170606.223055-11.pom
13-Jul-2017 00:36:49 Progress (1): 0.8/3.9 kB
13-Jul-2017 00:36:49 Progress (1): 2.2/3.9 kB
13-Jul-2017 00:36:49 Progress (1): 3.5/3.9 kB
13-Jul-2017 00:36:49 Progress (1): 3.9 kB   
13-Jul-2017 00:36:49                    
13-Jul-2017 00:36:49 Downloaded: https://repo.spring.io/libs-snapshot-local/io/projectreactor/reactor-bom/Bismuth-BUILD-SNAPSHOT/reactor-bom-Bismuth-BUILD-20170606.223055-11.pom (3.9 kB at 24 kB/s)
13-Jul-2017 00:36:49 Downloading: https://repo.spring.io/libs-snapshot-local/org/springframework/spring-framework-bom/5.0.0.BUILD-SNAPSHOT/maven-metadata.xml
13-Jul-2017 00:36:49 Progress (1): 808/813 B
13-Jul-2017 00:36:49 Progress (1): 813 B   
13-Jul-2017 00:36:49                    
13-Jul-2017 00:36:49 Downloaded: https://repo.spring.io/libs-snapshot-local/org/springframework/spring-framework-bom/5.0.0.BUILD-SNAPSHOT/maven-metadata.xml (813 B at 5.1 kB/s)
13-Jul-2017 00:36:49 Downloading: https://repo.spring.io/libs-snapshot-local/org/springframework/spring-framework-bom/5.0.0.BUILD-SNAPSHOT/spring-framework-bom-5.0.0.BUILD-20170712.171929-388.pom
13-Jul-2017 00:36:49 Progress (1): 0.8/5.6 kB
13-Jul-2017 00:36:49 Progress (1): 2.2/5.6 kB
13-Jul-2017 00:36:49 Progress (1): 3.5/5.6 kB
13-Jul-2017 00:36:49 Progress (1): 4.9/5.6 kB
13-Jul-2017 00:36:49 Progress (1): 5.6 kB   
13-Jul-2017 00:36:49                    
13-Jul-2017 00:36:49 Downloaded: https://repo.spring.io/libs-snapshot-local/org/springframework/spring-framework-bom/5.0.0.BUILD-SNAPSHOT/spring-framework-bom-5.0.0.BUILD-20170712.171929-388.pom (5.6 kB at 35 kB/s)
13-Jul-2017 00:36:49 Downloading: https://repo.spring.io/libs-snapshot-local/org/springframework/data/spring-data-releasetrain/Kay-BUILD-SNAPSHOT/maven-metadata.xml
13-Jul-2017 00:36:49 Progress (1): 629 B
13-Jul-2017 00:36:49                    
13-Jul-2017 00:36:49 Downloaded: https://repo.spring.io/libs-snapshot-local/org/springframework/data/spring-data-releasetrain/Kay-BUILD-SNAPSHOT/maven-metadata.xml (629 B at 4.0 kB/s)
13-Jul-2017 00:36:49 Downloading: https://repo.spring.io/libs-snapshot-local/org/springframework/data/spring-data-releasetrain/Kay-BUILD-SNAPSHOT/spring-data-releasetrain-Kay-BUILD-20170711.154621-94.pom
13-Jul-2017 00:36:49 Progress (1): 0.8/4.4 kB
13-Jul-2017 00:36:49 Progress (1): 2.2/4.4 kB
13-Jul-2017 00:36:49 Progress (1): 3.5/4.4 kB
13-Jul-2017 00:36:49 Progress (1): 4.4 kB   
13-Jul-2017 00:36:49                    
13-Jul-2017 00:36:49 Downloaded: https://repo.spring.io/libs-snapshot-local/org/springframework/data/spring-data-releasetrain/Kay-BUILD-SNAPSHOT/spring-data-releasetrain-Kay-BUILD-20170711.154621-94.pom (4.4 kB at 26 kB/s)
13-Jul-2017 00:36:49 Downloading: https://repo.spring.io/libs-snapshot-local/org/springframework/data/build/spring-data-build/2.0.0.BUILD-SNAPSHOT/maven-metadata.xml
13-Jul-2017 00:36:49 Progress (1): 638 B
13-Jul-2017 00:36:50                    
13-Jul-2017 00:36:50 Downloaded: https://repo.spring.io/libs-snapshot-local/org/springframework/data/build/spring-data-build/2.0.0.BUILD-SNAPSHOT/maven-metadata.xml (638 B at 4.0 kB/s)
13-Jul-2017 00:36:50 Downloading: https://repo.spring.io/libs-snapshot-local/org/springframework/data/build/spring-data-build/2.0.0.BUILD-SNAPSHOT/spring-data-build-2.0.0.BUILD-20170711.154621-93.pom
13-Jul-2017 00:36:50 Progress (1): 0.8/5.4 kB
13-Jul-2017 00:36:50 Progress (1): 2.2/5.4 kB
13-Jul-2017 00:36:50 Progress (1): 3.5/5.4 kB
13-Jul-2017 00:36:50 Progress (1): 4.9/5.4 kB
13-Jul-2017 00:36:50 Progress (1): 5.4 kB   
13-Jul-2017 00:36:50                    
13-Jul-2017 00:36:50 Downloaded: https://repo.spring.io/libs-snapshot-local/org/springframework/data/build/spring-data-build/2.0.0.BUILD-SNAPSHOT/spring-data-build-2.0.0.BUILD-20170711.154621-93.pom (5.4 kB at 33 kB/s)
13-Jul-2017 00:36:50 Downloading: https://repo.spring.io/libs-snapshot-local/org/springframework/integration/spring-integration-bom/5.0.0.BUILD-SNAPSHOT/maven-metadata.xml
13-Jul-2017 00:36:50 Progress (1): 808/827 B
13-Jul-2017 00:36:50 Progress (1): 827 B   
13-Jul-2017 00:36:50                    
13-Jul-2017 00:36:50 Downloaded: https://repo.spring.io/libs-snapshot-local/org/springframework/integration/spring-integration-bom/5.0.0.BUILD-SNAPSHOT/maven-metadata.xml (827 B at 5.2 kB/s)
13-Jul-2017 00:36:50 Downloading: https://repo.spring.io/libs-snapshot-local/org/springframework/integration/spring-integration-bom/5.0.0.BUILD-SNAPSHOT/spring-integration-bom-5.0.0.BUILD-20170712.224759-130.pom
13-Jul-2017 00:36:50 Progress (1): 0.8/8.9 kB
13-Jul-2017 00:36:50 Progress (1): 2.2/8.9 kB
13-Jul-2017 00:36:50 Progress (1): 3.5/8.9 kB
13-Jul-2017 00:36:50 Progress (1): 4.9/8.9 kB
13-Jul-2017 00:36:50 Progress (1): 6.3/8.9 kB
13-Jul-2017 00:36:50 Progress (1): 7.7/8.9 kB
13-Jul-2017 00:36:50 Progress (1): 8.9 kB   
13-Jul-2017 00:36:50                    
13-Jul-2017 00:36:50 Downloaded: https://repo.spring.io/libs-snapshot-local/org/springframework/integration/spring-integration-bom/5.0.0.BUILD-SNAPSHOT/spring-integration-bom-5.0.0.BUILD-20170712.224759-130.pom (8.9 kB at 55 kB/s)
13-Jul-2017 00:36:50 Downloading: https://repo.spring.io/libs-snapshot-local/org/springframework/security/spring-security-bom/5.0.0.BUILD-SNAPSHOT/maven-metadata.xml
13-Jul-2017 00:36:50 Progress (1): 808/821 B
13-Jul-2017 00:36:50 Progress (1): 821 B   
13-Jul-2017 00:36:50                    
13-Jul-2017 00:36:50 Downloaded: https://repo.spring.io/libs-snapshot-local/org/springframework/security/spring-security-bom/5.0.0.BUILD-SNAPSHOT/maven-metadata.xml (821 B at 5.2 kB/s)
13-Jul-2017 00:36:50 Downloading: https://repo.spring.io/libs-snapshot-local/org/springframework/security/spring-security-bom/5.0.0.BUILD-SNAPSHOT/spring-security-bom-5.0.0.BUILD-20170712.225440-174.pom
13-Jul-2017 00:36:50 Progress (1): 0.8/4.1 kB
13-Jul-2017 00:36:50 Progress (1): 2.2/4.1 kB
13-Jul-2017 00:36:50 Progress (1): 3.5/4.1 kB
13-Jul-2017 00:36:50 Progress (1): 4.1 kB   
13-Jul-2017 00:36:50                    
13-Jul-2017 00:36:50 Downloaded: https://repo.spring.io/libs-snapshot-local/org/springframework/security/spring-security-bom/5.0.0.BUILD-SNAPSHOT/spring-security-bom-5.0.0.BUILD-20170712.225440-174.pom (4.1 kB at 26 kB/s)
13-Jul-2017 00:36:51 Downloading: https://repo.maven.apache.org/maven2/com/fasterxml/jackson/jackson-bom/2.8.7/jackson-bom-2.8.7.pom
13-Jul-2017 00:36:51 Progress (1): 2.1/10 kB
13-Jul-2017 00:36:51 Progress (1): 4.9/10 kB
13-Jul-2017 00:36:51 Progress (1): 7.7/10 kB
13-Jul-2017 00:36:51 Progress (1): 10 kB   
13-Jul-2017 00:36:51                    
13-Jul-2017 00:36:51 Downloaded: https://repo.maven.apache.org/maven2/com/fasterxml/jackson/jackson-bom/2.8.7/jackson-bom-2.8.7.pom (10 kB at 1.0 MB/s)
13-Jul-2017 00:36:51 Downloading: https://repo.maven.apache.org/maven2/com/fasterxml/jackson/jackson-parent/2.8/jackson-parent-2.8.pom
13-Jul-2017 00:36:51 Progress (1): 2.1/8.0 kB
13-Jul-2017 00:36:51 Progress (1): 4.9/8.0 kB
13-Jul-2017 00:36:51 Progress (1): 7.6/8.0 kB
13-Jul-2017 00:36:51 Progress (1): 8.0 kB   
13-Jul-2017 00:36:51                    
13-Jul-2017 00:36:51 Downloaded: https://repo.maven.apache.org/maven2/com/fasterxml/jackson/jackson-parent/2.8/jackson-parent-2.8.pom (8.0 kB at 996 kB/s)
13-Jul-2017 00:36:51 Downloading: https://repo.maven.apache.org/maven2/com/fasterxml/oss-parent/27/oss-parent-27.pom
13-Jul-2017 00:36:51 Progress (1): 2.1/20 kB
13-Jul-2017 00:36:51 Progress (1): 4.9/20 kB
13-Jul-2017 00:36:51 Progress (1): 7.7/20 kB
13-Jul-2017 00:36:51 Progress (1): 10/20 kB
13-Jul-2017 00:36:51 Progress (1): 13/20 kB
13-Jul-2017 00:36:51 Progress (1): 16/20 kB
13-Jul-2017 00:36:51 Progress (1): 19/20 kB
13-Jul-2017 00:36:51 Progress (1): 20 kB   
13-Jul-2017 00:36:51                    
13-Jul-2017 00:36:51 Downloaded: https://repo.maven.apache.org/maven2/com/fasterxml/oss-parent/27/oss-parent-27.pom (20 kB at 2.0 MB/s)
13-Jul-2017 00:36:51 Downloading: https://repo.maven.apache.org/maven2/org/apache/logging/log4j/log4j-bom/2.7/log4j-bom-2.7.pom
13-Jul-2017 00:36:51 Progress (1): 2.1/5.4 kB
13-Jul-2017 00:36:51 Progress (1): 4.9/5.4 kB
13-Jul-2017 00:36:51 Progress (1): 5.4 kB   
13-Jul-2017 00:36:51                    
13-Jul-2017 00:36:51 Downloaded: https://repo.maven.apache.org/maven2/org/apache/logging/log4j/log4j-bom/2.7/log4j-bom-2.7.pom (5.4 kB at 669 kB/s)
13-Jul-2017 00:36:51 Downloading: https://repo.maven.apache.org/maven2/org/apache/apache/9/apache-9.pom
13-Jul-2017 00:36:51 Progress (1): 2.1/15 kB
13-Jul-2017 00:36:51 Progress (1): 4.9/15 kB
13-Jul-2017 00:36:51 Progress (1): 7.6/15 kB
13-Jul-2017 00:36:51 Progress (1): 10/15 kB
13-Jul-2017 00:36:51 Progress (1): 13/15 kB
13-Jul-2017 00:36:51 Progress (1): 15 kB   
13-Jul-2017 00:36:51                    
13-Jul-2017 00:36:51 Downloaded: https://repo.maven.apache.org/maven2/org/apache/apache/9/apache-9.pom (15 kB at 1.7 MB/s)
13-Jul-2017 00:36:51 Downloading: https://repo.maven.apache.org/maven2/org/springframework/spring-framework-bom/4.3.7.RELEASE/spring-framework-bom-4.3.7.RELEASE.pom
13-Jul-2017 00:36:51 Progress (1): 2.1/5.1 kB
13-Jul-2017 00:36:51 Progress (1): 4.9/5.1 kB
13-Jul-2017 00:36:51 Progress (1): 5.1 kB   
13-Jul-2017 00:36:51                    
13-Jul-2017 00:36:51 Downloaded: https://repo.maven.apache.org/maven2/org/springframework/spring-framework-bom/4.3.7.RELEASE/spring-framework-bom-4.3.7.RELEASE.pom (5.1 kB at 569 kB/s)
13-Jul-2017 00:36:51 Downloading: https://repo.maven.apache.org/maven2/org/springframework/data/spring-data-releasetrain/Ingalls-SR1/spring-data-releasetrain-Ingalls-SR1.pom
13-Jul-2017 00:36:51 Progress (1): 2.1/4.6 kB
13-Jul-2017 00:36:51 Progress (1): 4.6 kB   
13-Jul-2017 00:36:51                    
13-Jul-2017 00:36:51 Downloaded: https://repo.maven.apache.org/maven2/org/springframework/data/spring-data-releasetrain/Ingalls-SR1/spring-data-releasetrain-Ingalls-SR1.pom (4.6 kB at 459 kB/s)
13-Jul-2017 00:36:51 Downloading: https://repo.maven.apache.org/maven2/org/springframework/data/build/spring-data-build/1.9.1.RELEASE/spring-data-build-1.9.1.RELEASE.pom
13-Jul-2017 00:36:51 Progress (1): 2.1/5.4 kB
13-Jul-2017 00:36:51 Progress (1): 4.9/5.4 kB
13-Jul-2017 00:36:51 Progress (1): 5.4 kB   
13-Jul-2017 00:36:51                    
13-Jul-2017 00:36:51 Downloaded: https://repo.maven.apache.org/maven2/org/springframework/data/build/spring-data-build/1.9.1.RELEASE/spring-data-build-1.9.1.RELEASE.pom (5.4 kB at 677 kB/s)
13-Jul-2017 00:36:51 Downloading: https://repo.maven.apache.org/maven2/org/springframework/integration/spring-integration-bom/4.3.8.RELEASE/spring-integration-bom-4.3.8.RELEASE.pom
13-Jul-2017 00:36:51 Progress (1): 2.1/8.5 kB
13-Jul-2017 00:36:51 Progress (1): 4.9/8.5 kB
13-Jul-2017 00:36:51 Progress (1): 7.7/8.5 kB
13-Jul-2017 00:36:51 Progress (1): 8.5 kB   
13-Jul-2017 00:36:51                    
13-Jul-2017 00:36:51 Downloaded: https://repo.maven.apache.org/maven2/org/springframework/integration/spring-integration-bom/4.3.8.RELEASE/spring-integration-bom-4.3.8.RELEASE.pom (8.5 kB at 1.1 MB/s)
13-Jul-2017 00:36:51 Downloading: https://repo.maven.apache.org/maven2/org/springframework/security/spring-security-bom/4.2.2.RELEASE/spring-security-bom-4.2.2.RELEASE.pom
13-Jul-2017 00:36:51 Progress (1): 2.1/4.3 kB
13-Jul-2017 00:36:51 Progress (1): 4.3 kB   
13-Jul-2017 00:36:51                    
13-Jul-2017 00:36:51 Downloaded: https://repo.maven.apache.org/maven2/org/springframework/security/spring-security-bom/4.2.2.RELEASE/spring-security-bom-4.2.2.RELEASE.pom (4.3 kB at 543 kB/s)
13-Jul-2017 00:36:51 [ERROR] [ERROR] Some problems were encountered while processing the POMs:
13-Jul-2017 00:36:51 [FATAL] Non-resolvable parent POM for io.spring.cloud:timestamp-task:2.0.0.BUILD-SNAPSHOT: Could not find artifact org.springframework.boot:spring-boot-starter-parent:pom:2.0.0.BUILD-SNAPSHOT and 'parent.relativePath' points at no local POM @ line 13, column 10
13-Jul-2017 00:36:51 [FATAL] Non-resolvable parent POM for io.spring.cloud:batch-job:2.0.0.BUILD-SNAPSHOT: Could not find artifact org.springframework.boot:spring-boot-starter-parent:pom:2.0.0.BUILD-SNAPSHOT and 'parent.relativePath' points at no local POM @ line 13, column 10
13-Jul-2017 00:36:51 [ERROR] Non-resolvable import POM: Could not find artifact org.springframework.cloud:spring-cloud-task-dependencies:pom:1.2.2.BUILD-SNAPSHOT @ line 41, column 16
13-Jul-2017 00:36:51 [ERROR] 'dependencies.dependency.version' for org.springframework.cloud:spring-cloud-starter-task:jar is missing. @ line 52, column 15
13-Jul-2017 00:36:51 [WARNING] 'build.plugins.plugin.version' for org.codehaus.mojo:build-helper-maven-plugin is missing. @ org.springframework.cloud:spring-cloud-task-docs:[unknown-version], /opt/bamboo-home/xml-data/build-dir/SCT-STASK-JOB1/spring-cloud-task-docs/pom.xml, line 295, column 14
13-Jul-2017 00:36:51 @
13-Jul-2017 00:36:51 [ERROR] The build could not read 3 projects -> [Help 1]
13-Jul-2017 00:36:51 [ERROR]   
13-Jul-2017 00:36:51 [ERROR]   The project io.spring.cloud:timestamp-task:2.0.0.BUILD-SNAPSHOT (/opt/bamboo-home/xml-data/build-dir/SCT-STASK-JOB1/spring-cloud-task-samples/timestamp/pom.xml) has 1 error
13-Jul-2017 00:36:51 [ERROR]     Non-resolvable parent POM for io.spring.cloud:timestamp-task:2.0.0.BUILD-SNAPSHOT: Could not find artifact org.springframework.boot:spring-boot-starter-parent:pom:2.0.0.BUILD-SNAPSHOT and 'parent.relativePath' points at no local POM @ line 13, column 10 -> [Help 2]
13-Jul-2017 00:36:51 [ERROR]   
13-Jul-2017 00:36:51 [ERROR]   The project io.spring.cloud:batch-job:2.0.0.BUILD-SNAPSHOT (/opt/bamboo-home/xml-data/build-dir/SCT-STASK-JOB1/spring-cloud-task-samples/batch-job/pom.xml) has 1 error
13-Jul-2017 00:36:51 [ERROR]     Non-resolvable parent POM for io.spring.cloud:batch-job:2.0.0.BUILD-SNAPSHOT: Could not find artifact org.springframework.boot:spring-boot-starter-parent:pom:2.0.0.BUILD-SNAPSHOT and 'parent.relativePath' points at no local POM @ line 13, column 10 -> [Help 2]
13-Jul-2017 00:36:51 [ERROR]   
13-Jul-2017 00:36:51 [ERROR]   The project io.spring.cloud:jpa-sample:1.2.2.BUILD-SNAPSHOT (/opt/bamboo-home/xml-data/build-dir/SCT-STASK-JOB1/spring-cloud-task-samples/jpa-sample/pom.xml) has 2 errors
13-Jul-2017 00:36:51 [ERROR]     Non-resolvable import POM: Could not find artifact org.springframework.cloud:spring-cloud-task-dependencies:pom:1.2.2.BUILD-SNAPSHOT @ line 41, column 16 -> [Help 2]
13-Jul-2017 00:36:51 [ERROR]     'dependencies.dependency.version' for org.springframework.cloud:spring-cloud-starter-task:jar is missing. @ line 52, column 15
13-Jul-2017 00:36:51 [ERROR]
13-Jul-2017 00:36:51 [ERROR] To see the full stack trace of the errors, re-run Maven with the -e switch.
13-Jul-2017 00:36:51 [ERROR] Re-run Maven using the -X switch to enable full debug logging.
13-Jul-2017 00:36:51 [ERROR]
13-Jul-2017 00:36:51 [ERROR] For more information about the errors and possible solutions, please read the following articles:
13-Jul-2017 00:36:51 [ERROR] [Help 1] http://cwiki.apache.org/confluence/display/MAVEN/ProjectBuildingException
13-Jul-2017 00:36:51 [ERROR] [Help 2] http://cwiki.apache.org/confluence/display/MAVEN/UnresolvableModelException
13-Jul-2017 00:36:51
13-Jul-2017 00:36:51 Failing task since return code of [/opt/jdk-8/bin/java -cp /opt/maven-3.5/boot/plexus-classworlds-2.5.2.jar -Dclassworlds.conf=/tmp/artifactoryM28510330492013963776conf -DbuildInfoConfig.propertiesFile=/tmp/buildInfo740196879857821325properties -Xmx2048m -XX:MaxPermSize=2048m -Dmaven.home=/opt/maven-3.5 -Dmaven.multiModuleProjectDirectory=/opt/bamboo-home/xml-data/build-dir/SCT-STASK-JOB1 org.codehaus.plexus.classworlds.launcher.Launcher clean install -Pfull,skipIntegrationTests] was 1 while expected 0
13-Jul-2017 00:36:51 Parsing test results under /opt/bamboo-home/xml-data/build-dir/SCT-STASK-JOB1...
13-Jul-2017 00:36:51 Finished task 'Build and publish Spring Cloud Task Modules' with result: Failed
13-Jul-2017 00:36:51 Running post build plugin 'Docker Container Cleanup'
13-Jul-2017 00:36:51 Running post build plugin 'NCover Results Collector'
13-Jul-2017 00:36:51 Running post build plugin 'Artifactory Release Management Staging'
13-Jul-2017 00:36:51 Running post build plugin 'Artifactory Build Info Copier'
13-Jul-2017 00:36:51 Running post build plugin 'Artifactory Gradle Properties Info Copier'
13-Jul-2017 00:36:51 Running post build plugin 'Clover Results Collector'
13-Jul-2017 00:36:51 Running post build plugin 'npm Cache Cleanup'
13-Jul-2017 00:36:51 Running post build plugin 'Artifact Copier'
13-Jul-2017 00:36:51 Publishing an artifact: Test Results
13-Jul-2017 00:36:51 Finished publishing of artifact Shared artifact: [Test Results], pattern: [**/target/surefire-reports/**/*.*] in 43.51 ms
13-Jul-2017 00:36:51 Finalising the build...
13-Jul-2017 00:36:51 Stopping timer.
13-Jul-2017 00:36:51 Build SCT-STASK-JOB1-336 completed.
13-Jul-2017 00:36:51 Running on server: post build plugin 'NCover Results Collector'
13-Jul-2017 00:36:51 Running on server: post build plugin 'Build Hanging Detection Configuration'
13-Jul-2017 00:36:51 Running on server: post build plugin 'Clover Delta Calculator'
13-Jul-2017 00:36:51 Running on server: post build plugin 'Maven Dependencies Postprocessor'
13-Jul-2017 00:36:51 All post build plugins have finished
13-Jul-2017 00:36:51 Generating build results summary...
13-Jul-2017 00:36:51 Saving build results to disk...
13-Jul-2017 00:36:51 Logging substituted variables...
13-Jul-2017 00:36:51 Indexing build results...
13-Jul-2017 00:36:51 Finished building SCT-STASK-JOB1-336.