Build #362

Builds the Spring Cloud Task project

Build: #362 failed

Job: Build Spring Cloud Task Project failed

Stages & jobs

  1. Default Stage

Build log

The build generated 538 lines of output. Download or view full build log

25-Jan-2018 19:42:35 Build Spring Cloud Task - SCT Main - Build Spring Cloud Task Project #362 (SCT-STASK-JOB1-362) started building on agent bamboo-05.af.pivotal.io
25-Jan-2018 19:42:35 Remote agent on host bamboo-05.af.pivotal.io
25-Jan-2018 19:42:35 Build working directory is /opt/bamboo-home/xml-data/build-dir/SCT-STASK-JOB1
25-Jan-2018 19:42:35 Executing build Spring Cloud Task - SCT Main - Build Spring Cloud Task Project #362 (SCT-STASK-JOB1-362)
25-Jan-2018 19:42:35 Starting task 'Checkout Default Repository' of type 'com.atlassian.bamboo.plugins.vcs:task.vcs.checkout'
25-Jan-2018 19:42:35 Build always requires a clean checkout
25-Jan-2018 19:42:35 Cleaning build directory '/opt/bamboo-home/xml-data/build-dir/SCT-STASK-JOB1'
25-Jan-2018 19:42:36 Updating source code to revision: d8a73ba1835e83de8568dc0c3569916858d85987
25-Jan-2018 19:42:36 Creating local git repository in '/opt/bamboo-home/xml-data/build-dir/SCT-STASK-JOB1/.git'.
25-Jan-2018 19:42:36 Initialized empty Git repository in /opt/bamboo-home/xml-data/build-dir/SCT-STASK-JOB1/.git/
25-Jan-2018 19:42:37 Fetching 'refs/heads/master' from 'https://github.com/spring-cloud/spring-cloud-task.git'.
25-Jan-2018 19:42:37 From https://github.com/spring-cloud/spring-cloud-task
25-Jan-2018 19:42:37 * [new branch]      master     -> master
25-Jan-2018 19:42:37 * [new tag]         1.0.1.RELEASE -> 1.0.1.RELEASE
25-Jan-2018 19:42:37 Checking out revision d8a73ba1835e83de8568dc0c3569916858d85987.
25-Jan-2018 19:42:37 Already on 'master'
25-Jan-2018 19:42:37 Updated source code to revision: d8a73ba1835e83de8568dc0c3569916858d85987
25-Jan-2018 19:42:37 Finished task 'Checkout Default Repository' with result: Success
25-Jan-2018 19:42:37 Running pre-build action: Artifactory Release Staging
25-Jan-2018 19:42:37 Running pre-build action: VCS Version Collector
25-Jan-2018 19:42:37 Running pre-build action: Hung Build Killer PreBuildAction
25-Jan-2018 19:42:37 Starting task 'Build and publish Spring Cloud Task Modules' of type 'org.jfrog.bamboo.bamboo-artifactory-plugin:maven3Task'
25-Jan-2018 19:42:37 Bamboo Artifactory Plugin version: 2.3.x-SNAPSHOT
25-Jan-2018 19:42:38 Java HotSpot(TM) 64-Bit Server VM warning: ignoring option MaxPermSize=2048m; support was removed in 8.0
25-Jan-2018 19:42:40 [INFO] Scanning for projects...
25-Jan-2018 19:42:40 Downloading: https://repo.spring.io/libs-snapshot-local/org/springframework/cloud/spring-cloud-build/2.0.0.BUILD-SNAPSHOT/maven-metadata.xml
25-Jan-2018 19:42:41 Progress (1): 638 B
25-Jan-2018 19:42:41                    
25-Jan-2018 19:42:41 Downloaded: https://repo.spring.io/libs-snapshot-local/org/springframework/cloud/spring-cloud-build/2.0.0.BUILD-SNAPSHOT/maven-metadata.xml (638 B at 1.2 kB/s)
25-Jan-2018 19:42:41 Downloading: https://repo.spring.io/libs-snapshot-local/org/springframework/cloud/spring-cloud-build/2.0.0.BUILD-SNAPSHOT/spring-cloud-build-2.0.0.BUILD-20180125.181840-1914.pom
25-Jan-2018 19:42:41 Progress (1): 0.7/33 kB
25-Jan-2018 19:42:41 Progress (1): 2.1/33 kB
25-Jan-2018 19:42:41 Progress (1): 3.4/33 kB
25-Jan-2018 19:42:41 Progress (1): 4.8/33 kB
25-Jan-2018 19:42:41 Progress (1): 6.2/33 kB
25-Jan-2018 19:42:41 Progress (1): 7.6/33 kB
25-Jan-2018 19:42:41 Progress (1): 9.0/33 kB
25-Jan-2018 19:42:41 Progress (1): 10/33 kB
25-Jan-2018 19:42:41 Progress (1): 12/33 kB
25-Jan-2018 19:42:41 Progress (1): 13/33 kB
25-Jan-2018 19:42:41 Progress (1): 13/33 kB
25-Jan-2018 19:42:41 Progress (1): 15/33 kB
25-Jan-2018 19:42:41 Progress (1): 16/33 kB
25-Jan-2018 19:42:41 Progress (1): 17/33 kB
25-Jan-2018 19:42:41 Progress (1): 19/33 kB
25-Jan-2018 19:42:41 Progress (1): 20/33 kB
25-Jan-2018 19:42:41 Progress (1): 22/33 kB
25-Jan-2018 19:42:41 Progress (1): 23/33 kB
25-Jan-2018 19:42:41 Progress (1): 24/33 kB
25-Jan-2018 19:42:41 Progress (1): 26/33 kB
25-Jan-2018 19:42:41 Progress (1): 27/33 kB
25-Jan-2018 19:42:41 Progress (1): 28/33 kB
25-Jan-2018 19:42:41 Progress (1): 30/33 kB
25-Jan-2018 19:42:41 Progress (1): 31/33 kB
25-Jan-2018 19:42:41 Progress (1): 33/33 kB
25-Jan-2018 19:42:41 Progress (1): 33 kB   
25-Jan-2018 19:42:41                    
25-Jan-2018 19:42:41 Downloaded: https://repo.spring.io/libs-snapshot-local/org/springframework/cloud/spring-cloud-build/2.0.0.BUILD-SNAPSHOT/spring-cloud-build-2.0.0.BUILD-20180125.181840-1914.pom (33 kB at 138 kB/s)
25-Jan-2018 19:42:41 Downloading: https://repo.spring.io/libs-snapshot-local/org/springframework/cloud/spring-cloud-build-dependencies/2.0.0.BUILD-SNAPSHOT/maven-metadata.xml
25-Jan-2018 19:42:41 Progress (1): 651 B
25-Jan-2018 19:42:41                    
25-Jan-2018 19:42:41 Downloaded: https://repo.spring.io/libs-snapshot-local/org/springframework/cloud/spring-cloud-build-dependencies/2.0.0.BUILD-SNAPSHOT/maven-metadata.xml (651 B at 4.2 kB/s)
25-Jan-2018 19:42:41 Downloading: https://repo.spring.io/libs-snapshot-local/org/springframework/cloud/spring-cloud-build-dependencies/2.0.0.BUILD-SNAPSHOT/spring-cloud-build-dependencies-2.0.0.BUILD-20180125.181909-1913.pom
25-Jan-2018 19:42:41 Progress (1): 0.7/5.0 kB
25-Jan-2018 19:42:41 Progress (1): 2.1/5.0 kB
25-Jan-2018 19:42:41 Progress (1): 3.4/5.0 kB
25-Jan-2018 19:42:41 Progress (1): 4.8/5.0 kB
25-Jan-2018 19:42:41 Progress (1): 5.0 kB   
25-Jan-2018 19:42:42                    
25-Jan-2018 19:42:42 Downloaded: https://repo.spring.io/libs-snapshot-local/org/springframework/cloud/spring-cloud-build-dependencies/2.0.0.BUILD-SNAPSHOT/spring-cloud-build-dependencies-2.0.0.BUILD-20180125.181909-1913.pom (5.0 kB at 32 kB/s)
25-Jan-2018 19:42:43 [WARNING]
25-Jan-2018 19:42:43 [WARNING] Some problems were encountered while building the effective model for org.springframework.cloud:spring-cloud-task-docs:jar:2.0.0.BUILD-SNAPSHOT
25-Jan-2018 19:42:43 [WARNING] 'build.plugins.plugin.version' for org.codehaus.mojo:build-helper-maven-plugin is missing. @ org.springframework.cloud:spring-cloud-task-docs:[unknown-version], /opt/bamboo-home/xml-data/build-dir/SCT-STASK-JOB1/spring-cloud-task-docs/pom.xml, line 295, column 14
25-Jan-2018 19:42:43 [WARNING]
25-Jan-2018 19:42:43 [WARNING] It is highly recommended to fix these problems because they threaten the stability of your build.
25-Jan-2018 19:42:43 [WARNING]
25-Jan-2018 19:42:43 [WARNING] For this reason, future Maven versions might no longer support building such malformed projects.
25-Jan-2018 19:42:43 [WARNING]
25-Jan-2018 19:42:43 [WARNING] The project org.springframework.cloud:spring-cloud-task-parent:pom:2.0.0.BUILD-SNAPSHOT uses prerequisites which is only intended for maven-plugin projects but not for non maven-plugin projects. For such purposes you should use the maven-enforcer-plugin. See https://maven.apache.org/enforcer/enforcer-rules/requireMavenVersion.html
25-Jan-2018 19:42:43 [INFO] Initializing Artifactory Build-Info Recording
25-Jan-2018 19:42:43 [INFO] ------------------------------------------------------------------------
25-Jan-2018 19:42:43 [INFO] Reactor Build Order:
25-Jan-2018 19:42:43 [INFO]
25-Jan-2018 19:42:43 [INFO] Spring Cloud Task Dependencies
25-Jan-2018 19:42:43 [INFO] Spring Cloud Task Build
25-Jan-2018 19:42:43 [INFO] Spring Cloud Task Core
25-Jan-2018 19:42:43 [INFO] Spring Cloud Task Batch
25-Jan-2018 19:42:43 [INFO] Spring Cloud Task Stream
25-Jan-2018 19:42:43 [INFO] Spring Cloud Task Starter
25-Jan-2018 19:42:43 [INFO] Timestamp Task
25-Jan-2018 19:42:43 [INFO] Batch Job Sample Application
25-Jan-2018 19:42:43 [INFO] Task Sink Sample Application
25-Jan-2018 19:42:43 [INFO] Task Processor Sample Application
25-Jan-2018 19:42:43 [INFO] Partitioned Batch Job
25-Jan-2018 19:42:43 [INFO] Task Events
25-Jan-2018 19:42:43 [INFO] Batch Events Sample Application
25-Jan-2018 19:42:43 [INFO] Spring Cloud Task JPA Sample Application
25-Jan-2018 19:42:43 [INFO] Spring Cloud Task Samples
25-Jan-2018 19:42:43 [INFO] Spring Cloud Task Integration Tests
25-Jan-2018 19:42:43 [INFO] Spring Cloud Task Docs
25-Jan-2018 19:42:43 [INFO]
25-Jan-2018 19:42:43 [INFO] ------------------------------------------------------------------------
25-Jan-2018 19:42:43 [INFO] Building Spring Cloud Task Dependencies 2.0.0.BUILD-SNAPSHOT
25-Jan-2018 19:42:43 [INFO] ------------------------------------------------------------------------
25-Jan-2018 19:42:43 [INFO]
25-Jan-2018 19:42:43 [INFO] --- maven-clean-plugin:2.5:clean (default-clean) @ spring-cloud-task-dependencies ---
25-Jan-2018 19:42:43 [INFO]
25-Jan-2018 19:42:43 [INFO] --- maven-install-plugin:2.4:install (default-install) @ spring-cloud-task-dependencies ---
25-Jan-2018 19:42:43 [INFO] Installing /opt/bamboo-home/xml-data/build-dir/SCT-STASK-JOB1/spring-cloud-task-dependencies/pom.xml to /home/bamboo/.m2/repository/org/springframework/cloud/spring-cloud-task-dependencies/2.0.0.BUILD-SNAPSHOT/spring-cloud-task-dependencies-2.0.0.BUILD-SNAPSHOT.pom
25-Jan-2018 19:42:43 [INFO]
25-Jan-2018 19:42:43 [INFO] ------------------------------------------------------------------------
25-Jan-2018 19:42:43 [INFO] Building Spring Cloud Task Build 2.0.0.BUILD-SNAPSHOT
25-Jan-2018 19:42:43 [INFO] ------------------------------------------------------------------------
25-Jan-2018 19:42:43 Downloading: https://repo.spring.io/libs-milestone-local/org/apache/maven/plugins/maven-failsafe-plugin/maven-metadata.xml
25-Jan-2018 19:42:43 Downloading: https://repo.spring.io/libs-release-local/org/apache/maven/plugins/maven-failsafe-plugin/maven-metadata.xml
25-Jan-2018 19:42:43 Downloading: https://repo.spring.io/libs-snapshot-local/org/apache/maven/plugins/maven-failsafe-plugin/maven-metadata.xml
25-Jan-2018 19:42:43 Downloading: https://repo.spring.io/libs-snapshot-local/org/apache/maven/plugins/maven-war-plugin/maven-metadata.xml
25-Jan-2018 19:42:43 Downloading: https://repo.spring.io/libs-milestone-local/org/apache/maven/plugins/maven-war-plugin/maven-metadata.xml
25-Jan-2018 19:42:43 Downloading: https://repo.spring.io/libs-release-local/org/apache/maven/plugins/maven-war-plugin/maven-metadata.xml
25-Jan-2018 19:42:44 Downloading: https://repo.spring.io/libs-snapshot-local/org/codehaus/mojo/exec-maven-plugin/maven-metadata.xml
25-Jan-2018 19:42:44 Downloading: https://repo.spring.io/libs-milestone-local/org/codehaus/mojo/exec-maven-plugin/maven-metadata.xml
25-Jan-2018 19:42:44 Downloading: https://repo.spring.io/libs-release-local/org/codehaus/mojo/exec-maven-plugin/maven-metadata.xml
25-Jan-2018 19:42:44 [INFO]
25-Jan-2018 19:42:44 [INFO] --- maven-clean-plugin:2.5:clean (default-clean) @ spring-cloud-task-parent ---
25-Jan-2018 19:42:44 [INFO]
25-Jan-2018 19:42:44 [INFO] --- jacoco-maven-plugin:0.7.5.201505241946:prepare-agent (pre-unit-test) @ spring-cloud-task-parent ---
25-Jan-2018 19:42:45 [INFO] surefireArgLine set to -javaagent:/home/bamboo/.m2/repository/org/jacoco/org.jacoco.agent/0.7.5.201505241946/org.jacoco.agent-0.7.5.201505241946-runtime.jar=destfile=/opt/bamboo-home/xml-data/build-dir/SCT-STASK-JOB1/target/coverage-reports/jacoco-ut.exec
25-Jan-2018 19:42:45 [INFO]
25-Jan-2018 19:42:45 [INFO] --- jacoco-maven-plugin:0.7.5.201505241946:report (post-unit-test) @ spring-cloud-task-parent ---
25-Jan-2018 19:42:45 [INFO] Skipping JaCoCo execution due to missing execution data file:/opt/bamboo-home/xml-data/build-dir/SCT-STASK-JOB1/target/coverage-reports/jacoco-ut.exec
25-Jan-2018 19:42:45 [INFO]
25-Jan-2018 19:42:45 [INFO] --- maven-javadoc-plugin:2.10.3:jar (javadoc) @ spring-cloud-task-parent ---
25-Jan-2018 19:42:46 [INFO] Not executing Javadoc as the project is not a Java classpath-capable package
25-Jan-2018 19:42:46 [INFO]
25-Jan-2018 19:42:46 [INFO] --- maven-javadoc-plugin:2.10.3:jar (attach-javadocs) @ spring-cloud-task-parent ---
25-Jan-2018 19:42:46 [INFO] Not executing Javadoc as the project is not a Java classpath-capable package
25-Jan-2018 19:42:46 [INFO]
25-Jan-2018 19:42:46 [INFO] >>> maven-source-plugin:3.0.1:jar (attach-sources) > generate-sources @ spring-cloud-task-parent >>>
25-Jan-2018 19:42:46 [INFO]
25-Jan-2018 19:42:46 [INFO] --- jacoco-maven-plugin:0.7.5.201505241946:prepare-agent (pre-unit-test) @ spring-cloud-task-parent ---
25-Jan-2018 19:42:46 [INFO] surefireArgLine set to -javaagent:/home/bamboo/.m2/repository/org/jacoco/org.jacoco.agent/0.7.5.201505241946/org.jacoco.agent-0.7.5.201505241946-runtime.jar=destfile=/opt/bamboo-home/xml-data/build-dir/SCT-STASK-JOB1/target/coverage-reports/jacoco-ut.exec
25-Jan-2018 19:42:46 [INFO]
25-Jan-2018 19:42:46 [INFO] <<< maven-source-plugin:3.0.1:jar (attach-sources) < generate-sources @ spring-cloud-task-parent <<<
25-Jan-2018 19:42:46 [INFO]
25-Jan-2018 19:42:46 [INFO]
25-Jan-2018 19:42:46 [INFO] --- maven-source-plugin:3.0.1:jar (attach-sources) @ spring-cloud-task-parent ---
25-Jan-2018 19:42:47 [INFO]
25-Jan-2018 19:42:47 [INFO] --- maven-install-plugin:2.4:install (default-install) @ spring-cloud-task-parent ---
25-Jan-2018 19:42:47 [INFO] Installing /opt/bamboo-home/xml-data/build-dir/SCT-STASK-JOB1/pom.xml to /home/bamboo/.m2/repository/org/springframework/cloud/spring-cloud-task-parent/2.0.0.BUILD-SNAPSHOT/spring-cloud-task-parent-2.0.0.BUILD-SNAPSHOT.pom
25-Jan-2018 19:42:47 [INFO]
25-Jan-2018 19:42:47 [INFO] ------------------------------------------------------------------------
25-Jan-2018 19:42:47 [INFO] Building Spring Cloud Task Core 2.0.0.BUILD-SNAPSHOT
25-Jan-2018 19:42:47 [INFO] ------------------------------------------------------------------------
25-Jan-2018 19:42:47 Downloading: https://repo.spring.io/libs-snapshot-local/org/springframework/boot/spring-boot-test/2.0.0.BUILD-SNAPSHOT/maven-metadata.xml
25-Jan-2018 19:42:47 Progress (1): 0.7/1.5 kB
25-Jan-2018 19:42:47 Progress (1): 1.5 kB   
25-Jan-2018 19:42:47                    
25-Jan-2018 19:42:47 Downloaded: https://repo.spring.io/libs-snapshot-local/org/springframework/boot/spring-boot-test/2.0.0.BUILD-SNAPSHOT/maven-metadata.xml (1.5 kB at 8.8 kB/s)
25-Jan-2018 19:42:47 Downloading: https://repo.spring.io/libs-snapshot-local/org/springframework/boot/spring-boot-test/2.0.0.BUILD-SNAPSHOT/spring-boot-test-2.0.0.BUILD-20180125.181227-417.pom
25-Jan-2018 19:42:47 Progress (1): 0.7/6.7 kB
25-Jan-2018 19:42:47 Progress (1): 2.1/6.7 kB
25-Jan-2018 19:42:47 Progress (1): 3.4/6.7 kB
25-Jan-2018 19:42:47 Progress (1): 4.8/6.7 kB
25-Jan-2018 19:42:47 Progress (1): 6.2/6.7 kB
25-Jan-2018 19:42:47 Progress (1): 6.7 kB   
25-Jan-2018 19:42:48                    
25-Jan-2018 19:42:48 Downloaded: https://repo.spring.io/libs-snapshot-local/org/springframework/boot/spring-boot-test/2.0.0.BUILD-SNAPSHOT/spring-boot-test-2.0.0.BUILD-20180125.181227-417.pom (6.7 kB at 41 kB/s)
25-Jan-2018 19:42:48 Downloading: https://repo.spring.io/libs-snapshot-local/org/springframework/boot/spring-boot-test-autoconfigure/2.0.0.BUILD-SNAPSHOT/maven-metadata.xml
25-Jan-2018 19:42:48 Progress (1): 0.7/1.3 kB
25-Jan-2018 19:42:48 Progress (1): 1.3 kB   
25-Jan-2018 19:42:48                    
25-Jan-2018 19:42:48 Downloaded: https://repo.spring.io/libs-snapshot-local/org/springframework/boot/spring-boot-test-autoconfigure/2.0.0.BUILD-SNAPSHOT/maven-metadata.xml (1.3 kB at 8.1 kB/s)
25-Jan-2018 19:42:48 Downloading: https://repo.spring.io/libs-snapshot-local/org/springframework/boot/spring-boot-test-autoconfigure/2.0.0.BUILD-SNAPSHOT/spring-boot-test-autoconfigure-2.0.0.BUILD-20180125.181226-417.pom
25-Jan-2018 19:42:48 Progress (1): 0.7/9.2 kB
25-Jan-2018 19:42:48 Progress (1): 2.1/9.2 kB
25-Jan-2018 19:42:48 Progress (1): 3.4/9.2 kB
25-Jan-2018 19:42:48 Progress (1): 4.8/9.2 kB
25-Jan-2018 19:42:48 Progress (1): 6.2/9.2 kB
25-Jan-2018 19:42:48 Progress (1): 7.6/9.2 kB
25-Jan-2018 19:42:48 Progress (1): 9.0/9.2 kB
25-Jan-2018 19:42:48 Progress (1): 9.2 kB   
25-Jan-2018 19:42:48                    
25-Jan-2018 19:42:48 Downloaded: https://repo.spring.io/libs-snapshot-local/org/springframework/boot/spring-boot-test-autoconfigure/2.0.0.BUILD-SNAPSHOT/spring-boot-test-autoconfigure-2.0.0.BUILD-20180125.181226-417.pom (9.2 kB at 59 kB/s)
25-Jan-2018 19:42:48 Downloading: https://repo.spring.io/libs-snapshot-local/org/springframework/data/spring-data-commons/2.0.3.RELEASE/spring-data-commons-2.0.3.RELEASE.pom
25-Jan-2018 19:42:48 Downloading: https://repo.spring.io/libs-milestone-local/org/springframework/data/spring-data-commons/2.0.3.RELEASE/spring-data-commons-2.0.3.RELEASE.pom
25-Jan-2018 19:42:48 Downloading: https://repo.spring.io/release/org/springframework/data/spring-data-commons/2.0.3.RELEASE/spring-data-commons-2.0.3.RELEASE.pom
25-Jan-2018 19:42:48 Downloaded: https://repo.spring.io/release/org/springframework/data/spring-data-commons/2.0.3.RELEASE/spring-data-commons-2.0.3.RELEASE.pom (0 B at 0 B/s)
25-Jan-2018 19:42:48 Downloading: https://repo.spring.io/libs-snapshot-local/org/springframework/data/build/spring-data-parent/2.0.3.RELEASE/spring-data-parent-2.0.3.RELEASE.pom
25-Jan-2018 19:42:48 Downloading: https://repo.spring.io/libs-milestone-local/org/springframework/data/build/spring-data-parent/2.0.3.RELEASE/spring-data-parent-2.0.3.RELEASE.pom
25-Jan-2018 19:42:48 Downloading: https://repo.spring.io/release/org/springframework/data/build/spring-data-parent/2.0.3.RELEASE/spring-data-parent-2.0.3.RELEASE.pom
25-Jan-2018 19:42:49 Downloaded: https://repo.spring.io/release/org/springframework/data/build/spring-data-parent/2.0.3.RELEASE/spring-data-parent-2.0.3.RELEASE.pom (0 B at 0 B/s)
25-Jan-2018 19:42:49 Downloading: https://repo.spring.io/libs-snapshot-local/org/springframework/boot/spring-boot-autoconfigure/2.0.0.BUILD-SNAPSHOT/spring-boot-autoconfigure-2.0.0.BUILD-20180124.225756-411.jar
25-Jan-2018 19:42:49 Downloading: https://repo.spring.io/libs-snapshot-local/org/springframework/boot/spring-boot-starter-test/2.0.0.BUILD-SNAPSHOT/spring-boot-starter-test-2.0.0.BUILD-20180124.225840-411.jar
25-Jan-2018 19:42:49 Downloading: https://repo.spring.io/libs-snapshot-local/org/springframework/boot/spring-boot-starter/2.0.0.BUILD-SNAPSHOT/spring-boot-starter-2.0.0.BUILD-20180124.225845-410.jar
25-Jan-2018 19:42:49 Downloading: https://repo.spring.io/libs-snapshot-local/org/springframework/boot/spring-boot/2.0.0.BUILD-SNAPSHOT/spring-boot-2.0.0.BUILD-20180124.225849-410.jar
25-Jan-2018 19:42:49 Downloading: https://repo.spring.io/libs-snapshot-local/org/springframework/boot/spring-boot-starter-logging/2.0.0.BUILD-SNAPSHOT/spring-boot-starter-logging-2.0.0.BUILD-20180124.225836-411.jar
25-Jan-2018 19:42:49 Downloading: https://repo.spring.io/libs-snapshot-local/org/springframework/boot/spring-boot-test/2.0.0.BUILD-SNAPSHOT/spring-boot-test-2.0.0.BUILD-20180125.181227-417.jar
25-Jan-2018 19:42:49 Downloading: https://repo.spring.io/libs-snapshot-local/org/springframework/boot/spring-boot-test-autoconfigure/2.0.0.BUILD-SNAPSHOT/spring-boot-test-autoconfigure-2.0.0.BUILD-20180125.181226-417.jar
25-Jan-2018 19:42:49 Downloading: https://repo.spring.io/libs-snapshot-local/org/springframework/data/spring-data-commons/2.0.3.RELEASE/spring-data-commons-2.0.3.RELEASE.jar
25-Jan-2018 19:42:49 Downloading: https://repo.spring.io/libs-snapshot-local/org/springframework/integration/spring-integration-core/5.0.1.BUILD-SNAPSHOT/spring-integration-core-5.0.1.BUILD-20180124.222653-46.jar
25-Jan-2018 19:42:49 Downloading: https://repo.spring.io/libs-snapshot-local/org/springframework/integration/spring-integration-jdbc/5.0.1.BUILD-SNAPSHOT/spring-integration-jdbc-5.0.1.BUILD-20180124.222653-46.jar
25-Jan-2018 19:42:49 Progress (1): 0.7/192 kB
25-Jan-2018 19:42:49 Progress (1): 2.1/192 kB
25-Jan-2018 19:42:49 Progress (1): 3.4/192 kB
25-Jan-2018 19:42:49 Progress (1): 4.8/192 kB
25-Jan-2018 19:42:49 Progress (1): 6.2/192 kB
25-Jan-2018 19:42:49 Progress (1): 7.5/192 kB
25-Jan-2018 19:42:49 Progress (1): 8.9/192 kB
25-Jan-2018 19:42:49 Progress (1): 10/192 kB
25-Jan-2018 19:42:49 Progress (1): 12/192 kB
25-Jan-2018 19:42:49 Progress (1): 13/192 kB
25-Jan-2018 19:42:49 Progress (1): 14/192 kB
25-Jan-2018 19:42:49 Progress (1): 16/192 kB
25-Jan-2018 19:42:49 Progress (2): 16/192 kB | 0.7/158 kB
25-Jan-2018 19:42:49 Progress (2): 16/192 kB | 2.1/158 kB
25-Jan-2018 19:42:49 Progress (2): 16/192 kB | 3.4/158 kB
25-Jan-2018 19:42:49 Progress (2): 16/192 kB | 4.8/158 kB
25-Jan-2018 19:42:49 Progress (2): 16/192 kB | 6.2/158 kB
25-Jan-2018 19:42:49 Progress (2): 16/192 kB | 7.5/158 kB
25-Jan-2018 19:42:49 Progress (2): 16/192 kB | 8.9/158 kB
25-Jan-2018 19:42:49 Progress (2): 16/192 kB | 10/158 kB
25-Jan-2018 19:42:49 Progress (2): 16/192 kB | 12/158 kB
25-Jan-2018 19:42:49 Progress (2): 16/192 kB | 13/158 kB
25-Jan-2018 19:42:49 Progress (2): 16/192 kB | 13/158 kB
25-Jan-2018 19:42:49 Progress (2): 17/192 kB | 13/158 kB
25-Jan-2018 19:42:49 Progress (2): 18/192 kB | 13/158 kB
25-Jan-2018 19:42:49 Progress (2): 20/192 kB | 13/158 kB
25-Jan-2018 19:42:49                                    
25-Jan-2018 19:42:49 Downloading: https://repo.spring.io/libs-snapshot-local/org/springframework/boot/spring-boot-configuration-processor/2.0.0.BUILD-SNAPSHOT/spring-boot-configuration-processor-2.0.0.BUILD-20180124.225804-411.jar
25-Jan-2018 19:42:49 Progress (2): 20/192 kB | 15/158 kB
25-Jan-2018 19:42:49 Progress (2): 20/192 kB | 16/158 kB
25-Jan-2018 19:42:49 Progress (2): 20/192 kB | 17/158 kB
25-Jan-2018 19:42:49                                    
25-Jan-2018 19:42:49 Downloaded: https://repo.spring.io/libs-snapshot-local/org/springframework/integration/spring-integration-core/5.0.1.BUILD-SNAPSHOT/spring-integration-core-5.0.1.BUILD-20180124.222653-46.jar (0 B at 0 B/s)
25-Jan-2018 19:42:49 Downloaded: https://repo.spring.io/libs-snapshot-local/org/springframework/integration/spring-integration-jdbc/5.0.1.BUILD-SNAPSHOT/spring-integration-jdbc-5.0.1.BUILD-20180124.222653-46.jar (0 B at 0 B/s)
25-Jan-2018 19:42:49 Progress (2): 21/192 kB | 17/158 kB
25-Jan-2018 19:42:49 Progress (2): 23/192 kB | 17/158 kB
25-Jan-2018 19:42:49 Progress (2): 24/192 kB | 17/158 kB
25-Jan-2018 19:42:49 Progress (2): 25/192 kB | 17/158 kB
25-Jan-2018 19:42:49 Progress (2): 27/192 kB | 17/158 kB
25-Jan-2018 19:42:49 Progress (2): 28/192 kB | 17/158 kB
25-Jan-2018 19:42:49 Progress (2): 29/192 kB | 17/158 kB
25-Jan-2018 19:42:49 Progress (2): 31/192 kB | 17/158 kB
25-Jan-2018 19:42:49 Progress (2): 32/192 kB | 17/158 kB
25-Jan-2018 19:42:49 Progress (2): 33/192 kB | 17/158 kB
25-Jan-2018 19:42:49 Progress (2): 35/192 kB | 17/158 kB
25-Jan-2018 19:42:49 Progress (2): 36/192 kB | 17/158 kB
25-Jan-2018 19:42:49 Progress (2): 36/192 kB | 19/158 kB
25-Jan-2018 19:42:49 Progress (2): 36/192 kB | 20/158 kB
25-Jan-2018 19:42:49 Progress (2): 36/192 kB | 22/158 kB
25-Jan-2018 19:42:49 Progress (2): 36/192 kB | 23/158 kB
25-Jan-2018 19:42:49 Progress (2): 36/192 kB | 24/158 kB
25-Jan-2018 19:42:49 Progress (2): 36/192 kB | 26/158 kB
25-Jan-2018 19:42:49 Progress (2): 38/192 kB | 26/158 kB
25-Jan-2018 19:42:49 Progress (2): 39/192 kB | 26/158 kB
25-Jan-2018 19:42:49 Progress (2): 40/192 kB | 26/158 kB
25-Jan-2018 19:42:49 Progress (2): 42/192 kB | 26/158 kB
25-Jan-2018 19:42:49 Progress (2): 43/192 kB | 26/158 kB
25-Jan-2018 19:42:49 Progress (2): 44/192 kB | 26/158 kB
25-Jan-2018 19:42:49 Progress (2): 46/192 kB | 26/158 kB
25-Jan-2018 19:42:49 Progress (2): 46/192 kB | 27/158 kB
25-Jan-2018 19:42:49 Progress (2): 46/192 kB | 28/158 kB
25-Jan-2018 19:42:49 Progress (2): 46/192 kB | 30/158 kB
25-Jan-2018 19:42:49                                    
25-Jan-2018 19:42:49 Progress (2): 46/192 kB | 31/158 kB
25-Jan-2018 19:42:49 Progress (2): 46/192 kB | 33/158 kB
25-Jan-2018 19:42:49 Progress (2): 46/192 kB | 34/158 kB
25-Jan-2018 19:42:49 Progress (2): 47/192 kB | 34/158 kB
25-Jan-2018 19:42:49 Progress (2): 48/192 kB | 34/158 kB
25-Jan-2018 19:42:49 Progress (2): 50/192 kB | 34/158 kB
25-Jan-2018 19:42:49 Progress (2): 51/192 kB | 34/158 kB
25-Jan-2018 19:42:49 Progress (2): 53/192 kB | 34/158 kB
25-Jan-2018 19:42:49 Progress (2): 54/192 kB | 34/158 kB
25-Jan-2018 19:42:49 Progress (2): 54/192 kB | 35/158 kB
25-Jan-2018 19:42:49 Progress (2): 54/192 kB | 37/158 kB
25-Jan-2018 19:42:49 Progress (2): 54/192 kB | 38/158 kB
25-Jan-2018 19:42:49 Progress (2): 54/192 kB | 39/158 kB
25-Jan-2018 19:42:49 Progress (2): 54/192 kB | 41/158 kB
25-Jan-2018 19:42:49 Progress (2): 54/192 kB | 42/158 kB
25-Jan-2018 19:42:49 Progress (2): 55/192 kB | 42/158 kB
25-Jan-2018 19:42:49 Progress (2): 57/192 kB | 42/158 kB
25-Jan-2018 19:42:49 Progress (2): 58/192 kB | 42/158 kB
25-Jan-2018 19:42:49 Progress (2): 58/192 kB | 43/158 kB
25-Jan-2018 19:42:49 Progress (2): 58/192 kB | 44/158 kB
25-Jan-2018 19:42:49 Progress (2): 58/192 kB | 46/158 kB
25-Jan-2018 19:42:49 Progress (2): 58/192 kB | 47/158 kB
25-Jan-2018 19:42:49 Progress (2): 58/192 kB | 48/158 kB
25-Jan-2018 19:42:49 Progress (2): 58/192 kB | 50/158 kB
25-Jan-2018 19:42:49 Progress (2): 58/192 kB | 51/158 kB
25-Jan-2018 19:42:49 Progress (2): 58/192 kB | 53/158 kB
25-Jan-2018 19:42:49 Progress (2): 58/192 kB | 54/158 kB
25-Jan-2018 19:42:49 Progress (2): 58/192 kB | 55/158 kB
25-Jan-2018 19:42:49 Progress (2): 58/192 kB | 57/158 kB
25-Jan-2018 19:42:49 Progress (2): 58/192 kB | 58/158 kB
25-Jan-2018 19:42:49 Progress (2): 58/192 kB | 59/158 kB
25-Jan-2018 19:42:49 Progress (2): 58/192 kB | 61/158 kB
25-Jan-2018 19:42:49 Progress (2): 58/192 kB | 62/158 kB
25-Jan-2018 19:42:49 Progress (2): 58/192 kB | 64/158 kB
25-Jan-2018 19:42:49 Progress (2): 58/192 kB | 64/158 kB
25-Jan-2018 19:42:49 Progress (2): 59/192 kB | 64/158 kB
25-Jan-2018 19:42:49 Progress (2): 61/192 kB | 64/158 kB
25-Jan-2018 19:42:49 Progress (2): 62/192 kB | 64/158 kB
25-Jan-2018 19:42:49 Progress (2): 63/192 kB | 64/158 kB
25-Jan-2018 19:42:49 Progress (2): 64/192 kB | 64/158 kB
25-Jan-2018 19:42:49 Progress (2): 65/192 kB | 64/158 kB
25-Jan-2018 19:42:49 Progress (2): 66/192 kB | 64/158 kB
25-Jan-2018 19:42:49 Progress (2): 68/192 kB | 64/158 kB
25-Jan-2018 19:42:49 Progress (2): 69/192 kB | 64/158 kB
25-Jan-2018 19:42:49 Progress (2): 70/192 kB | 64/158 kB
25-Jan-2018 19:42:49 Progress (2): 72/192 kB | 64/158 kB
25-Jan-2018 19:42:49 Progress (2): 73/192 kB | 64/158 kB
25-Jan-2018 19:42:49 Progress (2): 75/192 kB | 64/158 kB
25-Jan-2018 19:42:49 Progress (2): 76/192 kB | 64/158 kB
25-Jan-2018 19:42:49 Progress (2): 77/192 kB | 64/158 kB
25-Jan-2018 19:42:49 Progress (2): 79/192 kB | 64/158 kB
25-Jan-2018 19:42:49 Progress (2): 80/192 kB | 64/158 kB
25-Jan-2018 19:42:49 Progress (2): 81/192 kB | 64/158 kB
25-Jan-2018 19:42:49 Progress (2): 83/192 kB | 64/158 kB
25-Jan-2018 19:42:49 Progress (2): 84/192 kB | 64/158 kB
25-Jan-2018 19:42:49 Progress (2): 85/192 kB | 64/158 kB
25-Jan-2018 19:42:49 Progress (2): 87/192 kB | 64/158 kB
25-Jan-2018 19:42:49 Progress (2): 88/192 kB | 64/158 kB
25-Jan-2018 19:42:49 Progress (2): 89/192 kB | 64/158 kB
25-Jan-2018 19:42:49 Progress (2): 91/192 kB | 64/158 kB
25-Jan-2018 19:42:49 Progress (2): 92/192 kB | 64/158 kB
25-Jan-2018 19:42:49 Progress (2): 94/192 kB | 64/158 kB
25-Jan-2018 19:42:49 Progress (2): 95/192 kB | 64/158 kB
25-Jan-2018 19:42:49 Progress (2): 96/192 kB | 64/158 kB
25-Jan-2018 19:42:49 Progress (2): 97/192 kB | 64/158 kB
25-Jan-2018 19:42:49 Progress (2): 97/192 kB | 65/158 kB
25-Jan-2018 19:42:49 Progress (2): 97/192 kB | 66/158 kB
25-Jan-2018 19:42:49 Progress (2): 97/192 kB | 68/158 kB
25-Jan-2018 19:42:49 Progress (2): 97/192 kB | 69/158 kB
25-Jan-2018 19:42:49 Progress (2): 97/192 kB | 70/158 kB
25-Jan-2018 19:42:49 Progress (2): 98/192 kB | 70/158 kB
25-Jan-2018 19:42:49 Progress (2): 99/192 kB | 70/158 kB
25-Jan-2018 19:42:49 Progress (2): 100/192 kB | 70/158 kB
25-Jan-2018 19:42:49 Progress (2): 102/192 kB | 70/158 kB
25-Jan-2018 19:42:49 Progress (2): 102/192 kB | 72/158 kB
25-Jan-2018 19:42:49 Progress (2): 102/192 kB | 73/158 kB
25-Jan-2018 19:42:49 Progress (2): 102/192 kB | 74/158 kB
25-Jan-2018 19:42:49 Progress (2): 103/192 kB | 74/158 kB
25-Jan-2018 19:42:49 Progress (2): 105/192 kB | 74/158 kB
25-Jan-2018 19:42:49 Progress (2): 106/192 kB | 74/158 kB
25-Jan-2018 19:42:49 Progress (2): 106/192 kB | 76/158 kB
25-Jan-2018 19:42:49 Progress (2): 106/192 kB | 77/158 kB
25-Jan-2018 19:42:49 Progress (2): 106/192 kB | 78/158 kB
25-Jan-2018 19:42:49 Progress (2): 107/192 kB | 78/158 kB
25-Jan-2018 19:42:49 Progress (2): 109/192 kB | 78/158 kB
25-Jan-2018 19:42:49 Progress (2): 110/192 kB | 78/158 kB
25-Jan-2018 19:42:49 Progress (2): 110/192 kB | 80/158 kB
25-Jan-2018 19:42:49 Progress (2): 110/192 kB | 81/158 kB
25-Jan-2018 19:42:49 Progress (2): 110/192 kB | 83/158 kB
25-Jan-2018 19:42:49 Progress (2): 110/192 kB | 84/158 kB
25-Jan-2018 19:42:49 Progress (2): 110/192 kB | 85/158 kB
25-Jan-2018 19:42:49 Progress (2): 110/192 kB | 87/158 kB
25-Jan-2018 19:42:49 Progress (2): 110/192 kB | 88/158 kB
25-Jan-2018 19:42:49 Progress (2): 110/192 kB | 89/158 kB
25-Jan-2018 19:42:49 Progress (2): 110/192 kB | 91/158 kB
25-Jan-2018 19:42:49 Progress (2): 110/192 kB | 92/158 kB
25-Jan-2018 19:42:49 Progress (2): 110/192 kB | 94/158 kB
25-Jan-2018 19:42:49 Progress (2): 110/192 kB | 95/158 kB
25-Jan-2018 19:42:49 Progress (2): 111/192 kB | 95/158 kB
25-Jan-2018 19:42:49 Progress (2): 113/192 kB | 95/158 kB
25-Jan-2018 19:42:49 Progress (2): 114/192 kB | 95/158 kB
25-Jan-2018 19:42:49 Progress (2): 115/192 kB | 95/158 kB
25-Jan-2018 19:42:49 Progress (2): 117/192 kB | 95/158 kB
25-Jan-2018 19:42:49 Progress (2): 118/192 kB | 95/158 kB
25-Jan-2018 19:42:49 Progress (2): 120/192 kB | 95/158 kB
25-Jan-2018 19:42:49 Progress (2): 121/192 kB | 95/158 kB
25-Jan-2018 19:42:49 Progress (2): 122/192 kB | 95/158 kB
25-Jan-2018 19:42:49 Progress (2): 124/192 kB | 95/158 kB
25-Jan-2018 19:42:49 Progress (2): 125/192 kB | 95/158 kB
25-Jan-2018 19:42:49 Progress (2): 126/192 kB | 95/158 kB
25-Jan-2018 19:42:49 Progress (2): 128/192 kB | 95/158 kB
25-Jan-2018 19:42:49 Progress (2): 129/192 kB | 95/158 kB
25-Jan-2018 19:42:49 Progress (2): 131/192 kB | 95/158 kB
25-Jan-2018 19:42:49 Progress (2): 132/192 kB | 95/158 kB
25-Jan-2018 19:42:49 Progress (2): 133/192 kB | 95/158 kB
25-Jan-2018 19:42:49 Progress (2): 135/192 kB | 95/158 kB
25-Jan-2018 19:42:49 Progress (2): 136/192 kB | 95/158 kB
25-Jan-2018 19:42:49 Progress (2): 138/192 kB | 95/158 kB
25-Jan-2018 19:42:49 Progress (2): 139/192 kB | 95/158 kB
25-Jan-2018 19:42:49 Progress (2): 140/192 kB | 95/158 kB
25-Jan-2018 19:42:49 Progress (2): 141/192 kB | 95/158 kB
25-Jan-2018 19:42:49 Progress (2): 143/192 kB | 95/158 kB
25-Jan-2018 19:42:49 Progress (2): 143/192 kB | 96/158 kB
25-Jan-2018 19:42:49 Progress (2): 143/192 kB | 98/158 kB
25-Jan-2018 19:42:49 Progress (2): 143/192 kB | 99/158 kB
25-Jan-2018 19:42:49 Progress (2): 143/192 kB | 100/158 kB
25-Jan-2018 19:42:49 Progress (2): 143/192 kB | 102/158 kB
25-Jan-2018 19:42:49 Progress (2): 143/192 kB | 103/158 kB
25-Jan-2018 19:42:49 Progress (2): 143/192 kB | 104/158 kB
25-Jan-2018 19:42:49 Progress (2): 143/192 kB | 106/158 kB
25-Jan-2018 19:42:49 Progress (2): 143/192 kB | 107/158 kB
25-Jan-2018 19:42:49 Progress (2): 143/192 kB | 109/158 kB
25-Jan-2018 19:42:49 Progress (2): 143/192 kB | 110/158 kB
25-Jan-2018 19:42:49 Progress (2): 143/192 kB | 111/158 kB
25-Jan-2018 19:42:49 Progress (2): 143/192 kB | 113/158 kB
25-Jan-2018 19:42:49 Progress (2): 143/192 kB | 114/158 kB
25-Jan-2018 19:42:49 Progress (2): 143/192 kB | 115/158 kB
25-Jan-2018 19:42:49 Progress (2): 143/192 kB | 117/158 kB
25-Jan-2018 19:42:49 Progress (2): 143/192 kB | 118/158 kB
25-Jan-2018 19:42:49 Progress (2): 143/192 kB | 119/158 kB
25-Jan-2018 19:42:49 Progress (2): 143/192 kB | 121/158 kB
25-Jan-2018 19:42:49 Progress (2): 143/192 kB | 122/158 kB
25-Jan-2018 19:42:49 Progress (2): 143/192 kB | 124/158 kB
25-Jan-2018 19:42:49 Progress (2): 143/192 kB | 125/158 kB
25-Jan-2018 19:42:49 Progress (2): 143/192 kB | 126/158 kB
25-Jan-2018 19:42:49 Progress (2): 143/192 kB | 128/158 kB
25-Jan-2018 19:42:49 Progress (2): 143/192 kB | 129/158 kB
25-Jan-2018 19:42:49 Progress (2): 143/192 kB | 130/158 kB
25-Jan-2018 19:42:49 Progress (2): 143/192 kB | 132/158 kB
25-Jan-2018 19:42:49 Progress (2): 143/192 kB | 133/158 kB
25-Jan-2018 19:42:49 Progress (2): 143/192 kB | 135/158 kB
25-Jan-2018 19:42:49 Progress (2): 143/192 kB | 136/158 kB
25-Jan-2018 19:42:49 Progress (2): 143/192 kB | 137/158 kB
25-Jan-2018 19:42:49 Progress (2): 143/192 kB | 139/158 kB
25-Jan-2018 19:42:49 Progress (2): 143/192 kB | 140/158 kB
25-Jan-2018 19:42:49 Progress (2): 143/192 kB | 141/158 kB
25-Jan-2018 19:42:49 Progress (2): 143/192 kB | 143/158 kB
25-Jan-2018 19:42:49 Progress (2): 143/192 kB | 144/158 kB
25-Jan-2018 19:42:49 Progress (2): 143/192 kB | 145/158 kB
25-Jan-2018 19:42:49 Progress (2): 143/192 kB | 147/158 kB
25-Jan-2018 19:42:49 Progress (2): 143/192 kB | 148/158 kB
25-Jan-2018 19:42:49 Progress (2): 144/192 kB | 148/158 kB
25-Jan-2018 19:42:49 Progress (2): 146/192 kB | 148/158 kB
25-Jan-2018 19:42:49 Progress (2): 147/192 kB | 148/158 kB
25-Jan-2018 19:42:49 Progress (2): 148/192 kB | 148/158 kB
25-Jan-2018 19:42:49 Progress (2): 150/192 kB | 148/158 kB
25-Jan-2018 19:42:49 Progress (2): 151/192 kB | 148/158 kB
25-Jan-2018 19:42:49 Progress (2): 152/192 kB | 148/158 kB
25-Jan-2018 19:42:49 Progress (2): 154/192 kB | 148/158 kB
25-Jan-2018 19:42:49 Progress (2): 155/192 kB | 148/158 kB
25-Jan-2018 19:42:49 Progress (2): 156/192 kB | 148/158 kB
25-Jan-2018 19:42:49 Progress (2): 158/192 kB | 148/158 kB
25-Jan-2018 19:42:49 Progress (2): 159/192 kB | 148/158 kB
25-Jan-2018 19:42:49 Progress (2): 160/192 kB | 148/158 kB
25-Jan-2018 19:42:49 Progress (2): 162/192 kB | 148/158 kB
25-Jan-2018 19:42:49 Progress (2): 163/192 kB | 148/158 kB
25-Jan-2018 19:42:49 Progress (2): 165/192 kB | 148/158 kB
25-Jan-2018 19:42:49 Progress (2): 166/192 kB | 148/158 kB
25-Jan-2018 19:42:49 Progress (2): 167/192 kB | 148/158 kB
25-Jan-2018 19:42:49 Progress (2): 169/192 kB | 148/158 kB
25-Jan-2018 19:42:49 Progress (2): 170/192 kB | 148/158 kB
25-Jan-2018 19:42:49 Progress (2): 171/192 kB | 148/158 kB
25-Jan-2018 19:42:49 Progress (2): 173/192 kB | 148/158 kB
25-Jan-2018 19:42:49 Progress (2): 174/192 kB | 148/158 kB
25-Jan-2018 19:42:49 Progress (2): 175/192 kB | 148/158 kB
25-Jan-2018 19:42:49 Progress (2): 177/192 kB | 148/158 kB
25-Jan-2018 19:42:49 Progress (2): 178/192 kB | 148/158 kB
25-Jan-2018 19:42:49 Progress (2): 180/192 kB | 148/158 kB
25-Jan-2018 19:42:49 Progress (2): 181/192 kB | 148/158 kB
25-Jan-2018 19:42:49 Progress (2): 182/192 kB | 148/158 kB
25-Jan-2018 19:42:49 Progress (2): 184/192 kB | 148/158 kB
25-Jan-2018 19:42:49 Progress (2): 185/192 kB | 148/158 kB
25-Jan-2018 19:42:49 Progress (2): 186/192 kB | 148/158 kB
25-Jan-2018 19:42:49 Progress (2): 188/192 kB | 148/158 kB
25-Jan-2018 19:42:49 Progress (2): 189/192 kB | 148/158 kB
25-Jan-2018 19:42:49 Progress (2): 191/192 kB | 148/158 kB
25-Jan-2018 19:42:49 Progress (2): 192/192 kB | 148/158 kB
25-Jan-2018 19:42:49 Progress (2): 192 kB | 148/158 kB   
25-Jan-2018 19:42:49 Progress (2): 192 kB | 149/158 kB
25-Jan-2018 19:42:49 Progress (2): 192 kB | 151/158 kB
25-Jan-2018 19:42:49 Progress (2): 192 kB | 152/158 kB
25-Jan-2018 19:42:49 Progress (2): 192 kB | 154/158 kB
25-Jan-2018 19:42:49 Progress (2): 192 kB | 155/158 kB
25-Jan-2018 19:42:49 Progress (2): 192 kB | 156/158 kB
25-Jan-2018 19:42:49 Progress (2): 192 kB | 158/158 kB
25-Jan-2018 19:42:49 Progress (2): 192 kB | 158 kB   
25-Jan-2018 19:42:49                              
25-Jan-2018 19:42:49 Downloaded: https://repo.spring.io/libs-snapshot-local/org/springframework/boot/spring-boot-test-autoconfigure/2.0.0.BUILD-SNAPSHOT/spring-boot-test-autoconfigure-2.0.0.BUILD-20180125.181226-417.jar (158 kB at 345 kB/s)
25-Jan-2018 19:42:49 Downloaded: https://repo.spring.io/libs-snapshot-local/org/springframework/boot/spring-boot-test/2.0.0.BUILD-SNAPSHOT/spring-boot-test-2.0.0.BUILD-20180125.181227-417.jar (192 kB at 420 kB/s)
25-Jan-2018 19:42:49 Downloading: https://repo.spring.io/libs-milestone-local/org/springframework/data/spring-data-commons/2.0.3.RELEASE/spring-data-commons-2.0.3.RELEASE.jar
25-Jan-2018 19:42:49 Downloading: https://repo.spring.io/release/org/springframework/data/spring-data-commons/2.0.3.RELEASE/spring-data-commons-2.0.3.RELEASE.jar
25-Jan-2018 19:42:49 Downloaded: https://repo.spring.io/release/org/springframework/data/spring-data-commons/2.0.3.RELEASE/spring-data-commons-2.0.3.RELEASE.jar (0 B at 0 B/s)
25-Jan-2018 19:42:49 [INFO] ------------------------------------------------------------------------
25-Jan-2018 19:42:49 [INFO] Reactor Summary:
25-Jan-2018 19:42:49 [INFO]
25-Jan-2018 19:42:49 [INFO] Spring Cloud Task Dependencies ..................... SUCCESS [  0.382 s]
25-Jan-2018 19:42:49 [INFO] Spring Cloud Task Build ............................ SUCCESS [  3.590 s]
25-Jan-2018 19:42:49 [INFO] Spring Cloud Task Core ............................. FAILURE [  2.849 s]
25-Jan-2018 19:42:49 [INFO] Spring Cloud Task Batch ............................ SKIPPED
25-Jan-2018 19:42:49 [INFO] Spring Cloud Task Stream ........................... SKIPPED
25-Jan-2018 19:42:49 [INFO] Spring Cloud Task Starter .......................... SKIPPED
25-Jan-2018 19:42:49 [INFO] Timestamp Task ..................................... SKIPPED
25-Jan-2018 19:42:49 [INFO] Batch Job Sample Application ....................... SKIPPED
25-Jan-2018 19:42:49 [INFO] Task Sink Sample Application ....................... SKIPPED
25-Jan-2018 19:42:49 [INFO] Task Processor Sample Application .................. SKIPPED
25-Jan-2018 19:42:49 [INFO] Partitioned Batch Job .............................. SKIPPED
25-Jan-2018 19:42:49 [INFO] Task Events ........................................ SKIPPED
25-Jan-2018 19:42:49 [INFO] Batch Events Sample Application .................... SKIPPED
25-Jan-2018 19:42:49 [INFO] Spring Cloud Task JPA Sample Application ........... SKIPPED
25-Jan-2018 19:42:49 [INFO] Spring Cloud Task Samples .......................... SKIPPED
25-Jan-2018 19:42:49 [INFO] Spring Cloud Task Integration Tests ................ SKIPPED
25-Jan-2018 19:42:49 [INFO] Spring Cloud Task Docs ............................. SKIPPED
25-Jan-2018 19:42:49 [INFO] ------------------------------------------------------------------------
25-Jan-2018 19:42:49 [INFO] BUILD FAILURE
25-Jan-2018 19:42:49 [INFO] ------------------------------------------------------------------------
25-Jan-2018 19:42:49 [INFO] Total time: 9.905 s
25-Jan-2018 19:42:49 [INFO] Finished at: 2018-01-25T19:42:49Z
25-Jan-2018 19:42:50 [INFO] Final Memory: 72M/323M
25-Jan-2018 19:42:50 [INFO] ------------------------------------------------------------------------
25-Jan-2018 19:42:50 [ERROR] Failed to execute goal on project spring-cloud-task-core: Could not resolve dependencies for project org.springframework.cloud:spring-cloud-task-core:jar:2.0.0.BUILD-SNAPSHOT: The following artifacts could not be resolved: org.springframework.boot:spring-boot-autoconfigure:jar:2.0.0.BUILD-SNAPSHOT, org.springframework.boot:spring-boot:jar:2.0.0.BUILD-SNAPSHOT, org.springframework.boot:spring-boot-starter-test:jar:2.0.0.BUILD-SNAPSHOT, org.springframework.boot:spring-boot-starter:jar:2.0.0.BUILD-SNAPSHOT, org.springframework.boot:spring-boot-starter-logging:jar:2.0.0.BUILD-SNAPSHOT, org.springframework.boot:spring-boot-configuration-processor:jar:2.0.0.BUILD-SNAPSHOT: Could not find artifact org.springframework.boot:spring-boot-autoconfigure:jar:2.0.0.BUILD-20180124.225756-411 in spring-snapshots (https://repo.spring.io/libs-snapshot-local) -> [Help 1]
25-Jan-2018 19:42:50 [ERROR]
25-Jan-2018 19:42:50 [ERROR] To see the full stack trace of the errors, re-run Maven with the -e switch.
25-Jan-2018 19:42:50 [ERROR] Re-run Maven using the -X switch to enable full debug logging.
25-Jan-2018 19:42:50 [ERROR]
25-Jan-2018 19:42:50 [ERROR] For more information about the errors and possible solutions, please read the following articles:
25-Jan-2018 19:42:50 [ERROR] [Help 1] http://cwiki.apache.org/confluence/display/MAVEN/DependencyResolutionException
25-Jan-2018 19:42:50 [ERROR]
25-Jan-2018 19:42:50 [ERROR] After correcting the problems, you can resume the build with the command
25-Jan-2018 19:42:50 [ERROR]   mvn <goals> -rf :spring-cloud-task-core
25-Jan-2018 19:42:50
25-Jan-2018 19:42:50 Finished task 'Build and publish Spring Cloud Task Modules' with result: Failed
25-Jan-2018 19:42:50 Running post build plugin 'Docker Container Cleanup'
25-Jan-2018 19:42:50 Running post build plugin 'NCover Results Collector'
25-Jan-2018 19:42:50 Running post build plugin 'Artifactory Release Management Staging'
25-Jan-2018 19:42:50 Running post build plugin 'Artifactory Build Info Copier'
25-Jan-2018 19:42:50 Running post build plugin 'Artifactory Gradle Properties Info Copier'
25-Jan-2018 19:42:50 Running post build plugin 'Clover Results Collector'
25-Jan-2018 19:42:50 Running post build plugin 'npm Cache Cleanup'
25-Jan-2018 19:42:50 Running post build plugin 'Artifact Copier'
25-Jan-2018 19:42:50 Publishing an artifact: Test Results
25-Jan-2018 19:42:50 Finished publishing of artifact Shared artifact: [Test Results], pattern: [**/target/surefire-reports/**/*.*] in 67.81 ms
25-Jan-2018 19:42:50 Finalising the build...
25-Jan-2018 19:42:50 Stopping timer.
25-Jan-2018 19:42:50 Build SCT-STASK-JOB1-362 completed.
25-Jan-2018 19:42:50 Running on server: post build plugin 'NCover Results Collector'
25-Jan-2018 19:42:50 Running on server: post build plugin 'Build Hanging Detection Configuration'
25-Jan-2018 19:42:50 Running on server: post build plugin 'Clover Delta Calculator'
25-Jan-2018 19:42:50 Running on server: post build plugin 'Maven Dependencies Postprocessor'
25-Jan-2018 19:42:50 All post build plugins have finished
25-Jan-2018 19:42:50 Generating build results summary...
25-Jan-2018 19:42:50 Saving build results to disk...
25-Jan-2018 19:42:50 Logging substituted variables...
25-Jan-2018 19:42:50 Indexing build results...
25-Jan-2018 19:42:50 Finished building SCT-STASK-JOB1-362.