Build #364

Builds the Spring Cloud Task project

Build: #364 failed

Job: Build Spring Cloud Task Project failed

Stages & jobs

  1. Default Stage

Build log

The build generated 9,970 lines of output.The output is too long and has been truncated to the last 1,000 lines. Download or view full build log

26-Jan-2018 22:49:37         at org.springframework.test.context.junit4.SpringJUnit4ClassRunner.runChild(SpringJUnit4ClassRunner.java:97) [spring-test-5.0.3.RELEASE.jar:5.0.3.RELEASE]
26-Jan-2018 22:49:37         at org.junit.runners.ParentRunner$3.run(ParentRunner.java:290) [junit-4.12.jar:4.12]
26-Jan-2018 22:49:37         at org.junit.runners.ParentRunner$1.schedule(ParentRunner.java:71) [junit-4.12.jar:4.12]
26-Jan-2018 22:49:37         at org.junit.runners.ParentRunner.runChildren(ParentRunner.java:288) [junit-4.12.jar:4.12]
26-Jan-2018 22:49:37         at org.junit.runners.ParentRunner.access$000(ParentRunner.java:58) [junit-4.12.jar:4.12]
26-Jan-2018 22:49:37         at org.junit.runners.ParentRunner$2.evaluate(ParentRunner.java:268) [junit-4.12.jar:4.12]
26-Jan-2018 22:49:37         at org.springframework.test.context.junit4.statements.RunBeforeTestClassCallbacks.evaluate(RunBeforeTestClassCallbacks.java:61) [spring-test-5.0.3.RELEASE.jar:5.0.3.RELEASE]
26-Jan-2018 22:49:37         at org.springframework.test.context.junit4.statements.RunAfterTestClassCallbacks.evaluate(RunAfterTestClassCallbacks.java:70) [spring-test-5.0.3.RELEASE.jar:5.0.3.RELEASE]
26-Jan-2018 22:49:37         at org.junit.runners.ParentRunner.run(ParentRunner.java:363) [junit-4.12.jar:4.12]
26-Jan-2018 22:49:37         at org.springframework.test.context.junit4.SpringJUnit4ClassRunner.run(SpringJUnit4ClassRunner.java:190) [spring-test-5.0.3.RELEASE.jar:5.0.3.RELEASE]
26-Jan-2018 22:49:37         at org.apache.maven.surefire.junit4.JUnit4Provider.execute(JUnit4Provider.java:252) [surefire-junit4-2.12.4.jar:2.12.4]
26-Jan-2018 22:49:37         at org.apache.maven.surefire.junit4.JUnit4Provider.executeTestSet(JUnit4Provider.java:141) [surefire-junit4-2.12.4.jar:2.12.4]
26-Jan-2018 22:49:37         at org.apache.maven.surefire.junit4.JUnit4Provider.invoke(JUnit4Provider.java:112) [surefire-junit4-2.12.4.jar:2.12.4]
26-Jan-2018 22:49:37         at sun.reflect.NativeMethodAccessorImpl.invoke0(Native Method) ~[na:1.8.0_144]
26-Jan-2018 22:49:37         at sun.reflect.NativeMethodAccessorImpl.invoke(NativeMethodAccessorImpl.java:62) ~[na:1.8.0_144]
26-Jan-2018 22:49:37         at sun.reflect.DelegatingMethodAccessorImpl.invoke(DelegatingMethodAccessorImpl.java:43) ~[na:1.8.0_144]
26-Jan-2018 22:49:37         at java.lang.reflect.Method.invoke(Method.java:498) ~[na:1.8.0_144]
26-Jan-2018 22:49:37         at org.apache.maven.surefire.util.ReflectionUtils.invokeMethodWithArray(ReflectionUtils.java:189) [surefire-api-2.12.4.jar:2.12.4]
26-Jan-2018 22:49:37         at org.apache.maven.surefire.booter.ProviderFactory$ProviderProxy.invoke(ProviderFactory.java:165) [surefire-booter-2.12.4.jar:2.12.4]
26-Jan-2018 22:49:37         at org.apache.maven.surefire.booter.ProviderFactory.invokeProvider(ProviderFactory.java:85) [surefire-booter-2.12.4.jar:2.12.4]
26-Jan-2018 22:49:37         at org.apache.maven.surefire.booter.ForkedBooter.runSuitesInProcess(ForkedBooter.java:115) [surefire-booter-2.12.4.jar:2.12.4]
26-Jan-2018 22:49:37         at org.apache.maven.surefire.booter.ForkedBooter.main(ForkedBooter.java:75) [surefire-booter-2.12.4.jar:2.12.4]
26-Jan-2018 22:49:37 Caused by: java.lang.NoSuchMethodError: io.micrometer.core.instrument.Tags.zip([Ljava/lang/String;)Lio/micrometer/core/instrument/Tags;
26-Jan-2018 22:49:37         at org.springframework.boot.actuate.autoconfigure.metrics.amqp.RabbitMetricsConfiguration.bindConnectionFactoryToRegistry(RabbitMetricsConfiguration.java:69) ~[spring-boot-actuator-autoconfigure-2.0.0.BUILD-SNAPSHOT.jar:2.0.0.BUILD-SNAPSHOT]
26-Jan-2018 22:49:37         at java.util.LinkedHashMap.forEach(LinkedHashMap.java:684) ~[na:1.8.0_144]
26-Jan-2018 22:49:37         at org.springframework.boot.actuate.autoconfigure.metrics.amqp.RabbitMetricsConfiguration.bindConnectionFactoriesToRegistry(RabbitMetricsConfiguration.java:64) ~[spring-boot-actuator-autoconfigure-2.0.0.BUILD-SNAPSHOT.jar:2.0.0.BUILD-SNAPSHOT]
26-Jan-2018 22:49:37         at sun.reflect.NativeMethodAccessorImpl.invoke0(Native Method) ~[na:1.8.0_144]
26-Jan-2018 22:49:37         at sun.reflect.NativeMethodAccessorImpl.invoke(NativeMethodAccessorImpl.java:62) ~[na:1.8.0_144]
26-Jan-2018 22:49:37         at sun.reflect.DelegatingMethodAccessorImpl.invoke(DelegatingMethodAccessorImpl.java:43) ~[na:1.8.0_144]
26-Jan-2018 22:49:37         at java.lang.reflect.Method.invoke(Method.java:498) ~[na:1.8.0_144]
26-Jan-2018 22:49:37         at org.springframework.beans.factory.annotation.AutowiredAnnotationBeanPostProcessor$AutowiredMethodElement.inject(AutowiredAnnotationBeanPostProcessor.java:703) ~[spring-beans-5.0.3.RELEASE.jar:5.0.3.RELEASE]
26-Jan-2018 22:49:37         at org.springframework.beans.factory.annotation.InjectionMetadata.inject(InjectionMetadata.java:91) ~[spring-beans-5.0.3.RELEASE.jar:5.0.3.RELEASE]
26-Jan-2018 22:49:37         at org.springframework.beans.factory.annotation.AutowiredAnnotationBeanPostProcessor.postProcessPropertyValues(AutowiredAnnotationBeanPostProcessor.java:373) ~[spring-beans-5.0.3.RELEASE.jar:5.0.3.RELEASE]
26-Jan-2018 22:49:37         ... 47 common frames omitted
26-Jan-2018 22:49:37
26-Jan-2018 22:49:37 2018-01-26 22:49:37.672 ERROR 21964 --- [           main] o.s.test.context.TestContextManager      : Caught exception while allowing TestExecutionListener [org.springframework.test.context.web.ServletTestExecutionListener@7751a7a2] to prepare test instance [org.springframework.cloud.task.launcher.TaskLauncherSinkTests@6d81acb]
26-Jan-2018 22:49:37
26-Jan-2018 22:49:37 java.lang.IllegalStateException: Failed to load ApplicationContext
26-Jan-2018 22:49:37         at org.springframework.test.context.cache.DefaultCacheAwareContextLoaderDelegate.loadContext(DefaultCacheAwareContextLoaderDelegate.java:125) ~[spring-test-5.0.3.RELEASE.jar:5.0.3.RELEASE]
26-Jan-2018 22:49:37         at org.springframework.test.context.support.DefaultTestContext.getApplicationContext(DefaultTestContext.java:107) ~[spring-test-5.0.3.RELEASE.jar:5.0.3.RELEASE]
26-Jan-2018 22:49:37         at org.springframework.test.context.web.ServletTestExecutionListener.setUpRequestContextIfNecessary(ServletTestExecutionListener.java:190) ~[spring-test-5.0.3.RELEASE.jar:5.0.3.RELEASE]
26-Jan-2018 22:49:37         at org.springframework.test.context.web.ServletTestExecutionListener.prepareTestInstance(ServletTestExecutionListener.java:132) ~[spring-test-5.0.3.RELEASE.jar:5.0.3.RELEASE]
26-Jan-2018 22:49:37         at org.springframework.test.context.TestContextManager.prepareTestInstance(TestContextManager.java:242) ~[spring-test-5.0.3.RELEASE.jar:5.0.3.RELEASE]
26-Jan-2018 22:49:37         at org.springframework.test.context.junit4.SpringJUnit4ClassRunner.createTest(SpringJUnit4ClassRunner.java:227) [spring-test-5.0.3.RELEASE.jar:5.0.3.RELEASE]
26-Jan-2018 22:49:37         at org.springframework.test.context.junit4.SpringJUnit4ClassRunner$1.runReflectiveCall(SpringJUnit4ClassRunner.java:289) [spring-test-5.0.3.RELEASE.jar:5.0.3.RELEASE]
26-Jan-2018 22:49:37         at org.junit.internal.runners.model.ReflectiveCallable.run(ReflectiveCallable.java:12) [junit-4.12.jar:4.12]
26-Jan-2018 22:49:37         at org.springframework.test.context.junit4.SpringJUnit4ClassRunner.methodBlock(SpringJUnit4ClassRunner.java:291) [spring-test-5.0.3.RELEASE.jar:5.0.3.RELEASE]
26-Jan-2018 22:49:37         at org.springframework.test.context.junit4.SpringJUnit4ClassRunner.runChild(SpringJUnit4ClassRunner.java:246) [spring-test-5.0.3.RELEASE.jar:5.0.3.RELEASE]
26-Jan-2018 22:49:37         at org.springframework.test.context.junit4.SpringJUnit4ClassRunner.runChild(SpringJUnit4ClassRunner.java:97) [spring-test-5.0.3.RELEASE.jar:5.0.3.RELEASE]
26-Jan-2018 22:49:37         at org.junit.runners.ParentRunner$3.run(ParentRunner.java:290) [junit-4.12.jar:4.12]
26-Jan-2018 22:49:37         at org.junit.runners.ParentRunner$1.schedule(ParentRunner.java:71) [junit-4.12.jar:4.12]
26-Jan-2018 22:49:37         at org.junit.runners.ParentRunner.runChildren(ParentRunner.java:288) [junit-4.12.jar:4.12]
26-Jan-2018 22:49:37         at org.junit.runners.ParentRunner.access$000(ParentRunner.java:58) [junit-4.12.jar:4.12]
26-Jan-2018 22:49:37         at org.junit.runners.ParentRunner$2.evaluate(ParentRunner.java:268) [junit-4.12.jar:4.12]
26-Jan-2018 22:49:37         at org.springframework.test.context.junit4.statements.RunBeforeTestClassCallbacks.evaluate(RunBeforeTestClassCallbacks.java:61) [spring-test-5.0.3.RELEASE.jar:5.0.3.RELEASE]
26-Jan-2018 22:49:37         at org.springframework.test.context.junit4.statements.RunAfterTestClassCallbacks.evaluate(RunAfterTestClassCallbacks.java:70) [spring-test-5.0.3.RELEASE.jar:5.0.3.RELEASE]
26-Jan-2018 22:49:37         at org.junit.runners.ParentRunner.run(ParentRunner.java:363) [junit-4.12.jar:4.12]
26-Jan-2018 22:49:37         at org.springframework.test.context.junit4.SpringJUnit4ClassRunner.run(SpringJUnit4ClassRunner.java:190) [spring-test-5.0.3.RELEASE.jar:5.0.3.RELEASE]
26-Jan-2018 22:49:37         at org.apache.maven.surefire.junit4.JUnit4Provider.execute(JUnit4Provider.java:252) [surefire-junit4-2.12.4.jar:2.12.4]
26-Jan-2018 22:49:37         at org.apache.maven.surefire.junit4.JUnit4Provider.executeTestSet(JUnit4Provider.java:141) [surefire-junit4-2.12.4.jar:2.12.4]
26-Jan-2018 22:49:37         at org.apache.maven.surefire.junit4.JUnit4Provider.invoke(JUnit4Provider.java:112) [surefire-junit4-2.12.4.jar:2.12.4]
26-Jan-2018 22:49:37         at sun.reflect.NativeMethodAccessorImpl.invoke0(Native Method) ~[na:1.8.0_144]
26-Jan-2018 22:49:37         at sun.reflect.NativeMethodAccessorImpl.invoke(NativeMethodAccessorImpl.java:62) ~[na:1.8.0_144]
26-Jan-2018 22:49:37         at sun.reflect.DelegatingMethodAccessorImpl.invoke(DelegatingMethodAccessorImpl.java:43) ~[na:1.8.0_144]
26-Jan-2018 22:49:37         at java.lang.reflect.Method.invoke(Method.java:498) ~[na:1.8.0_144]
26-Jan-2018 22:49:37         at org.apache.maven.surefire.util.ReflectionUtils.invokeMethodWithArray(ReflectionUtils.java:189) [surefire-api-2.12.4.jar:2.12.4]
26-Jan-2018 22:49:37         at org.apache.maven.surefire.booter.ProviderFactory$ProviderProxy.invoke(ProviderFactory.java:165) [surefire-booter-2.12.4.jar:2.12.4]
26-Jan-2018 22:49:37         at org.apache.maven.surefire.booter.ProviderFactory.invokeProvider(ProviderFactory.java:85) [surefire-booter-2.12.4.jar:2.12.4]
26-Jan-2018 22:49:37         at org.apache.maven.surefire.booter.ForkedBooter.runSuitesInProcess(ForkedBooter.java:115) [surefire-booter-2.12.4.jar:2.12.4]
26-Jan-2018 22:49:37         at org.apache.maven.surefire.booter.ForkedBooter.main(ForkedBooter.java:75) [surefire-booter-2.12.4.jar:2.12.4]
26-Jan-2018 22:49:37 Caused by: org.springframework.beans.factory.BeanCreationException: Error creating bean with name 'org.springframework.boot.actuate.autoconfigure.metrics.amqp.RabbitMetricsConfiguration': Injection of autowired dependencies failed; nested exception is java.lang.NoSuchMethodError: io.micrometer.core.instrument.Tags.zip([Ljava/lang/String;)Lio/micrometer/core/instrument/Tags;
26-Jan-2018 22:49:37         at org.springframework.beans.factory.annotation.AutowiredAnnotationBeanPostProcessor.postProcessPropertyValues(AutowiredAnnotationBeanPostProcessor.java:379) ~[spring-beans-5.0.3.RELEASE.jar:5.0.3.RELEASE]
26-Jan-2018 22:49:37         at org.springframework.beans.factory.support.AbstractAutowireCapableBeanFactory.populateBean(AbstractAutowireCapableBeanFactory.java:1344) ~[spring-beans-5.0.3.RELEASE.jar:5.0.3.RELEASE]
26-Jan-2018 22:49:37         at org.springframework.beans.factory.support.AbstractAutowireCapableBeanFactory.doCreateBean(AbstractAutowireCapableBeanFactory.java:582) ~[spring-beans-5.0.3.RELEASE.jar:5.0.3.RELEASE]
26-Jan-2018 22:49:37         at org.springframework.beans.factory.support.AbstractAutowireCapableBeanFactory.createBean(AbstractAutowireCapableBeanFactory.java:502) ~[spring-beans-5.0.3.RELEASE.jar:5.0.3.RELEASE]
26-Jan-2018 22:49:37         at org.springframework.beans.factory.support.AbstractBeanFactory.lambda$doGetBean$0(AbstractBeanFactory.java:312) ~[spring-beans-5.0.3.RELEASE.jar:5.0.3.RELEASE]
26-Jan-2018 22:49:37         at org.springframework.beans.factory.support.DefaultSingletonBeanRegistry.getSingleton(DefaultSingletonBeanRegistry.java:228) ~[spring-beans-5.0.3.RELEASE.jar:5.0.3.RELEASE]
26-Jan-2018 22:49:37         at org.springframework.beans.factory.support.AbstractBeanFactory.doGetBean(AbstractBeanFactory.java:310) ~[spring-beans-5.0.3.RELEASE.jar:5.0.3.RELEASE]
26-Jan-2018 22:49:37         at org.springframework.beans.factory.support.AbstractBeanFactory.getBean(AbstractBeanFactory.java:200) ~[spring-beans-5.0.3.RELEASE.jar:5.0.3.RELEASE]
26-Jan-2018 22:49:37         at org.springframework.beans.factory.support.DefaultListableBeanFactory.preInstantiateSingletons(DefaultListableBeanFactory.java:761) ~[spring-beans-5.0.3.RELEASE.jar:5.0.3.RELEASE]
26-Jan-2018 22:49:37         at org.springframework.context.support.AbstractApplicationContext.finishBeanFactoryInitialization(AbstractApplicationContext.java:868) ~[spring-context-5.0.3.RELEASE.jar:5.0.3.RELEASE]
26-Jan-2018 22:49:37         at org.springframework.context.support.AbstractApplicationContext.refresh(AbstractApplicationContext.java:549) ~[spring-context-5.0.3.RELEASE.jar:5.0.3.RELEASE]
26-Jan-2018 22:49:37         at org.springframework.boot.SpringApplication.refresh(SpringApplication.java:752) ~[spring-boot-2.0.0.BUILD-SNAPSHOT.jar:2.0.0.BUILD-SNAPSHOT]
26-Jan-2018 22:49:37         at org.springframework.boot.SpringApplication.refreshContext(SpringApplication.java:388) ~[spring-boot-2.0.0.BUILD-SNAPSHOT.jar:2.0.0.BUILD-SNAPSHOT]
26-Jan-2018 22:49:37         at org.springframework.boot.SpringApplication.run(SpringApplication.java:327) ~[spring-boot-2.0.0.BUILD-SNAPSHOT.jar:2.0.0.BUILD-SNAPSHOT]
26-Jan-2018 22:49:37         at org.springframework.boot.test.context.SpringBootContextLoader.loadContext(SpringBootContextLoader.java:138) ~[spring-boot-test-2.0.0.BUILD-SNAPSHOT.jar:2.0.0.BUILD-SNAPSHOT]
26-Jan-2018 22:49:37         at org.springframework.test.context.cache.DefaultCacheAwareContextLoaderDelegate.loadContextInternal(DefaultCacheAwareContextLoaderDelegate.java:99) ~[spring-test-5.0.3.RELEASE.jar:5.0.3.RELEASE]
26-Jan-2018 22:49:37         at org.springframework.test.context.cache.DefaultCacheAwareContextLoaderDelegate.loadContext(DefaultCacheAwareContextLoaderDelegate.java:117) ~[spring-test-5.0.3.RELEASE.jar:5.0.3.RELEASE]
26-Jan-2018 22:49:37         ... 31 common frames omitted
26-Jan-2018 22:49:37 Caused by: java.lang.NoSuchMethodError: io.micrometer.core.instrument.Tags.zip([Ljava/lang/String;)Lio/micrometer/core/instrument/Tags;
26-Jan-2018 22:49:37         at org.springframework.boot.actuate.autoconfigure.metrics.amqp.RabbitMetricsConfiguration.bindConnectionFactoryToRegistry(RabbitMetricsConfiguration.java:69) ~[spring-boot-actuator-autoconfigure-2.0.0.BUILD-SNAPSHOT.jar:2.0.0.BUILD-SNAPSHOT]
26-Jan-2018 22:49:37         at java.util.LinkedHashMap.forEach(LinkedHashMap.java:684) ~[na:1.8.0_144]
26-Jan-2018 22:49:37         at org.springframework.boot.actuate.autoconfigure.metrics.amqp.RabbitMetricsConfiguration.bindConnectionFactoriesToRegistry(RabbitMetricsConfiguration.java:64) ~[spring-boot-actuator-autoconfigure-2.0.0.BUILD-SNAPSHOT.jar:2.0.0.BUILD-SNAPSHOT]
26-Jan-2018 22:49:37         at sun.reflect.NativeMethodAccessorImpl.invoke0(Native Method) ~[na:1.8.0_144]
26-Jan-2018 22:49:37         at sun.reflect.NativeMethodAccessorImpl.invoke(NativeMethodAccessorImpl.java:62) ~[na:1.8.0_144]
26-Jan-2018 22:49:37         at sun.reflect.DelegatingMethodAccessorImpl.invoke(DelegatingMethodAccessorImpl.java:43) ~[na:1.8.0_144]
26-Jan-2018 22:49:37         at java.lang.reflect.Method.invoke(Method.java:498) ~[na:1.8.0_144]
26-Jan-2018 22:49:37         at org.springframework.beans.factory.annotation.AutowiredAnnotationBeanPostProcessor$AutowiredMethodElement.inject(AutowiredAnnotationBeanPostProcessor.java:703) ~[spring-beans-5.0.3.RELEASE.jar:5.0.3.RELEASE]
26-Jan-2018 22:49:37         at org.springframework.beans.factory.annotation.InjectionMetadata.inject(InjectionMetadata.java:91) ~[spring-beans-5.0.3.RELEASE.jar:5.0.3.RELEASE]
26-Jan-2018 22:49:37         at org.springframework.beans.factory.annotation.AutowiredAnnotationBeanPostProcessor.postProcessPropertyValues(AutowiredAnnotationBeanPostProcessor.java:373) ~[spring-beans-5.0.3.RELEASE.jar:5.0.3.RELEASE]
26-Jan-2018 22:49:37         ... 47 common frames omitted
26-Jan-2018 22:49:37
26-Jan-2018 22:49:37
26-Jan-2018 22:49:37   .   ____          _            __ _ _
26-Jan-2018 22:49:37 /\\ / ___'_ __ _ _(_)_ __  __ _ \ \ \ \
26-Jan-2018 22:49:37 ( ( )\___ | '_ | '_| | '_ \/ _` | \ \ \ \
26-Jan-2018 22:49:37 \\/  ___)| |_)| | | | | || (_| |  ) ) ) )
26-Jan-2018 22:49:37   '  |____| .__|_| |_|_| |_\__, | / / / /
26-Jan-2018 22:49:37 =========|_|==============|___/=/_/_/_/
26-Jan-2018 22:49:37 :: Spring Boot ::  (v2.0.0.BUILD-SNAPSHOT)
26-Jan-2018 22:49:37
26-Jan-2018 22:49:37 2018-01-26 22:49:37.693  INFO 21964 --- [           main] o.s.c.t.launcher.TaskLauncherSinkTests   : Starting TaskLauncherSinkTests on bamboo-12 with PID 21964 (started by bamboo in /opt/bamboo-home/xml-data/build-dir/SCT-STASK-JOB1/spring-cloud-task-stream)
26-Jan-2018 22:49:37 2018-01-26 22:49:37.694  INFO 21964 --- [           main] o.s.c.t.launcher.TaskLauncherSinkTests   : No active profile set, falling back to default profiles: default
26-Jan-2018 22:49:37 2018-01-26 22:49:37.696  INFO 21964 --- [           main] o.s.w.c.s.GenericWebApplicationContext   : Refreshing org.springframework.web.context.support.GenericWebApplicationContext@52bd2f58: startup date [Fri Jan 26 22:49:37 UTC 2018]; root of context hierarchy
26-Jan-2018 22:49:37 2018-01-26 22:49:37.863  INFO 21964 --- [           main] o.s.i.config.IntegrationRegistrar        : No bean named 'integrationHeaderChannelRegistry' has been explicitly defined. Therefore, a default DefaultHeaderChannelRegistry will be created.
26-Jan-2018 22:49:37 2018-01-26 22:49:37.868  INFO 21964 --- [           main] o.s.b.f.s.DefaultListableBeanFactory     : Overriding bean definition for bean 'binderFactory' with a different definition: replacing [Root bean: class [null]; scope=; abstract=false; lazyInit=false; autowireMode=3; dependencyCheck=0; autowireCandidate=true; primary=false; factoryBeanName=org.springframework.cloud.stream.config.BinderFactoryConfiguration; factoryMethodName=binderFactory; initMethodName=null; destroyMethodName=(inferred); defined in org.springframework.cloud.stream.config.BinderFactoryConfiguration] with [Root bean: class [null]; scope=; abstract=false; lazyInit=false; autowireMode=3; dependencyCheck=0; autowireCandidate=true; primary=false; factoryBeanName=org.springframework.cloud.stream.test.binder.TestSupportBinderAutoConfiguration; factoryMethodName=binderFactory; initMethodName=null; destroyMethodName=(inferred); defined in class path resource [org/springframework/cloud/stream/test/binder/TestSupportBinderAutoConfiguration.class]]
26-Jan-2018 22:49:37 2018-01-26 22:49:37.944  INFO 21964 --- [           main] faultConfiguringBeanFactoryPostProcessor : No bean named 'errorChannel' has been explicitly defined. Therefore, a default PublishSubscribeChannel will be created.
26-Jan-2018 22:49:37 2018-01-26 22:49:37.944  INFO 21964 --- [           main] faultConfiguringBeanFactoryPostProcessor : No bean named 'taskScheduler' has been explicitly defined. Therefore, a default ThreadPoolTaskScheduler will be created.
26-Jan-2018 22:49:37 2018-01-26 22:49:37.980  INFO 21964 --- [           main] trationDelegate$BeanPostProcessorChecker : Bean 'org.springframework.amqp.rabbit.annotation.RabbitBootstrapConfiguration' of type [org.springframework.amqp.rabbit.annotation.RabbitBootstrapConfiguration$$EnhancerBySpringCGLIB$$b9b3e62c] is not eligible for getting processed by all BeanPostProcessors (for example: not eligible for auto-proxying)
26-Jan-2018 22:49:38 2018-01-26 22:49:38.001  INFO 21964 --- [           main] trationDelegate$BeanPostProcessorChecker : Bean 'org.springframework.transaction.annotation.ProxyTransactionManagementConfiguration' of type [org.springframework.transaction.annotation.ProxyTransactionManagementConfiguration$$EnhancerBySpringCGLIB$$f34827fe] is not eligible for getting processed by all BeanPostProcessors (for example: not eligible for auto-proxying)
26-Jan-2018 22:49:38 2018-01-26 22:49:38.016  INFO 21964 --- [           main] trationDelegate$BeanPostProcessorChecker : Bean 'org.springframework.cloud.stream.config.BindingServiceConfiguration$PostProcessorConfiguration' of type [org.springframework.cloud.stream.config.BindingServiceConfiguration$PostProcessorConfiguration$$EnhancerBySpringCGLIB$$b50fc603] is not eligible for getting processed by all BeanPostProcessors (for example: not eligible for auto-proxying)
26-Jan-2018 22:49:38 2018-01-26 22:49:38.025  INFO 21964 --- [           main] trationDelegate$BeanPostProcessorChecker : Bean 'org.springframework.cloud.stream.config.SpelExpressionConverterConfiguration' of type [org.springframework.cloud.stream.config.SpelExpressionConverterConfiguration$$EnhancerBySpringCGLIB$$f3847ff3] is not eligible for getting processed by all BeanPostProcessors (for example: not eligible for auto-proxying)
26-Jan-2018 22:49:38 2018-01-26 22:49:38.028  INFO 21964 --- [           main] trationDelegate$BeanPostProcessorChecker : Bean 'spelConverter' of type [org.springframework.cloud.stream.config.SpelExpressionConverterConfiguration$SpelConverter] is not eligible for getting processed by all BeanPostProcessors (for example: not eligible for auto-proxying)
26-Jan-2018 22:49:38 2018-01-26 22:49:38.030  INFO 21964 --- [           main] trationDelegate$BeanPostProcessorChecker : Bean 'org.springframework.boot.context.properties.ConfigurationPropertiesBinderBuilder$ConversionServiceFactory' of type [org.springframework.boot.context.properties.ConfigurationPropertiesBinderBuilder$ConversionServiceFactory] is not eligible for getting processed by all BeanPostProcessors (for example: not eligible for auto-proxying)
26-Jan-2018 22:49:38 2018-01-26 22:49:38.038  INFO 21964 --- [           main] trationDelegate$BeanPostProcessorChecker : Bean 'spring.cloud.stream.integration-org.springframework.cloud.stream.config.SpringIntegrationProperties' of type [org.springframework.cloud.stream.config.SpringIntegrationProperties] is not eligible for getting processed by all BeanPostProcessors (for example: not eligible for auto-proxying)
26-Jan-2018 22:49:38 2018-01-26 22:49:38.364  INFO 21964 --- [           main] o.s.s.c.ThreadPoolTaskScheduler          : Initializing ExecutorService  'taskScheduler'
26-Jan-2018 22:49:38 2018-01-26 22:49:38.529  INFO 21964 --- [           main] o.s.j.d.e.EmbeddedDatabaseFactory        : Starting embedded database: url='jdbc:h2:mem:testdb;DB_CLOSE_DELAY=-1;DB_CLOSE_ON_EXIT=false', username='sa'
26-Jan-2018 22:49:38 2018-01-26 22:49:38.676  INFO 21964 --- [           main] s.w.s.m.m.a.RequestMappingHandlerAdapter : Looking for @ControllerAdvice: org.springframework.web.context.support.GenericWebApplicationContext@52bd2f58: startup date [Fri Jan 26 22:49:37 UTC 2018]; root of context hierarchy
26-Jan-2018 22:49:38 2018-01-26 22:49:38.705  INFO 21964 --- [           main] s.w.s.m.m.a.RequestMappingHandlerMapping : Mapped "{[/error],produces=[text/html]}" onto public org.springframework.web.servlet.ModelAndView org.springframework.boot.autoconfigure.web.servlet.error.BasicErrorController.errorHtml(javax.servlet.http.HttpServletRequest,javax.servlet.http.HttpServletResponse)
26-Jan-2018 22:49:38 2018-01-26 22:49:38.706  INFO 21964 --- [           main] s.w.s.m.m.a.RequestMappingHandlerMapping : Mapped "{[/error]}" onto public org.springframework.http.ResponseEntity<java.util.Map<java.lang.String, java.lang.Object>> org.springframework.boot.autoconfigure.web.servlet.error.BasicErrorController.error(javax.servlet.http.HttpServletRequest)
26-Jan-2018 22:49:38 2018-01-26 22:49:38.757  INFO 21964 --- [           main] o.s.w.s.handler.SimpleUrlHandlerMapping  : Mapped URL path [/webjars/**] onto handler of type [class org.springframework.web.servlet.resource.ResourceHttpRequestHandler]
26-Jan-2018 22:49:38 2018-01-26 22:49:38.758  INFO 21964 --- [           main] o.s.w.s.handler.SimpleUrlHandlerMapping  : Mapped URL path [/**] onto handler of type [class org.springframework.web.servlet.resource.ResourceHttpRequestHandler]
26-Jan-2018 22:49:38 2018-01-26 22:49:38.803  INFO 21964 --- [           main] o.s.w.s.handler.SimpleUrlHandlerMapping  : Mapped URL path [/**/favicon.ico] onto handler of type [class org.springframework.web.servlet.resource.ResourceHttpRequestHandler]
26-Jan-2018 22:49:39 2018-01-26 22:49:39.249  WARN 21964 --- [           main] o.s.w.c.s.GenericWebApplicationContext   : Exception encountered during context initialization - cancelling refresh attempt: org.springframework.beans.factory.BeanCreationException: Error creating bean with name 'org.springframework.boot.actuate.autoconfigure.metrics.amqp.RabbitMetricsConfiguration': Injection of autowired dependencies failed; nested exception is java.lang.NoSuchMethodError: io.micrometer.core.instrument.Tags.zip([Ljava/lang/String;)Lio/micrometer/core/instrument/Tags;
26-Jan-2018 22:49:39 2018-01-26 22:49:39.250  INFO 21964 --- [           main] o.s.j.d.e.EmbeddedDatabaseFactory        : Shutting down embedded database: url='jdbc:h2:mem:testdb;DB_CLOSE_DELAY=-1;DB_CLOSE_ON_EXIT=false'
26-Jan-2018 22:49:39 2018-01-26 22:49:39.251  INFO 21964 --- [           main] o.s.s.c.ThreadPoolTaskScheduler          : Shutting down ExecutorService 'taskScheduler'
26-Jan-2018 22:49:39 2018-01-26 22:49:39.255  INFO 21964 --- [           main] ConditionEvaluationReportLoggingListener :
26-Jan-2018 22:49:39
26-Jan-2018 22:49:39 Error starting ApplicationContext. To display the conditions report re-run your application with 'debug' enabled.
26-Jan-2018 22:49:39 2018-01-26 22:49:39.256 ERROR 21964 --- [           main] o.s.boot.SpringApplication               : Application run failed
26-Jan-2018 22:49:39
26-Jan-2018 22:49:39 org.springframework.beans.factory.BeanCreationException: Error creating bean with name 'org.springframework.boot.actuate.autoconfigure.metrics.amqp.RabbitMetricsConfiguration': Injection of autowired dependencies failed; nested exception is java.lang.NoSuchMethodError: io.micrometer.core.instrument.Tags.zip([Ljava/lang/String;)Lio/micrometer/core/instrument/Tags;
26-Jan-2018 22:49:39         at org.springframework.beans.factory.annotation.AutowiredAnnotationBeanPostProcessor.postProcessPropertyValues(AutowiredAnnotationBeanPostProcessor.java:379) ~[spring-beans-5.0.3.RELEASE.jar:5.0.3.RELEASE]
26-Jan-2018 22:49:39         at org.springframework.beans.factory.support.AbstractAutowireCapableBeanFactory.populateBean(AbstractAutowireCapableBeanFactory.java:1344) ~[spring-beans-5.0.3.RELEASE.jar:5.0.3.RELEASE]
26-Jan-2018 22:49:39         at org.springframework.beans.factory.support.AbstractAutowireCapableBeanFactory.doCreateBean(AbstractAutowireCapableBeanFactory.java:582) ~[spring-beans-5.0.3.RELEASE.jar:5.0.3.RELEASE]
26-Jan-2018 22:49:39         at org.springframework.beans.factory.support.AbstractAutowireCapableBeanFactory.createBean(AbstractAutowireCapableBeanFactory.java:502) ~[spring-beans-5.0.3.RELEASE.jar:5.0.3.RELEASE]
26-Jan-2018 22:49:39         at org.springframework.beans.factory.support.AbstractBeanFactory.lambda$doGetBean$0(AbstractBeanFactory.java:312) ~[spring-beans-5.0.3.RELEASE.jar:5.0.3.RELEASE]
26-Jan-2018 22:49:39         at org.springframework.beans.factory.support.DefaultSingletonBeanRegistry.getSingleton(DefaultSingletonBeanRegistry.java:228) ~[spring-beans-5.0.3.RELEASE.jar:5.0.3.RELEASE]
26-Jan-2018 22:49:39         at org.springframework.beans.factory.support.AbstractBeanFactory.doGetBean(AbstractBeanFactory.java:310) ~[spring-beans-5.0.3.RELEASE.jar:5.0.3.RELEASE]
26-Jan-2018 22:49:39         at org.springframework.beans.factory.support.AbstractBeanFactory.getBean(AbstractBeanFactory.java:200) ~[spring-beans-5.0.3.RELEASE.jar:5.0.3.RELEASE]
26-Jan-2018 22:49:39         at org.springframework.beans.factory.support.DefaultListableBeanFactory.preInstantiateSingletons(DefaultListableBeanFactory.java:761) ~[spring-beans-5.0.3.RELEASE.jar:5.0.3.RELEASE]
26-Jan-2018 22:49:39         at org.springframework.context.support.AbstractApplicationContext.finishBeanFactoryInitialization(AbstractApplicationContext.java:868) ~[spring-context-5.0.3.RELEASE.jar:5.0.3.RELEASE]
26-Jan-2018 22:49:39         at org.springframework.context.support.AbstractApplicationContext.refresh(AbstractApplicationContext.java:549) ~[spring-context-5.0.3.RELEASE.jar:5.0.3.RELEASE]
26-Jan-2018 22:49:39         at org.springframework.boot.SpringApplication.refresh(SpringApplication.java:752) ~[spring-boot-2.0.0.BUILD-SNAPSHOT.jar:2.0.0.BUILD-SNAPSHOT]
26-Jan-2018 22:49:39         at org.springframework.boot.SpringApplication.refreshContext(SpringApplication.java:388) ~[spring-boot-2.0.0.BUILD-SNAPSHOT.jar:2.0.0.BUILD-SNAPSHOT]
26-Jan-2018 22:49:39         at org.springframework.boot.SpringApplication.run(SpringApplication.java:327) ~[spring-boot-2.0.0.BUILD-SNAPSHOT.jar:2.0.0.BUILD-SNAPSHOT]
26-Jan-2018 22:49:39         at org.springframework.boot.test.context.SpringBootContextLoader.loadContext(SpringBootContextLoader.java:138) [spring-boot-test-2.0.0.BUILD-SNAPSHOT.jar:2.0.0.BUILD-SNAPSHOT]
26-Jan-2018 22:49:39         at org.springframework.test.context.cache.DefaultCacheAwareContextLoaderDelegate.loadContextInternal(DefaultCacheAwareContextLoaderDelegate.java:99) [spring-test-5.0.3.RELEASE.jar:5.0.3.RELEASE]
26-Jan-2018 22:49:39         at org.springframework.test.context.cache.DefaultCacheAwareContextLoaderDelegate.loadContext(DefaultCacheAwareContextLoaderDelegate.java:117) [spring-test-5.0.3.RELEASE.jar:5.0.3.RELEASE]
26-Jan-2018 22:49:39         at org.springframework.test.context.support.DefaultTestContext.getApplicationContext(DefaultTestContext.java:107) [spring-test-5.0.3.RELEASE.jar:5.0.3.RELEASE]
26-Jan-2018 22:49:39         at org.springframework.test.context.web.ServletTestExecutionListener.setUpRequestContextIfNecessary(ServletTestExecutionListener.java:190) [spring-test-5.0.3.RELEASE.jar:5.0.3.RELEASE]
26-Jan-2018 22:49:39         at org.springframework.test.context.web.ServletTestExecutionListener.prepareTestInstance(ServletTestExecutionListener.java:132) [spring-test-5.0.3.RELEASE.jar:5.0.3.RELEASE]
26-Jan-2018 22:49:39         at org.springframework.test.context.TestContextManager.prepareTestInstance(TestContextManager.java:242) [spring-test-5.0.3.RELEASE.jar:5.0.3.RELEASE]
26-Jan-2018 22:49:39         at org.springframework.test.context.junit4.SpringJUnit4ClassRunner.createTest(SpringJUnit4ClassRunner.java:227) [spring-test-5.0.3.RELEASE.jar:5.0.3.RELEASE]
26-Jan-2018 22:49:39         at org.springframework.test.context.junit4.SpringJUnit4ClassRunner$1.runReflectiveCall(SpringJUnit4ClassRunner.java:289) [spring-test-5.0.3.RELEASE.jar:5.0.3.RELEASE]
26-Jan-2018 22:49:39         at org.junit.internal.runners.model.ReflectiveCallable.run(ReflectiveCallable.java:12) [junit-4.12.jar:4.12]
26-Jan-2018 22:49:39         at org.springframework.test.context.junit4.SpringJUnit4ClassRunner.methodBlock(SpringJUnit4ClassRunner.java:291) [spring-test-5.0.3.RELEASE.jar:5.0.3.RELEASE]
26-Jan-2018 22:49:39         at org.springframework.test.context.junit4.SpringJUnit4ClassRunner.runChild(SpringJUnit4ClassRunner.java:246) [spring-test-5.0.3.RELEASE.jar:5.0.3.RELEASE]
26-Jan-2018 22:49:39         at org.springframework.test.context.junit4.SpringJUnit4ClassRunner.runChild(SpringJUnit4ClassRunner.java:97) [spring-test-5.0.3.RELEASE.jar:5.0.3.RELEASE]
26-Jan-2018 22:49:39         at org.junit.runners.ParentRunner$3.run(ParentRunner.java:290) [junit-4.12.jar:4.12]
26-Jan-2018 22:49:39         at org.junit.runners.ParentRunner$1.schedule(ParentRunner.java:71) [junit-4.12.jar:4.12]
26-Jan-2018 22:49:39         at org.junit.runners.ParentRunner.runChildren(ParentRunner.java:288) [junit-4.12.jar:4.12]
26-Jan-2018 22:49:39         at org.junit.runners.ParentRunner.access$000(ParentRunner.java:58) [junit-4.12.jar:4.12]
26-Jan-2018 22:49:39         at org.junit.runners.ParentRunner$2.evaluate(ParentRunner.java:268) [junit-4.12.jar:4.12]
26-Jan-2018 22:49:39         at org.springframework.test.context.junit4.statements.RunBeforeTestClassCallbacks.evaluate(RunBeforeTestClassCallbacks.java:61) [spring-test-5.0.3.RELEASE.jar:5.0.3.RELEASE]
26-Jan-2018 22:49:39         at org.springframework.test.context.junit4.statements.RunAfterTestClassCallbacks.evaluate(RunAfterTestClassCallbacks.java:70) [spring-test-5.0.3.RELEASE.jar:5.0.3.RELEASE]
26-Jan-2018 22:49:39         at org.junit.runners.ParentRunner.run(ParentRunner.java:363) [junit-4.12.jar:4.12]
26-Jan-2018 22:49:39         at org.springframework.test.context.junit4.SpringJUnit4ClassRunner.run(SpringJUnit4ClassRunner.java:190) [spring-test-5.0.3.RELEASE.jar:5.0.3.RELEASE]
26-Jan-2018 22:49:39         at org.apache.maven.surefire.junit4.JUnit4Provider.execute(JUnit4Provider.java:252) [surefire-junit4-2.12.4.jar:2.12.4]
26-Jan-2018 22:49:39         at org.apache.maven.surefire.junit4.JUnit4Provider.executeTestSet(JUnit4Provider.java:141) [surefire-junit4-2.12.4.jar:2.12.4]
26-Jan-2018 22:49:39         at org.apache.maven.surefire.junit4.JUnit4Provider.invoke(JUnit4Provider.java:112) [surefire-junit4-2.12.4.jar:2.12.4]
26-Jan-2018 22:49:39         at sun.reflect.NativeMethodAccessorImpl.invoke0(Native Method) ~[na:1.8.0_144]
26-Jan-2018 22:49:39         at sun.reflect.NativeMethodAccessorImpl.invoke(NativeMethodAccessorImpl.java:62) ~[na:1.8.0_144]
26-Jan-2018 22:49:39         at sun.reflect.DelegatingMethodAccessorImpl.invoke(DelegatingMethodAccessorImpl.java:43) ~[na:1.8.0_144]
26-Jan-2018 22:49:39         at java.lang.reflect.Method.invoke(Method.java:498) ~[na:1.8.0_144]
26-Jan-2018 22:49:39         at org.apache.maven.surefire.util.ReflectionUtils.invokeMethodWithArray(ReflectionUtils.java:189) [surefire-api-2.12.4.jar:2.12.4]
26-Jan-2018 22:49:39         at org.apache.maven.surefire.booter.ProviderFactory$ProviderProxy.invoke(ProviderFactory.java:165) [surefire-booter-2.12.4.jar:2.12.4]
26-Jan-2018 22:49:39         at org.apache.maven.surefire.booter.ProviderFactory.invokeProvider(ProviderFactory.java:85) [surefire-booter-2.12.4.jar:2.12.4]
26-Jan-2018 22:49:39         at org.apache.maven.surefire.booter.ForkedBooter.runSuitesInProcess(ForkedBooter.java:115) [surefire-booter-2.12.4.jar:2.12.4]
26-Jan-2018 22:49:39         at org.apache.maven.surefire.booter.ForkedBooter.main(ForkedBooter.java:75) [surefire-booter-2.12.4.jar:2.12.4]
26-Jan-2018 22:49:39 Caused by: java.lang.NoSuchMethodError: io.micrometer.core.instrument.Tags.zip([Ljava/lang/String;)Lio/micrometer/core/instrument/Tags;
26-Jan-2018 22:49:39         at org.springframework.boot.actuate.autoconfigure.metrics.amqp.RabbitMetricsConfiguration.bindConnectionFactoryToRegistry(RabbitMetricsConfiguration.java:69) ~[spring-boot-actuator-autoconfigure-2.0.0.BUILD-SNAPSHOT.jar:2.0.0.BUILD-SNAPSHOT]
26-Jan-2018 22:49:39         at java.util.LinkedHashMap.forEach(LinkedHashMap.java:684) ~[na:1.8.0_144]
26-Jan-2018 22:49:39         at org.springframework.boot.actuate.autoconfigure.metrics.amqp.RabbitMetricsConfiguration.bindConnectionFactoriesToRegistry(RabbitMetricsConfiguration.java:64) ~[spring-boot-actuator-autoconfigure-2.0.0.BUILD-SNAPSHOT.jar:2.0.0.BUILD-SNAPSHOT]
26-Jan-2018 22:49:39         at sun.reflect.NativeMethodAccessorImpl.invoke0(Native Method) ~[na:1.8.0_144]
26-Jan-2018 22:49:39         at sun.reflect.NativeMethodAccessorImpl.invoke(NativeMethodAccessorImpl.java:62) ~[na:1.8.0_144]
26-Jan-2018 22:49:39         at sun.reflect.DelegatingMethodAccessorImpl.invoke(DelegatingMethodAccessorImpl.java:43) ~[na:1.8.0_144]
26-Jan-2018 22:49:39         at java.lang.reflect.Method.invoke(Method.java:498) ~[na:1.8.0_144]
26-Jan-2018 22:49:39         at org.springframework.beans.factory.annotation.AutowiredAnnotationBeanPostProcessor$AutowiredMethodElement.inject(AutowiredAnnotationBeanPostProcessor.java:703) ~[spring-beans-5.0.3.RELEASE.jar:5.0.3.RELEASE]
26-Jan-2018 22:49:39         at org.springframework.beans.factory.annotation.InjectionMetadata.inject(InjectionMetadata.java:91) ~[spring-beans-5.0.3.RELEASE.jar:5.0.3.RELEASE]
26-Jan-2018 22:49:39         at org.springframework.beans.factory.annotation.AutowiredAnnotationBeanPostProcessor.postProcessPropertyValues(AutowiredAnnotationBeanPostProcessor.java:373) ~[spring-beans-5.0.3.RELEASE.jar:5.0.3.RELEASE]
26-Jan-2018 22:49:39         ... 47 common frames omitted
26-Jan-2018 22:49:39
26-Jan-2018 22:49:39 2018-01-26 22:49:39.258 ERROR 21964 --- [           main] o.s.test.context.TestContextManager      : Caught exception while allowing TestExecutionListener [org.springframework.test.context.web.ServletTestExecutionListener@7751a7a2] to prepare test instance [org.springframework.cloud.task.launcher.TaskLauncherSinkTests@45ba7bd5]
26-Jan-2018 22:49:39
26-Jan-2018 22:49:39 java.lang.IllegalStateException: Failed to load ApplicationContext
26-Jan-2018 22:49:39         at org.springframework.test.context.cache.DefaultCacheAwareContextLoaderDelegate.loadContext(DefaultCacheAwareContextLoaderDelegate.java:125) ~[spring-test-5.0.3.RELEASE.jar:5.0.3.RELEASE]
26-Jan-2018 22:49:39         at org.springframework.test.context.support.DefaultTestContext.getApplicationContext(DefaultTestContext.java:107) ~[spring-test-5.0.3.RELEASE.jar:5.0.3.RELEASE]
26-Jan-2018 22:49:39         at org.springframework.test.context.web.ServletTestExecutionListener.setUpRequestContextIfNecessary(ServletTestExecutionListener.java:190) ~[spring-test-5.0.3.RELEASE.jar:5.0.3.RELEASE]
26-Jan-2018 22:49:39         at org.springframework.test.context.web.ServletTestExecutionListener.prepareTestInstance(ServletTestExecutionListener.java:132) ~[spring-test-5.0.3.RELEASE.jar:5.0.3.RELEASE]
26-Jan-2018 22:49:39         at org.springframework.test.context.TestContextManager.prepareTestInstance(TestContextManager.java:242) ~[spring-test-5.0.3.RELEASE.jar:5.0.3.RELEASE]
26-Jan-2018 22:49:39         at org.springframework.test.context.junit4.SpringJUnit4ClassRunner.createTest(SpringJUnit4ClassRunner.java:227) [spring-test-5.0.3.RELEASE.jar:5.0.3.RELEASE]
26-Jan-2018 22:49:39         at org.springframework.test.context.junit4.SpringJUnit4ClassRunner$1.runReflectiveCall(SpringJUnit4ClassRunner.java:289) [spring-test-5.0.3.RELEASE.jar:5.0.3.RELEASE]
26-Jan-2018 22:49:39         at org.junit.internal.runners.model.ReflectiveCallable.run(ReflectiveCallable.java:12) [junit-4.12.jar:4.12]
26-Jan-2018 22:49:39         at org.springframework.test.context.junit4.SpringJUnit4ClassRunner.methodBlock(SpringJUnit4ClassRunner.java:291) [spring-test-5.0.3.RELEASE.jar:5.0.3.RELEASE]
26-Jan-2018 22:49:39         at org.springframework.test.context.junit4.SpringJUnit4ClassRunner.runChild(SpringJUnit4ClassRunner.java:246) [spring-test-5.0.3.RELEASE.jar:5.0.3.RELEASE]
26-Jan-2018 22:49:39         at org.springframework.test.context.junit4.SpringJUnit4ClassRunner.runChild(SpringJUnit4ClassRunner.java:97) [spring-test-5.0.3.RELEASE.jar:5.0.3.RELEASE]
26-Jan-2018 22:49:39         at org.junit.runners.ParentRunner$3.run(ParentRunner.java:290) [junit-4.12.jar:4.12]
26-Jan-2018 22:49:39         at org.junit.runners.ParentRunner$1.schedule(ParentRunner.java:71) [junit-4.12.jar:4.12]
26-Jan-2018 22:49:39         at org.junit.runners.ParentRunner.runChildren(ParentRunner.java:288) [junit-4.12.jar:4.12]
26-Jan-2018 22:49:39         at org.junit.runners.ParentRunner.access$000(ParentRunner.java:58) [junit-4.12.jar:4.12]
26-Jan-2018 22:49:39         at org.junit.runners.ParentRunner$2.evaluate(ParentRunner.java:268) [junit-4.12.jar:4.12]
26-Jan-2018 22:49:39         at org.springframework.test.context.junit4.statements.RunBeforeTestClassCallbacks.evaluate(RunBeforeTestClassCallbacks.java:61) [spring-test-5.0.3.RELEASE.jar:5.0.3.RELEASE]
26-Jan-2018 22:49:39         at org.springframework.test.context.junit4.statements.RunAfterTestClassCallbacks.evaluate(RunAfterTestClassCallbacks.java:70) [spring-test-5.0.3.RELEASE.jar:5.0.3.RELEASE]
26-Jan-2018 22:49:39         at org.junit.runners.ParentRunner.run(ParentRunner.java:363) [junit-4.12.jar:4.12]
26-Jan-2018 22:49:39         at org.springframework.test.context.junit4.SpringJUnit4ClassRunner.run(SpringJUnit4ClassRunner.java:190) [spring-test-5.0.3.RELEASE.jar:5.0.3.RELEASE]
26-Jan-2018 22:49:39         at org.apache.maven.surefire.junit4.JUnit4Provider.execute(JUnit4Provider.java:252) [surefire-junit4-2.12.4.jar:2.12.4]
26-Jan-2018 22:49:39         at org.apache.maven.surefire.junit4.JUnit4Provider.executeTestSet(JUnit4Provider.java:141) [surefire-junit4-2.12.4.jar:2.12.4]
26-Jan-2018 22:49:39         at org.apache.maven.surefire.junit4.JUnit4Provider.invoke(JUnit4Provider.java:112) [surefire-junit4-2.12.4.jar:2.12.4]
26-Jan-2018 22:49:39         at sun.reflect.NativeMethodAccessorImpl.invoke0(Native Method) ~[na:1.8.0_144]
26-Jan-2018 22:49:39         at sun.reflect.NativeMethodAccessorImpl.invoke(NativeMethodAccessorImpl.java:62) ~[na:1.8.0_144]
26-Jan-2018 22:49:39         at sun.reflect.DelegatingMethodAccessorImpl.invoke(DelegatingMethodAccessorImpl.java:43) ~[na:1.8.0_144]
26-Jan-2018 22:49:39         at java.lang.reflect.Method.invoke(Method.java:498) ~[na:1.8.0_144]
26-Jan-2018 22:49:39         at org.apache.maven.surefire.util.ReflectionUtils.invokeMethodWithArray(ReflectionUtils.java:189) [surefire-api-2.12.4.jar:2.12.4]
26-Jan-2018 22:49:39         at org.apache.maven.surefire.booter.ProviderFactory$ProviderProxy.invoke(ProviderFactory.java:165) [surefire-booter-2.12.4.jar:2.12.4]
26-Jan-2018 22:49:39         at org.apache.maven.surefire.booter.ProviderFactory.invokeProvider(ProviderFactory.java:85) [surefire-booter-2.12.4.jar:2.12.4]
26-Jan-2018 22:49:39         at org.apache.maven.surefire.booter.ForkedBooter.runSuitesInProcess(ForkedBooter.java:115) [surefire-booter-2.12.4.jar:2.12.4]
26-Jan-2018 22:49:39         at org.apache.maven.surefire.booter.ForkedBooter.main(ForkedBooter.java:75) [surefire-booter-2.12.4.jar:2.12.4]
26-Jan-2018 22:49:39 Caused by: org.springframework.beans.factory.BeanCreationException: Error creating bean with name 'org.springframework.boot.actuate.autoconfigure.metrics.amqp.RabbitMetricsConfiguration': Injection of autowired dependencies failed; nested exception is java.lang.NoSuchMethodError: io.micrometer.core.instrument.Tags.zip([Ljava/lang/String;)Lio/micrometer/core/instrument/Tags;
26-Jan-2018 22:49:39         at org.springframework.beans.factory.annotation.AutowiredAnnotationBeanPostProcessor.postProcessPropertyValues(AutowiredAnnotationBeanPostProcessor.java:379) ~[spring-beans-5.0.3.RELEASE.jar:5.0.3.RELEASE]
26-Jan-2018 22:49:39         at org.springframework.beans.factory.support.AbstractAutowireCapableBeanFactory.populateBean(AbstractAutowireCapableBeanFactory.java:1344) ~[spring-beans-5.0.3.RELEASE.jar:5.0.3.RELEASE]
26-Jan-2018 22:49:39         at org.springframework.beans.factory.support.AbstractAutowireCapableBeanFactory.doCreateBean(AbstractAutowireCapableBeanFactory.java:582) ~[spring-beans-5.0.3.RELEASE.jar:5.0.3.RELEASE]
26-Jan-2018 22:49:39         at org.springframework.beans.factory.support.AbstractAutowireCapableBeanFactory.createBean(AbstractAutowireCapableBeanFactory.java:502) ~[spring-beans-5.0.3.RELEASE.jar:5.0.3.RELEASE]
26-Jan-2018 22:49:39         at org.springframework.beans.factory.support.AbstractBeanFactory.lambda$doGetBean$0(AbstractBeanFactory.java:312) ~[spring-beans-5.0.3.RELEASE.jar:5.0.3.RELEASE]
26-Jan-2018 22:49:39         at org.springframework.beans.factory.support.DefaultSingletonBeanRegistry.getSingleton(DefaultSingletonBeanRegistry.java:228) ~[spring-beans-5.0.3.RELEASE.jar:5.0.3.RELEASE]
26-Jan-2018 22:49:39         at org.springframework.beans.factory.support.AbstractBeanFactory.doGetBean(AbstractBeanFactory.java:310) ~[spring-beans-5.0.3.RELEASE.jar:5.0.3.RELEASE]
26-Jan-2018 22:49:39         at org.springframework.beans.factory.support.AbstractBeanFactory.getBean(AbstractBeanFactory.java:200) ~[spring-beans-5.0.3.RELEASE.jar:5.0.3.RELEASE]
26-Jan-2018 22:49:39         at org.springframework.beans.factory.support.DefaultListableBeanFactory.preInstantiateSingletons(DefaultListableBeanFactory.java:761) ~[spring-beans-5.0.3.RELEASE.jar:5.0.3.RELEASE]
26-Jan-2018 22:49:39         at org.springframework.context.support.AbstractApplicationContext.finishBeanFactoryInitialization(AbstractApplicationContext.java:868) ~[spring-context-5.0.3.RELEASE.jar:5.0.3.RELEASE]
26-Jan-2018 22:49:39         at org.springframework.context.support.AbstractApplicationContext.refresh(AbstractApplicationContext.java:549) ~[spring-context-5.0.3.RELEASE.jar:5.0.3.RELEASE]
26-Jan-2018 22:49:39         at org.springframework.boot.SpringApplication.refresh(SpringApplication.java:752) ~[spring-boot-2.0.0.BUILD-SNAPSHOT.jar:2.0.0.BUILD-SNAPSHOT]
26-Jan-2018 22:49:39         at org.springframework.boot.SpringApplication.refreshContext(SpringApplication.java:388) ~[spring-boot-2.0.0.BUILD-SNAPSHOT.jar:2.0.0.BUILD-SNAPSHOT]
26-Jan-2018 22:49:39         at org.springframework.boot.SpringApplication.run(SpringApplication.java:327) ~[spring-boot-2.0.0.BUILD-SNAPSHOT.jar:2.0.0.BUILD-SNAPSHOT]
26-Jan-2018 22:49:39         at org.springframework.boot.test.context.SpringBootContextLoader.loadContext(SpringBootContextLoader.java:138) ~[spring-boot-test-2.0.0.BUILD-SNAPSHOT.jar:2.0.0.BUILD-SNAPSHOT]
26-Jan-2018 22:49:39         at org.springframework.test.context.cache.DefaultCacheAwareContextLoaderDelegate.loadContextInternal(DefaultCacheAwareContextLoaderDelegate.java:99) ~[spring-test-5.0.3.RELEASE.jar:5.0.3.RELEASE]
26-Jan-2018 22:49:39         at org.springframework.test.context.cache.DefaultCacheAwareContextLoaderDelegate.loadContext(DefaultCacheAwareContextLoaderDelegate.java:117) ~[spring-test-5.0.3.RELEASE.jar:5.0.3.RELEASE]
26-Jan-2018 22:49:39         ... 31 common frames omitted
26-Jan-2018 22:49:39 Caused by: java.lang.NoSuchMethodError: io.micrometer.core.instrument.Tags.zip([Ljava/lang/String;)Lio/micrometer/core/instrument/Tags;
26-Jan-2018 22:49:39         at org.springframework.boot.actuate.autoconfigure.metrics.amqp.RabbitMetricsConfiguration.bindConnectionFactoryToRegistry(RabbitMetricsConfiguration.java:69) ~[spring-boot-actuator-autoconfigure-2.0.0.BUILD-SNAPSHOT.jar:2.0.0.BUILD-SNAPSHOT]
26-Jan-2018 22:49:39         at java.util.LinkedHashMap.forEach(LinkedHashMap.java:684) ~[na:1.8.0_144]
26-Jan-2018 22:49:39         at org.springframework.boot.actuate.autoconfigure.metrics.amqp.RabbitMetricsConfiguration.bindConnectionFactoriesToRegistry(RabbitMetricsConfiguration.java:64) ~[spring-boot-actuator-autoconfigure-2.0.0.BUILD-SNAPSHOT.jar:2.0.0.BUILD-SNAPSHOT]
26-Jan-2018 22:49:39         at sun.reflect.NativeMethodAccessorImpl.invoke0(Native Method) ~[na:1.8.0_144]
26-Jan-2018 22:49:39         at sun.reflect.NativeMethodAccessorImpl.invoke(NativeMethodAccessorImpl.java:62) ~[na:1.8.0_144]
26-Jan-2018 22:49:39         at sun.reflect.DelegatingMethodAccessorImpl.invoke(DelegatingMethodAccessorImpl.java:43) ~[na:1.8.0_144]
26-Jan-2018 22:49:39         at java.lang.reflect.Method.invoke(Method.java:498) ~[na:1.8.0_144]
26-Jan-2018 22:49:39         at org.springframework.beans.factory.annotation.AutowiredAnnotationBeanPostProcessor$AutowiredMethodElement.inject(AutowiredAnnotationBeanPostProcessor.java:703) ~[spring-beans-5.0.3.RELEASE.jar:5.0.3.RELEASE]
26-Jan-2018 22:49:39         at org.springframework.beans.factory.annotation.InjectionMetadata.inject(InjectionMetadata.java:91) ~[spring-beans-5.0.3.RELEASE.jar:5.0.3.RELEASE]
26-Jan-2018 22:49:39         at org.springframework.beans.factory.annotation.AutowiredAnnotationBeanPostProcessor.postProcessPropertyValues(AutowiredAnnotationBeanPostProcessor.java:373) ~[spring-beans-5.0.3.RELEASE.jar:5.0.3.RELEASE]
26-Jan-2018 22:49:39         ... 47 common frames omitted
26-Jan-2018 22:49:39
26-Jan-2018 22:49:39
26-Jan-2018 22:49:39   .   ____          _            __ _ _
26-Jan-2018 22:49:39 /\\ / ___'_ __ _ _(_)_ __  __ _ \ \ \ \
26-Jan-2018 22:49:39 ( ( )\___ | '_ | '_| | '_ \/ _` | \ \ \ \
26-Jan-2018 22:49:39 \\/  ___)| |_)| | | | | || (_| |  ) ) ) )
26-Jan-2018 22:49:39   '  |____| .__|_| |_|_| |_\__, | / / / /
26-Jan-2018 22:49:39 =========|_|==============|___/=/_/_/_/
26-Jan-2018 22:49:39 :: Spring Boot ::  (v2.0.0.BUILD-SNAPSHOT)
26-Jan-2018 22:49:39
26-Jan-2018 22:49:39 2018-01-26 22:49:39.275  INFO 21964 --- [           main] o.s.c.t.launcher.TaskLauncherSinkTests   : Starting TaskLauncherSinkTests on bamboo-12 with PID 21964 (started by bamboo in /opt/bamboo-home/xml-data/build-dir/SCT-STASK-JOB1/spring-cloud-task-stream)
26-Jan-2018 22:49:39 2018-01-26 22:49:39.276  INFO 21964 --- [           main] o.s.c.t.launcher.TaskLauncherSinkTests   : No active profile set, falling back to default profiles: default
26-Jan-2018 22:49:39 2018-01-26 22:49:39.279  INFO 21964 --- [           main] o.s.w.c.s.GenericWebApplicationContext   : Refreshing org.springframework.web.context.support.GenericWebApplicationContext@67ff85f7: startup date [Fri Jan 26 22:49:39 UTC 2018]; root of context hierarchy
26-Jan-2018 22:49:39 2018-01-26 22:49:39.448  INFO 21964 --- [           main] o.s.i.config.IntegrationRegistrar        : No bean named 'integrationHeaderChannelRegistry' has been explicitly defined. Therefore, a default DefaultHeaderChannelRegistry will be created.
26-Jan-2018 22:49:39 2018-01-26 22:49:39.454  INFO 21964 --- [           main] o.s.b.f.s.DefaultListableBeanFactory     : Overriding bean definition for bean 'binderFactory' with a different definition: replacing [Root bean: class [null]; scope=; abstract=false; lazyInit=false; autowireMode=3; dependencyCheck=0; autowireCandidate=true; primary=false; factoryBeanName=org.springframework.cloud.stream.config.BinderFactoryConfiguration; factoryMethodName=binderFactory; initMethodName=null; destroyMethodName=(inferred); defined in org.springframework.cloud.stream.config.BinderFactoryConfiguration] with [Root bean: class [null]; scope=; abstract=false; lazyInit=false; autowireMode=3; dependencyCheck=0; autowireCandidate=true; primary=false; factoryBeanName=org.springframework.cloud.stream.test.binder.TestSupportBinderAutoConfiguration; factoryMethodName=binderFactory; initMethodName=null; destroyMethodName=(inferred); defined in class path resource [org/springframework/cloud/stream/test/binder/TestSupportBinderAutoConfiguration.class]]
26-Jan-2018 22:49:39 2018-01-26 22:49:39.526  INFO 21964 --- [           main] faultConfiguringBeanFactoryPostProcessor : No bean named 'errorChannel' has been explicitly defined. Therefore, a default PublishSubscribeChannel will be created.
26-Jan-2018 22:49:39 2018-01-26 22:49:39.526  INFO 21964 --- [           main] faultConfiguringBeanFactoryPostProcessor : No bean named 'taskScheduler' has been explicitly defined. Therefore, a default ThreadPoolTaskScheduler will be created.
26-Jan-2018 22:49:39 2018-01-26 22:49:39.560  INFO 21964 --- [           main] trationDelegate$BeanPostProcessorChecker : Bean 'org.springframework.amqp.rabbit.annotation.RabbitBootstrapConfiguration' of type [org.springframework.amqp.rabbit.annotation.RabbitBootstrapConfiguration$$EnhancerBySpringCGLIB$$b9b3e62c] is not eligible for getting processed by all BeanPostProcessors (for example: not eligible for auto-proxying)
26-Jan-2018 22:49:39 2018-01-26 22:49:39.582  INFO 21964 --- [           main] trationDelegate$BeanPostProcessorChecker : Bean 'org.springframework.transaction.annotation.ProxyTransactionManagementConfiguration' of type [org.springframework.transaction.annotation.ProxyTransactionManagementConfiguration$$EnhancerBySpringCGLIB$$f34827fe] is not eligible for getting processed by all BeanPostProcessors (for example: not eligible for auto-proxying)
26-Jan-2018 22:49:39 2018-01-26 22:49:39.597  INFO 21964 --- [           main] trationDelegate$BeanPostProcessorChecker : Bean 'org.springframework.cloud.stream.config.BindingServiceConfiguration$PostProcessorConfiguration' of type [org.springframework.cloud.stream.config.BindingServiceConfiguration$PostProcessorConfiguration$$EnhancerBySpringCGLIB$$b50fc603] is not eligible for getting processed by all BeanPostProcessors (for example: not eligible for auto-proxying)
26-Jan-2018 22:49:39 2018-01-26 22:49:39.606  INFO 21964 --- [           main] trationDelegate$BeanPostProcessorChecker : Bean 'org.springframework.cloud.stream.config.SpelExpressionConverterConfiguration' of type [org.springframework.cloud.stream.config.SpelExpressionConverterConfiguration$$EnhancerBySpringCGLIB$$f3847ff3] is not eligible for getting processed by all BeanPostProcessors (for example: not eligible for auto-proxying)
26-Jan-2018 22:49:39 2018-01-26 22:49:39.609  INFO 21964 --- [           main] trationDelegate$BeanPostProcessorChecker : Bean 'spelConverter' of type [org.springframework.cloud.stream.config.SpelExpressionConverterConfiguration$SpelConverter] is not eligible for getting processed by all BeanPostProcessors (for example: not eligible for auto-proxying)
26-Jan-2018 22:49:39 2018-01-26 22:49:39.612  INFO 21964 --- [           main] trationDelegate$BeanPostProcessorChecker : Bean 'org.springframework.boot.context.properties.ConfigurationPropertiesBinderBuilder$ConversionServiceFactory' of type [org.springframework.boot.context.properties.ConfigurationPropertiesBinderBuilder$ConversionServiceFactory] is not eligible for getting processed by all BeanPostProcessors (for example: not eligible for auto-proxying)
26-Jan-2018 22:49:39 2018-01-26 22:49:39.625  INFO 21964 --- [           main] trationDelegate$BeanPostProcessorChecker : Bean 'spring.cloud.stream.integration-org.springframework.cloud.stream.config.SpringIntegrationProperties' of type [org.springframework.cloud.stream.config.SpringIntegrationProperties] is not eligible for getting processed by all BeanPostProcessors (for example: not eligible for auto-proxying)
26-Jan-2018 22:49:39 2018-01-26 22:49:39.931  INFO 21964 --- [           main] o.s.s.c.ThreadPoolTaskScheduler          : Initializing ExecutorService  'taskScheduler'
26-Jan-2018 22:49:40 2018-01-26 22:49:40.095  INFO 21964 --- [           main] o.s.j.d.e.EmbeddedDatabaseFactory        : Starting embedded database: url='jdbc:h2:mem:testdb;DB_CLOSE_DELAY=-1;DB_CLOSE_ON_EXIT=false', username='sa'
26-Jan-2018 22:49:40 2018-01-26 22:49:40.241  INFO 21964 --- [           main] s.w.s.m.m.a.RequestMappingHandlerAdapter : Looking for @ControllerAdvice: org.springframework.web.context.support.GenericWebApplicationContext@67ff85f7: startup date [Fri Jan 26 22:49:39 UTC 2018]; root of context hierarchy
26-Jan-2018 22:49:40 2018-01-26 22:49:40.301  INFO 21964 --- [           main] s.w.s.m.m.a.RequestMappingHandlerMapping : Mapped "{[/error],produces=[text/html]}" onto public org.springframework.web.servlet.ModelAndView org.springframework.boot.autoconfigure.web.servlet.error.BasicErrorController.errorHtml(javax.servlet.http.HttpServletRequest,javax.servlet.http.HttpServletResponse)
26-Jan-2018 22:49:40 2018-01-26 22:49:40.302  INFO 21964 --- [           main] s.w.s.m.m.a.RequestMappingHandlerMapping : Mapped "{[/error]}" onto public org.springframework.http.ResponseEntity<java.util.Map<java.lang.String, java.lang.Object>> org.springframework.boot.autoconfigure.web.servlet.error.BasicErrorController.error(javax.servlet.http.HttpServletRequest)
26-Jan-2018 22:49:40 2018-01-26 22:49:40.351  INFO 21964 --- [           main] o.s.w.s.handler.SimpleUrlHandlerMapping  : Mapped URL path [/webjars/**] onto handler of type [class org.springframework.web.servlet.resource.ResourceHttpRequestHandler]
26-Jan-2018 22:49:40 2018-01-26 22:49:40.351  INFO 21964 --- [           main] o.s.w.s.handler.SimpleUrlHandlerMapping  : Mapped URL path [/**] onto handler of type [class org.springframework.web.servlet.resource.ResourceHttpRequestHandler]
26-Jan-2018 22:49:40 2018-01-26 22:49:40.395  INFO 21964 --- [           main] o.s.w.s.handler.SimpleUrlHandlerMapping  : Mapped URL path [/**/favicon.ico] onto handler of type [class org.springframework.web.servlet.resource.ResourceHttpRequestHandler]
26-Jan-2018 22:49:40 2018-01-26 22:49:40.839  WARN 21964 --- [           main] o.s.w.c.s.GenericWebApplicationContext   : Exception encountered during context initialization - cancelling refresh attempt: org.springframework.beans.factory.BeanCreationException: Error creating bean with name 'org.springframework.boot.actuate.autoconfigure.metrics.amqp.RabbitMetricsConfiguration': Injection of autowired dependencies failed; nested exception is java.lang.NoSuchMethodError: io.micrometer.core.instrument.Tags.zip([Ljava/lang/String;)Lio/micrometer/core/instrument/Tags;
26-Jan-2018 22:49:40 2018-01-26 22:49:40.840  INFO 21964 --- [           main] o.s.j.d.e.EmbeddedDatabaseFactory        : Shutting down embedded database: url='jdbc:h2:mem:testdb;DB_CLOSE_DELAY=-1;DB_CLOSE_ON_EXIT=false'
26-Jan-2018 22:49:40 2018-01-26 22:49:40.840  INFO 21964 --- [           main] o.s.s.c.ThreadPoolTaskScheduler          : Shutting down ExecutorService 'taskScheduler'
26-Jan-2018 22:49:40 2018-01-26 22:49:40.844  INFO 21964 --- [           main] ConditionEvaluationReportLoggingListener :
26-Jan-2018 22:49:40
26-Jan-2018 22:49:40 Error starting ApplicationContext. To display the conditions report re-run your application with 'debug' enabled.
26-Jan-2018 22:49:40 2018-01-26 22:49:40.846 ERROR 21964 --- [           main] o.s.boot.SpringApplication               : Application run failed
26-Jan-2018 22:49:40
26-Jan-2018 22:49:40 org.springframework.beans.factory.BeanCreationException: Error creating bean with name 'org.springframework.boot.actuate.autoconfigure.metrics.amqp.RabbitMetricsConfiguration': Injection of autowired dependencies failed; nested exception is java.lang.NoSuchMethodError: io.micrometer.core.instrument.Tags.zip([Ljava/lang/String;)Lio/micrometer/core/instrument/Tags;
26-Jan-2018 22:49:40         at org.springframework.beans.factory.annotation.AutowiredAnnotationBeanPostProcessor.postProcessPropertyValues(AutowiredAnnotationBeanPostProcessor.java:379) ~[spring-beans-5.0.3.RELEASE.jar:5.0.3.RELEASE]
26-Jan-2018 22:49:40         at org.springframework.beans.factory.support.AbstractAutowireCapableBeanFactory.populateBean(AbstractAutowireCapableBeanFactory.java:1344) ~[spring-beans-5.0.3.RELEASE.jar:5.0.3.RELEASE]
26-Jan-2018 22:49:40         at org.springframework.beans.factory.support.AbstractAutowireCapableBeanFactory.doCreateBean(AbstractAutowireCapableBeanFactory.java:582) ~[spring-beans-5.0.3.RELEASE.jar:5.0.3.RELEASE]
26-Jan-2018 22:49:40         at org.springframework.beans.factory.support.AbstractAutowireCapableBeanFactory.createBean(AbstractAutowireCapableBeanFactory.java:502) ~[spring-beans-5.0.3.RELEASE.jar:5.0.3.RELEASE]
26-Jan-2018 22:49:40         at org.springframework.beans.factory.support.AbstractBeanFactory.lambda$doGetBean$0(AbstractBeanFactory.java:312) ~[spring-beans-5.0.3.RELEASE.jar:5.0.3.RELEASE]
26-Jan-2018 22:49:40         at org.springframework.beans.factory.support.DefaultSingletonBeanRegistry.getSingleton(DefaultSingletonBeanRegistry.java:228) ~[spring-beans-5.0.3.RELEASE.jar:5.0.3.RELEASE]
26-Jan-2018 22:49:40         at org.springframework.beans.factory.support.AbstractBeanFactory.doGetBean(AbstractBeanFactory.java:310) ~[spring-beans-5.0.3.RELEASE.jar:5.0.3.RELEASE]
26-Jan-2018 22:49:40         at org.springframework.beans.factory.support.AbstractBeanFactory.getBean(AbstractBeanFactory.java:200) ~[spring-beans-5.0.3.RELEASE.jar:5.0.3.RELEASE]
26-Jan-2018 22:49:40         at org.springframework.beans.factory.support.DefaultListableBeanFactory.preInstantiateSingletons(DefaultListableBeanFactory.java:761) ~[spring-beans-5.0.3.RELEASE.jar:5.0.3.RELEASE]
26-Jan-2018 22:49:40         at org.springframework.context.support.AbstractApplicationContext.finishBeanFactoryInitialization(AbstractApplicationContext.java:868) ~[spring-context-5.0.3.RELEASE.jar:5.0.3.RELEASE]
26-Jan-2018 22:49:40         at org.springframework.context.support.AbstractApplicationContext.refresh(AbstractApplicationContext.java:549) ~[spring-context-5.0.3.RELEASE.jar:5.0.3.RELEASE]
26-Jan-2018 22:49:40         at org.springframework.boot.SpringApplication.refresh(SpringApplication.java:752) ~[spring-boot-2.0.0.BUILD-SNAPSHOT.jar:2.0.0.BUILD-SNAPSHOT]
26-Jan-2018 22:49:40         at org.springframework.boot.SpringApplication.refreshContext(SpringApplication.java:388) ~[spring-boot-2.0.0.BUILD-SNAPSHOT.jar:2.0.0.BUILD-SNAPSHOT]
26-Jan-2018 22:49:40         at org.springframework.boot.SpringApplication.run(SpringApplication.java:327) ~[spring-boot-2.0.0.BUILD-SNAPSHOT.jar:2.0.0.BUILD-SNAPSHOT]
26-Jan-2018 22:49:40         at org.springframework.boot.test.context.SpringBootContextLoader.loadContext(SpringBootContextLoader.java:138) [spring-boot-test-2.0.0.BUILD-SNAPSHOT.jar:2.0.0.BUILD-SNAPSHOT]
26-Jan-2018 22:49:40         at org.springframework.test.context.cache.DefaultCacheAwareContextLoaderDelegate.loadContextInternal(DefaultCacheAwareContextLoaderDelegate.java:99) [spring-test-5.0.3.RELEASE.jar:5.0.3.RELEASE]
26-Jan-2018 22:49:40         at org.springframework.test.context.cache.DefaultCacheAwareContextLoaderDelegate.loadContext(DefaultCacheAwareContextLoaderDelegate.java:117) [spring-test-5.0.3.RELEASE.jar:5.0.3.RELEASE]
26-Jan-2018 22:49:40         at org.springframework.test.context.support.DefaultTestContext.getApplicationContext(DefaultTestContext.java:107) [spring-test-5.0.3.RELEASE.jar:5.0.3.RELEASE]
26-Jan-2018 22:49:40         at org.springframework.test.context.web.ServletTestExecutionListener.setUpRequestContextIfNecessary(ServletTestExecutionListener.java:190) [spring-test-5.0.3.RELEASE.jar:5.0.3.RELEASE]
26-Jan-2018 22:49:40         at org.springframework.test.context.web.ServletTestExecutionListener.prepareTestInstance(ServletTestExecutionListener.java:132) [spring-test-5.0.3.RELEASE.jar:5.0.3.RELEASE]
26-Jan-2018 22:49:40         at org.springframework.test.context.TestContextManager.prepareTestInstance(TestContextManager.java:242) [spring-test-5.0.3.RELEASE.jar:5.0.3.RELEASE]
26-Jan-2018 22:49:40         at org.springframework.test.context.junit4.SpringJUnit4ClassRunner.createTest(SpringJUnit4ClassRunner.java:227) [spring-test-5.0.3.RELEASE.jar:5.0.3.RELEASE]
26-Jan-2018 22:49:40         at org.springframework.test.context.junit4.SpringJUnit4ClassRunner$1.runReflectiveCall(SpringJUnit4ClassRunner.java:289) [spring-test-5.0.3.RELEASE.jar:5.0.3.RELEASE]
26-Jan-2018 22:49:40         at org.junit.internal.runners.model.ReflectiveCallable.run(ReflectiveCallable.java:12) [junit-4.12.jar:4.12]
26-Jan-2018 22:49:40         at org.springframework.test.context.junit4.SpringJUnit4ClassRunner.methodBlock(SpringJUnit4ClassRunner.java:291) [spring-test-5.0.3.RELEASE.jar:5.0.3.RELEASE]
26-Jan-2018 22:49:40         at org.springframework.test.context.junit4.SpringJUnit4ClassRunner.runChild(SpringJUnit4ClassRunner.java:246) [spring-test-5.0.3.RELEASE.jar:5.0.3.RELEASE]
26-Jan-2018 22:49:40         at org.springframework.test.context.junit4.SpringJUnit4ClassRunner.runChild(SpringJUnit4ClassRunner.java:97) [spring-test-5.0.3.RELEASE.jar:5.0.3.RELEASE]
26-Jan-2018 22:49:40         at org.junit.runners.ParentRunner$3.run(ParentRunner.java:290) [junit-4.12.jar:4.12]
26-Jan-2018 22:49:40         at org.junit.runners.ParentRunner$1.schedule(ParentRunner.java:71) [junit-4.12.jar:4.12]
26-Jan-2018 22:49:40         at org.junit.runners.ParentRunner.runChildren(ParentRunner.java:288) [junit-4.12.jar:4.12]
26-Jan-2018 22:49:40         at org.junit.runners.ParentRunner.access$000(ParentRunner.java:58) [junit-4.12.jar:4.12]
26-Jan-2018 22:49:40         at org.junit.runners.ParentRunner$2.evaluate(ParentRunner.java:268) [junit-4.12.jar:4.12]
26-Jan-2018 22:49:40         at org.springframework.test.context.junit4.statements.RunBeforeTestClassCallbacks.evaluate(RunBeforeTestClassCallbacks.java:61) [spring-test-5.0.3.RELEASE.jar:5.0.3.RELEASE]
26-Jan-2018 22:49:40         at org.springframework.test.context.junit4.statements.RunAfterTestClassCallbacks.evaluate(RunAfterTestClassCallbacks.java:70) [spring-test-5.0.3.RELEASE.jar:5.0.3.RELEASE]
26-Jan-2018 22:49:40         at org.junit.runners.ParentRunner.run(ParentRunner.java:363) [junit-4.12.jar:4.12]
26-Jan-2018 22:49:40         at org.springframework.test.context.junit4.SpringJUnit4ClassRunner.run(SpringJUnit4ClassRunner.java:190) [spring-test-5.0.3.RELEASE.jar:5.0.3.RELEASE]
26-Jan-2018 22:49:40         at org.apache.maven.surefire.junit4.JUnit4Provider.execute(JUnit4Provider.java:252) [surefire-junit4-2.12.4.jar:2.12.4]
26-Jan-2018 22:49:40         at org.apache.maven.surefire.junit4.JUnit4Provider.executeTestSet(JUnit4Provider.java:141) [surefire-junit4-2.12.4.jar:2.12.4]
26-Jan-2018 22:49:40         at org.apache.maven.surefire.junit4.JUnit4Provider.invoke(JUnit4Provider.java:112) [surefire-junit4-2.12.4.jar:2.12.4]
26-Jan-2018 22:49:40         at sun.reflect.NativeMethodAccessorImpl.invoke0(Native Method) ~[na:1.8.0_144]
26-Jan-2018 22:49:40         at sun.reflect.NativeMethodAccessorImpl.invoke(NativeMethodAccessorImpl.java:62) ~[na:1.8.0_144]
26-Jan-2018 22:49:40         at sun.reflect.DelegatingMethodAccessorImpl.invoke(DelegatingMethodAccessorImpl.java:43) ~[na:1.8.0_144]
26-Jan-2018 22:49:40         at java.lang.reflect.Method.invoke(Method.java:498) ~[na:1.8.0_144]
26-Jan-2018 22:49:40         at org.apache.maven.surefire.util.ReflectionUtils.invokeMethodWithArray(ReflectionUtils.java:189) [surefire-api-2.12.4.jar:2.12.4]
26-Jan-2018 22:49:40         at org.apache.maven.surefire.booter.ProviderFactory$ProviderProxy.invoke(ProviderFactory.java:165) [surefire-booter-2.12.4.jar:2.12.4]
26-Jan-2018 22:49:40         at org.apache.maven.surefire.booter.ProviderFactory.invokeProvider(ProviderFactory.java:85) [surefire-booter-2.12.4.jar:2.12.4]
26-Jan-2018 22:49:40         at org.apache.maven.surefire.booter.ForkedBooter.runSuitesInProcess(ForkedBooter.java:115) [surefire-booter-2.12.4.jar:2.12.4]
26-Jan-2018 22:49:40         at org.apache.maven.surefire.booter.ForkedBooter.main(ForkedBooter.java:75) [surefire-booter-2.12.4.jar:2.12.4]
26-Jan-2018 22:49:40 Caused by: java.lang.NoSuchMethodError: io.micrometer.core.instrument.Tags.zip([Ljava/lang/String;)Lio/micrometer/core/instrument/Tags;
26-Jan-2018 22:49:40         at org.springframework.boot.actuate.autoconfigure.metrics.amqp.RabbitMetricsConfiguration.bindConnectionFactoryToRegistry(RabbitMetricsConfiguration.java:69) ~[spring-boot-actuator-autoconfigure-2.0.0.BUILD-SNAPSHOT.jar:2.0.0.BUILD-SNAPSHOT]
26-Jan-2018 22:49:40         at java.util.LinkedHashMap.forEach(LinkedHashMap.java:684) ~[na:1.8.0_144]
26-Jan-2018 22:49:40         at org.springframework.boot.actuate.autoconfigure.metrics.amqp.RabbitMetricsConfiguration.bindConnectionFactoriesToRegistry(RabbitMetricsConfiguration.java:64) ~[spring-boot-actuator-autoconfigure-2.0.0.BUILD-SNAPSHOT.jar:2.0.0.BUILD-SNAPSHOT]
26-Jan-2018 22:49:40         at sun.reflect.NativeMethodAccessorImpl.invoke0(Native Method) ~[na:1.8.0_144]
26-Jan-2018 22:49:40         at sun.reflect.NativeMethodAccessorImpl.invoke(NativeMethodAccessorImpl.java:62) ~[na:1.8.0_144]
26-Jan-2018 22:49:40         at sun.reflect.DelegatingMethodAccessorImpl.invoke(DelegatingMethodAccessorImpl.java:43) ~[na:1.8.0_144]
26-Jan-2018 22:49:40         at java.lang.reflect.Method.invoke(Method.java:498) ~[na:1.8.0_144]
26-Jan-2018 22:49:40         at org.springframework.beans.factory.annotation.AutowiredAnnotationBeanPostProcessor$AutowiredMethodElement.inject(AutowiredAnnotationBeanPostProcessor.java:703) ~[spring-beans-5.0.3.RELEASE.jar:5.0.3.RELEASE]
26-Jan-2018 22:49:40         at org.springframework.beans.factory.annotation.InjectionMetadata.inject(InjectionMetadata.java:91) ~[spring-beans-5.0.3.RELEASE.jar:5.0.3.RELEASE]
26-Jan-2018 22:49:40         at org.springframework.beans.factory.annotation.AutowiredAnnotationBeanPostProcessor.postProcessPropertyValues(AutowiredAnnotationBeanPostProcessor.java:373) ~[spring-beans-5.0.3.RELEASE.jar:5.0.3.RELEASE]
26-Jan-2018 22:49:40         ... 47 common frames omitted
26-Jan-2018 22:49:40
26-Jan-2018 22:49:40 2018-01-26 22:49:40.848 ERROR 21964 --- [           main] o.s.test.context.TestContextManager      : Caught exception while allowing TestExecutionListener [org.springframework.test.context.web.ServletTestExecutionListener@7751a7a2] to prepare test instance [org.springframework.cloud.task.launcher.TaskLauncherSinkTests@60e28d20]
26-Jan-2018 22:49:40
26-Jan-2018 22:49:40 java.lang.IllegalStateException: Failed to load ApplicationContext
26-Jan-2018 22:49:40         at org.springframework.test.context.cache.DefaultCacheAwareContextLoaderDelegate.loadContext(DefaultCacheAwareContextLoaderDelegate.java:125) ~[spring-test-5.0.3.RELEASE.jar:5.0.3.RELEASE]
26-Jan-2018 22:49:40         at org.springframework.test.context.support.DefaultTestContext.getApplicationContext(DefaultTestContext.java:107) ~[spring-test-5.0.3.RELEASE.jar:5.0.3.RELEASE]
26-Jan-2018 22:49:40         at org.springframework.test.context.web.ServletTestExecutionListener.setUpRequestContextIfNecessary(ServletTestExecutionListener.java:190) ~[spring-test-5.0.3.RELEASE.jar:5.0.3.RELEASE]
26-Jan-2018 22:49:40         at org.springframework.test.context.web.ServletTestExecutionListener.prepareTestInstance(ServletTestExecutionListener.java:132) ~[spring-test-5.0.3.RELEASE.jar:5.0.3.RELEASE]
26-Jan-2018 22:49:40         at org.springframework.test.context.TestContextManager.prepareTestInstance(TestContextManager.java:242) ~[spring-test-5.0.3.RELEASE.jar:5.0.3.RELEASE]
26-Jan-2018 22:49:40         at org.springframework.test.context.junit4.SpringJUnit4ClassRunner.createTest(SpringJUnit4ClassRunner.java:227) [spring-test-5.0.3.RELEASE.jar:5.0.3.RELEASE]
26-Jan-2018 22:49:40         at org.springframework.test.context.junit4.SpringJUnit4ClassRunner$1.runReflectiveCall(SpringJUnit4ClassRunner.java:289) [spring-test-5.0.3.RELEASE.jar:5.0.3.RELEASE]
26-Jan-2018 22:49:40         at org.junit.internal.runners.model.ReflectiveCallable.run(ReflectiveCallable.java:12) [junit-4.12.jar:4.12]
26-Jan-2018 22:49:40         at org.springframework.test.context.junit4.SpringJUnit4ClassRunner.methodBlock(SpringJUnit4ClassRunner.java:291) [spring-test-5.0.3.RELEASE.jar:5.0.3.RELEASE]
26-Jan-2018 22:49:40         at org.springframework.test.context.junit4.SpringJUnit4ClassRunner.runChild(SpringJUnit4ClassRunner.java:246) [spring-test-5.0.3.RELEASE.jar:5.0.3.RELEASE]
26-Jan-2018 22:49:40         at org.springframework.test.context.junit4.SpringJUnit4ClassRunner.runChild(SpringJUnit4ClassRunner.java:97) [spring-test-5.0.3.RELEASE.jar:5.0.3.RELEASE]
26-Jan-2018 22:49:40         at org.junit.runners.ParentRunner$3.run(ParentRunner.java:290) [junit-4.12.jar:4.12]
26-Jan-2018 22:49:40         at org.junit.runners.ParentRunner$1.schedule(ParentRunner.java:71) [junit-4.12.jar:4.12]
26-Jan-2018 22:49:40         at org.junit.runners.ParentRunner.runChildren(ParentRunner.java:288) [junit-4.12.jar:4.12]
26-Jan-2018 22:49:40         at org.junit.runners.ParentRunner.access$000(ParentRunner.java:58) [junit-4.12.jar:4.12]
26-Jan-2018 22:49:40         at org.junit.runners.ParentRunner$2.evaluate(ParentRunner.java:268) [junit-4.12.jar:4.12]
26-Jan-2018 22:49:40         at org.springframework.test.context.junit4.statements.RunBeforeTestClassCallbacks.evaluate(RunBeforeTestClassCallbacks.java:61) [spring-test-5.0.3.RELEASE.jar:5.0.3.RELEASE]
26-Jan-2018 22:49:40         at org.springframework.test.context.junit4.statements.RunAfterTestClassCallbacks.evaluate(RunAfterTestClassCallbacks.java:70) [spring-test-5.0.3.RELEASE.jar:5.0.3.RELEASE]
26-Jan-2018 22:49:40         at org.junit.runners.ParentRunner.run(ParentRunner.java:363) [junit-4.12.jar:4.12]
26-Jan-2018 22:49:40         at org.springframework.test.context.junit4.SpringJUnit4ClassRunner.run(SpringJUnit4ClassRunner.java:190) [spring-test-5.0.3.RELEASE.jar:5.0.3.RELEASE]
26-Jan-2018 22:49:40         at org.apache.maven.surefire.junit4.JUnit4Provider.execute(JUnit4Provider.java:252) [surefire-junit4-2.12.4.jar:2.12.4]
26-Jan-2018 22:49:40         at org.apache.maven.surefire.junit4.JUnit4Provider.executeTestSet(JUnit4Provider.java:141) [surefire-junit4-2.12.4.jar:2.12.4]
26-Jan-2018 22:49:40         at org.apache.maven.surefire.junit4.JUnit4Provider.invoke(JUnit4Provider.java:112) [surefire-junit4-2.12.4.jar:2.12.4]
26-Jan-2018 22:49:40         at sun.reflect.NativeMethodAccessorImpl.invoke0(Native Method) ~[na:1.8.0_144]
26-Jan-2018 22:49:40         at sun.reflect.NativeMethodAccessorImpl.invoke(NativeMethodAccessorImpl.java:62) ~[na:1.8.0_144]
26-Jan-2018 22:49:40         at sun.reflect.DelegatingMethodAccessorImpl.invoke(DelegatingMethodAccessorImpl.java:43) ~[na:1.8.0_144]
26-Jan-2018 22:49:40         at java.lang.reflect.Method.invoke(Method.java:498) ~[na:1.8.0_144]
26-Jan-2018 22:49:40         at org.apache.maven.surefire.util.ReflectionUtils.invokeMethodWithArray(ReflectionUtils.java:189) [surefire-api-2.12.4.jar:2.12.4]
26-Jan-2018 22:49:40         at org.apache.maven.surefire.booter.ProviderFactory$ProviderProxy.invoke(ProviderFactory.java:165) [surefire-booter-2.12.4.jar:2.12.4]
26-Jan-2018 22:49:40         at org.apache.maven.surefire.booter.ProviderFactory.invokeProvider(ProviderFactory.java:85) [surefire-booter-2.12.4.jar:2.12.4]
26-Jan-2018 22:49:40         at org.apache.maven.surefire.booter.ForkedBooter.runSuitesInProcess(ForkedBooter.java:115) [surefire-booter-2.12.4.jar:2.12.4]
26-Jan-2018 22:49:40         at org.apache.maven.surefire.booter.ForkedBooter.main(ForkedBooter.java:75) [surefire-booter-2.12.4.jar:2.12.4]
26-Jan-2018 22:49:40 Caused by: org.springframework.beans.factory.BeanCreationException: Error creating bean with name 'org.springframework.boot.actuate.autoconfigure.metrics.amqp.RabbitMetricsConfiguration': Injection of autowired dependencies failed; nested exception is java.lang.NoSuchMethodError: io.micrometer.core.instrument.Tags.zip([Ljava/lang/String;)Lio/micrometer/core/instrument/Tags;
26-Jan-2018 22:49:40         at org.springframework.beans.factory.annotation.AutowiredAnnotationBeanPostProcessor.postProcessPropertyValues(AutowiredAnnotationBeanPostProcessor.java:379) ~[spring-beans-5.0.3.RELEASE.jar:5.0.3.RELEASE]
26-Jan-2018 22:49:40         at org.springframework.beans.factory.support.AbstractAutowireCapableBeanFactory.populateBean(AbstractAutowireCapableBeanFactory.java:1344) ~[spring-beans-5.0.3.RELEASE.jar:5.0.3.RELEASE]
26-Jan-2018 22:49:40         at org.springframework.beans.factory.support.AbstractAutowireCapableBeanFactory.doCreateBean(AbstractAutowireCapableBeanFactory.java:582) ~[spring-beans-5.0.3.RELEASE.jar:5.0.3.RELEASE]
26-Jan-2018 22:49:40         at org.springframework.beans.factory.support.AbstractAutowireCapableBeanFactory.createBean(AbstractAutowireCapableBeanFactory.java:502) ~[spring-beans-5.0.3.RELEASE.jar:5.0.3.RELEASE]
26-Jan-2018 22:49:40         at org.springframework.beans.factory.support.AbstractBeanFactory.lambda$doGetBean$0(AbstractBeanFactory.java:312) ~[spring-beans-5.0.3.RELEASE.jar:5.0.3.RELEASE]
26-Jan-2018 22:49:40         at org.springframework.beans.factory.support.DefaultSingletonBeanRegistry.getSingleton(DefaultSingletonBeanRegistry.java:228) ~[spring-beans-5.0.3.RELEASE.jar:5.0.3.RELEASE]
26-Jan-2018 22:49:40         at org.springframework.beans.factory.support.AbstractBeanFactory.doGetBean(AbstractBeanFactory.java:310) ~[spring-beans-5.0.3.RELEASE.jar:5.0.3.RELEASE]
26-Jan-2018 22:49:40         at org.springframework.beans.factory.support.AbstractBeanFactory.getBean(AbstractBeanFactory.java:200) ~[spring-beans-5.0.3.RELEASE.jar:5.0.3.RELEASE]
26-Jan-2018 22:49:40         at org.springframework.beans.factory.support.DefaultListableBeanFactory.preInstantiateSingletons(DefaultListableBeanFactory.java:761) ~[spring-beans-5.0.3.RELEASE.jar:5.0.3.RELEASE]
26-Jan-2018 22:49:40         at org.springframework.context.support.AbstractApplicationContext.finishBeanFactoryInitialization(AbstractApplicationContext.java:868) ~[spring-context-5.0.3.RELEASE.jar:5.0.3.RELEASE]
26-Jan-2018 22:49:40         at org.springframework.context.support.AbstractApplicationContext.refresh(AbstractApplicationContext.java:549) ~[spring-context-5.0.3.RELEASE.jar:5.0.3.RELEASE]
26-Jan-2018 22:49:40         at org.springframework.boot.SpringApplication.refresh(SpringApplication.java:752) ~[spring-boot-2.0.0.BUILD-SNAPSHOT.jar:2.0.0.BUILD-SNAPSHOT]
26-Jan-2018 22:49:40         at org.springframework.boot.SpringApplication.refreshContext(SpringApplication.java:388) ~[spring-boot-2.0.0.BUILD-SNAPSHOT.jar:2.0.0.BUILD-SNAPSHOT]
26-Jan-2018 22:49:40         at org.springframework.boot.SpringApplication.run(SpringApplication.java:327) ~[spring-boot-2.0.0.BUILD-SNAPSHOT.jar:2.0.0.BUILD-SNAPSHOT]
26-Jan-2018 22:49:40         at org.springframework.boot.test.context.SpringBootContextLoader.loadContext(SpringBootContextLoader.java:138) ~[spring-boot-test-2.0.0.BUILD-SNAPSHOT.jar:2.0.0.BUILD-SNAPSHOT]
26-Jan-2018 22:49:40         at org.springframework.test.context.cache.DefaultCacheAwareContextLoaderDelegate.loadContextInternal(DefaultCacheAwareContextLoaderDelegate.java:99) ~[spring-test-5.0.3.RELEASE.jar:5.0.3.RELEASE]
26-Jan-2018 22:49:40         at org.springframework.test.context.cache.DefaultCacheAwareContextLoaderDelegate.loadContext(DefaultCacheAwareContextLoaderDelegate.java:117) ~[spring-test-5.0.3.RELEASE.jar:5.0.3.RELEASE]
26-Jan-2018 22:49:40         ... 31 common frames omitted
26-Jan-2018 22:49:40 Caused by: java.lang.NoSuchMethodError: io.micrometer.core.instrument.Tags.zip([Ljava/lang/String;)Lio/micrometer/core/instrument/Tags;
26-Jan-2018 22:49:40         at org.springframework.boot.actuate.autoconfigure.metrics.amqp.RabbitMetricsConfiguration.bindConnectionFactoryToRegistry(RabbitMetricsConfiguration.java:69) ~[spring-boot-actuator-autoconfigure-2.0.0.BUILD-SNAPSHOT.jar:2.0.0.BUILD-SNAPSHOT]
26-Jan-2018 22:49:40         at java.util.LinkedHashMap.forEach(LinkedHashMap.java:684) ~[na:1.8.0_144]
26-Jan-2018 22:49:40         at org.springframework.boot.actuate.autoconfigure.metrics.amqp.RabbitMetricsConfiguration.bindConnectionFactoriesToRegistry(RabbitMetricsConfiguration.java:64) ~[spring-boot-actuator-autoconfigure-2.0.0.BUILD-SNAPSHOT.jar:2.0.0.BUILD-SNAPSHOT]
26-Jan-2018 22:49:40         at sun.reflect.NativeMethodAccessorImpl.invoke0(Native Method) ~[na:1.8.0_144]
26-Jan-2018 22:49:40         at sun.reflect.NativeMethodAccessorImpl.invoke(NativeMethodAccessorImpl.java:62) ~[na:1.8.0_144]
26-Jan-2018 22:49:40         at sun.reflect.DelegatingMethodAccessorImpl.invoke(DelegatingMethodAccessorImpl.java:43) ~[na:1.8.0_144]
26-Jan-2018 22:49:40         at java.lang.reflect.Method.invoke(Method.java:498) ~[na:1.8.0_144]
26-Jan-2018 22:49:40         at org.springframework.beans.factory.annotation.AutowiredAnnotationBeanPostProcessor$AutowiredMethodElement.inject(AutowiredAnnotationBeanPostProcessor.java:703) ~[spring-beans-5.0.3.RELEASE.jar:5.0.3.RELEASE]
26-Jan-2018 22:49:40         at org.springframework.beans.factory.annotation.InjectionMetadata.inject(InjectionMetadata.java:91) ~[spring-beans-5.0.3.RELEASE.jar:5.0.3.RELEASE]
26-Jan-2018 22:49:40         at org.springframework.beans.factory.annotation.AutowiredAnnotationBeanPostProcessor.postProcessPropertyValues(AutowiredAnnotationBeanPostProcessor.java:373) ~[spring-beans-5.0.3.RELEASE.jar:5.0.3.RELEASE]
26-Jan-2018 22:49:40         ... 47 common frames omitted
26-Jan-2018 22:49:40
26-Jan-2018 22:49:40 Tests run: 6, Failures: 0, Errors: 6, Skipped: 0, Time elapsed: 10.144 sec <<< FAILURE!
26-Jan-2018 22:49:40 testNoTaskLauncher(org.springframework.cloud.task.launcher.TaskLauncherSinkTests)  Time elapsed: 0.001 sec  <<< ERROR!
26-Jan-2018 22:49:40 java.lang.IllegalStateException: Failed to load ApplicationContext
26-Jan-2018 22:49:40         at org.springframework.test.context.cache.DefaultCacheAwareContextLoaderDelegate.loadContext(DefaultCacheAwareContextLoaderDelegate.java:125)
26-Jan-2018 22:49:40         at org.springframework.test.context.support.DefaultTestContext.getApplicationContext(DefaultTestContext.java:107)
26-Jan-2018 22:49:40         at org.springframework.test.context.web.ServletTestExecutionListener.setUpRequestContextIfNecessary(ServletTestExecutionListener.java:190)
26-Jan-2018 22:49:40         at org.springframework.test.context.web.ServletTestExecutionListener.prepareTestInstance(ServletTestExecutionListener.java:132)
26-Jan-2018 22:49:40         at org.springframework.test.context.TestContextManager.prepareTestInstance(TestContextManager.java:242)
26-Jan-2018 22:49:40         at org.springframework.test.context.junit4.SpringJUnit4ClassRunner.createTest(SpringJUnit4ClassRunner.java:227)
26-Jan-2018 22:49:40         at org.springframework.test.context.junit4.SpringJUnit4ClassRunner$1.runReflectiveCall(SpringJUnit4ClassRunner.java:289)
26-Jan-2018 22:49:40         at org.junit.internal.runners.model.ReflectiveCallable.run(ReflectiveCallable.java:12)
26-Jan-2018 22:49:40         at org.springframework.test.context.junit4.SpringJUnit4ClassRunner.methodBlock(SpringJUnit4ClassRunner.java:291)
26-Jan-2018 22:49:40         at org.springframework.test.context.junit4.SpringJUnit4ClassRunner.runChild(SpringJUnit4ClassRunner.java:246)
26-Jan-2018 22:49:40         at org.springframework.test.context.junit4.SpringJUnit4ClassRunner.runChild(SpringJUnit4ClassRunner.java:97)
26-Jan-2018 22:49:40         at org.junit.runners.ParentRunner$3.run(ParentRunner.java:290)
26-Jan-2018 22:49:40         at org.junit.runners.ParentRunner$1.schedule(ParentRunner.java:71)
26-Jan-2018 22:49:40         at org.junit.runners.ParentRunner.runChildren(ParentRunner.java:288)
26-Jan-2018 22:49:40         at org.junit.runners.ParentRunner.access$000(ParentRunner.java:58)
26-Jan-2018 22:49:40         at org.junit.runners.ParentRunner$2.evaluate(ParentRunner.java:268)
26-Jan-2018 22:49:40         at org.springframework.test.context.junit4.statements.RunBeforeTestClassCallbacks.evaluate(RunBeforeTestClassCallbacks.java:61)
26-Jan-2018 22:49:40         at org.springframework.test.context.junit4.statements.RunAfterTestClassCallbacks.evaluate(RunAfterTestClassCallbacks.java:70)
26-Jan-2018 22:49:40         at org.junit.runners.ParentRunner.run(ParentRunner.java:363)
26-Jan-2018 22:49:40         at org.springframework.test.context.junit4.SpringJUnit4ClassRunner.run(SpringJUnit4ClassRunner.java:190)
26-Jan-2018 22:49:40         at org.apache.maven.surefire.junit4.JUnit4Provider.execute(JUnit4Provider.java:252)
26-Jan-2018 22:49:40         at org.apache.maven.surefire.junit4.JUnit4Provider.executeTestSet(JUnit4Provider.java:141)
26-Jan-2018 22:49:40         at org.apache.maven.surefire.junit4.JUnit4Provider.invoke(JUnit4Provider.java:112)
26-Jan-2018 22:49:40         at sun.reflect.NativeMethodAccessorImpl.invoke0(Native Method)
26-Jan-2018 22:49:40         at sun.reflect.NativeMethodAccessorImpl.invoke(NativeMethodAccessorImpl.java:62)
26-Jan-2018 22:49:40         at sun.reflect.DelegatingMethodAccessorImpl.invoke(DelegatingMethodAccessorImpl.java:43)
26-Jan-2018 22:49:40         at java.lang.reflect.Method.invoke(Method.java:498)
26-Jan-2018 22:49:40         at org.apache.maven.surefire.util.ReflectionUtils.invokeMethodWithArray(ReflectionUtils.java:189)
26-Jan-2018 22:49:40         at org.apache.maven.surefire.booter.ProviderFactory$ProviderProxy.invoke(ProviderFactory.java:165)
26-Jan-2018 22:49:40         at org.apache.maven.surefire.booter.ProviderFactory.invokeProvider(ProviderFactory.java:85)
26-Jan-2018 22:49:40         at org.apache.maven.surefire.booter.ForkedBooter.runSuitesInProcess(ForkedBooter.java:115)
26-Jan-2018 22:49:40         at org.apache.maven.surefire.booter.ForkedBooter.main(ForkedBooter.java:75)
26-Jan-2018 22:49:40 Caused by: org.springframework.beans.factory.BeanCreationException: Error creating bean with name 'org.springframework.boot.actuate.autoconfigure.metrics.amqp.RabbitMetricsConfiguration': Injection of autowired dependencies failed; nested exception is java.lang.NoSuchMethodError: io.micrometer.core.instrument.Tags.zip([Ljava/lang/String;)Lio/micrometer/core/instrument/Tags;
26-Jan-2018 22:49:40         at org.springframework.beans.factory.annotation.AutowiredAnnotationBeanPostProcessor.postProcessPropertyValues(AutowiredAnnotationBeanPostProcessor.java:379)
26-Jan-2018 22:49:40         at org.springframework.beans.factory.support.AbstractAutowireCapableBeanFactory.populateBean(AbstractAutowireCapableBeanFactory.java:1344)
26-Jan-2018 22:49:40         at org.springframework.beans.factory.support.AbstractAutowireCapableBeanFactory.doCreateBean(AbstractAutowireCapableBeanFactory.java:582)
26-Jan-2018 22:49:40         at org.springframework.beans.factory.support.AbstractAutowireCapableBeanFactory.createBean(AbstractAutowireCapableBeanFactory.java:502)
26-Jan-2018 22:49:40         at org.springframework.beans.factory.support.AbstractBeanFactory.lambda$doGetBean$0(AbstractBeanFactory.java:312)
26-Jan-2018 22:49:40         at org.springframework.beans.factory.support.DefaultSingletonBeanRegistry.getSingleton(DefaultSingletonBeanRegistry.java:228)
26-Jan-2018 22:49:40         at org.springframework.beans.factory.support.AbstractBeanFactory.doGetBean(AbstractBeanFactory.java:310)
26-Jan-2018 22:49:40         at org.springframework.beans.factory.support.AbstractBeanFactory.getBean(AbstractBeanFactory.java:200)
26-Jan-2018 22:49:40         at org.springframework.beans.factory.support.DefaultListableBeanFactory.preInstantiateSingletons(DefaultListableBeanFactory.java:761)
26-Jan-2018 22:49:40         at org.springframework.context.support.AbstractApplicationContext.finishBeanFactoryInitialization(AbstractApplicationContext.java:868)
26-Jan-2018 22:49:40         at org.springframework.context.support.AbstractApplicationContext.refresh(AbstractApplicationContext.java:549)
26-Jan-2018 22:49:40         at org.springframework.boot.SpringApplication.refresh(SpringApplication.java:752)
26-Jan-2018 22:49:40         at org.springframework.boot.SpringApplication.refreshContext(SpringApplication.java:388)
26-Jan-2018 22:49:40         at org.springframework.boot.SpringApplication.run(SpringApplication.java:327)
26-Jan-2018 22:49:40         at org.springframework.boot.test.context.SpringBootContextLoader.loadContext(SpringBootContextLoader.java:138)
26-Jan-2018 22:49:40         at org.springframework.test.context.cache.DefaultCacheAwareContextLoaderDelegate.loadContextInternal(DefaultCacheAwareContextLoaderDelegate.java:99)
26-Jan-2018 22:49:40         at org.springframework.test.context.cache.DefaultCacheAwareContextLoaderDelegate.loadContext(DefaultCacheAwareContextLoaderDelegate.java:117)
26-Jan-2018 22:49:40         ... 31 more
26-Jan-2018 22:49:40 Caused by: java.lang.NoSuchMethodError: io.micrometer.core.instrument.Tags.zip([Ljava/lang/String;)Lio/micrometer/core/instrument/Tags;
26-Jan-2018 22:49:40         at org.springframework.boot.actuate.autoconfigure.metrics.amqp.RabbitMetricsConfiguration.bindConnectionFactoryToRegistry(RabbitMetricsConfiguration.java:69)
26-Jan-2018 22:49:40         at java.util.LinkedHashMap.forEach(LinkedHashMap.java:684)
26-Jan-2018 22:49:40         at org.springframework.boot.actuate.autoconfigure.metrics.amqp.RabbitMetricsConfiguration.bindConnectionFactoriesToRegistry(RabbitMetricsConfiguration.java:64)
26-Jan-2018 22:49:40         at sun.reflect.NativeMethodAccessorImpl.invoke0(Native Method)
26-Jan-2018 22:49:40         at sun.reflect.NativeMethodAccessorImpl.invoke(NativeMethodAccessorImpl.java:62)
26-Jan-2018 22:49:40         at sun.reflect.DelegatingMethodAccessorImpl.invoke(DelegatingMethodAccessorImpl.java:43)
26-Jan-2018 22:49:40         at java.lang.reflect.Method.invoke(Method.java:498)
26-Jan-2018 22:49:40         at org.springframework.beans.factory.annotation.AutowiredAnnotationBeanPostProcessor$AutowiredMethodElement.inject(AutowiredAnnotationBeanPostProcessor.java:703)
26-Jan-2018 22:49:40         at org.springframework.beans.factory.annotation.InjectionMetadata.inject(InjectionMetadata.java:91)
26-Jan-2018 22:49:40         at org.springframework.beans.factory.annotation.AutowiredAnnotationBeanPostProcessor.postProcessPropertyValues(AutowiredAnnotationBeanPostProcessor.java:373)
26-Jan-2018 22:49:40         ... 47 more
26-Jan-2018 22:49:40
26-Jan-2018 22:49:40 testNoRun(org.springframework.cloud.task.launcher.TaskLauncherSinkTests)  Time elapsed: 0.001 sec  <<< ERROR!
26-Jan-2018 22:49:40 java.lang.IllegalStateException: Failed to load ApplicationContext
26-Jan-2018 22:49:40         at org.springframework.test.context.cache.DefaultCacheAwareContextLoaderDelegate.loadContext(DefaultCacheAwareContextLoaderDelegate.java:125)
26-Jan-2018 22:49:40         at org.springframework.test.context.support.DefaultTestContext.getApplicationContext(DefaultTestContext.java:107)
26-Jan-2018 22:49:40         at org.springframework.test.context.web.ServletTestExecutionListener.setUpRequestContextIfNecessary(ServletTestExecutionListener.java:190)
26-Jan-2018 22:49:40         at org.springframework.test.context.web.ServletTestExecutionListener.prepareTestInstance(ServletTestExecutionListener.java:132)
26-Jan-2018 22:49:40         at org.springframework.test.context.TestContextManager.prepareTestInstance(TestContextManager.java:242)
26-Jan-2018 22:49:40         at org.springframework.test.context.junit4.SpringJUnit4ClassRunner.createTest(SpringJUnit4ClassRunner.java:227)
26-Jan-2018 22:49:40         at org.springframework.test.context.junit4.SpringJUnit4ClassRunner$1.runReflectiveCall(SpringJUnit4ClassRunner.java:289)
26-Jan-2018 22:49:40         at org.junit.internal.runners.model.ReflectiveCallable.run(ReflectiveCallable.java:12)
26-Jan-2018 22:49:40         at org.springframework.test.context.junit4.SpringJUnit4ClassRunner.methodBlock(SpringJUnit4ClassRunner.java:291)
26-Jan-2018 22:49:40         at org.springframework.test.context.junit4.SpringJUnit4ClassRunner.runChild(SpringJUnit4ClassRunner.java:246)
26-Jan-2018 22:49:40         at org.springframework.test.context.junit4.SpringJUnit4ClassRunner.runChild(SpringJUnit4ClassRunner.java:97)
26-Jan-2018 22:49:40         at org.junit.runners.ParentRunner$3.run(ParentRunner.java:290)
26-Jan-2018 22:49:40         at org.junit.runners.ParentRunner$1.schedule(ParentRunner.java:71)
26-Jan-2018 22:49:40         at org.junit.runners.ParentRunner.runChildren(ParentRunner.java:288)
26-Jan-2018 22:49:40         at org.junit.runners.ParentRunner.access$000(ParentRunner.java:58)
26-Jan-2018 22:49:40         at org.junit.runners.ParentRunner$2.evaluate(ParentRunner.java:268)
26-Jan-2018 22:49:40         at org.springframework.test.context.junit4.statements.RunBeforeTestClassCallbacks.evaluate(RunBeforeTestClassCallbacks.java:61)
26-Jan-2018 22:49:40         at org.springframework.test.context.junit4.statements.RunAfterTestClassCallbacks.evaluate(RunAfterTestClassCallbacks.java:70)
26-Jan-2018 22:49:40         at org.junit.runners.ParentRunner.run(ParentRunner.java:363)
26-Jan-2018 22:49:40         at org.springframework.test.context.junit4.SpringJUnit4ClassRunner.run(SpringJUnit4ClassRunner.java:190)
26-Jan-2018 22:49:40         at org.apache.maven.surefire.junit4.JUnit4Provider.execute(JUnit4Provider.java:252)
26-Jan-2018 22:49:40         at org.apache.maven.surefire.junit4.JUnit4Provider.executeTestSet(JUnit4Provider.java:141)
26-Jan-2018 22:49:40         at org.apache.maven.surefire.junit4.JUnit4Provider.invoke(JUnit4Provider.java:112)
26-Jan-2018 22:49:40         at sun.reflect.NativeMethodAccessorImpl.invoke0(Native Method)
26-Jan-2018 22:49:40         at sun.reflect.NativeMethodAccessorImpl.invoke(NativeMethodAccessorImpl.java:62)
26-Jan-2018 22:49:40         at sun.reflect.DelegatingMethodAccessorImpl.invoke(DelegatingMethodAccessorImpl.java:43)
26-Jan-2018 22:49:40         at java.lang.reflect.Method.invoke(Method.java:498)
26-Jan-2018 22:49:40         at org.apache.maven.surefire.util.ReflectionUtils.invokeMethodWithArray(ReflectionUtils.java:189)
26-Jan-2018 22:49:40         at org.apache.maven.surefire.booter.ProviderFactory$ProviderProxy.invoke(ProviderFactory.java:165)
26-Jan-2018 22:49:40         at org.apache.maven.surefire.booter.ProviderFactory.invokeProvider(ProviderFactory.java:85)
26-Jan-2018 22:49:40         at org.apache.maven.surefire.booter.ForkedBooter.runSuitesInProcess(ForkedBooter.java:115)
26-Jan-2018 22:49:40         at org.apache.maven.surefire.booter.ForkedBooter.main(ForkedBooter.java:75)
26-Jan-2018 22:49:40 Caused by: org.springframework.beans.factory.BeanCreationException: Error creating bean with name 'org.springframework.boot.actuate.autoconfigure.metrics.amqp.RabbitMetricsConfiguration': Injection of autowired dependencies failed; nested exception is java.lang.NoSuchMethodError: io.micrometer.core.instrument.Tags.zip([Ljava/lang/String;)Lio/micrometer/core/instrument/Tags;
26-Jan-2018 22:49:40         at org.springframework.beans.factory.annotation.AutowiredAnnotationBeanPostProcessor.postProcessPropertyValues(AutowiredAnnotationBeanPostProcessor.java:379)
26-Jan-2018 22:49:40         at org.springframework.beans.factory.support.AbstractAutowireCapableBeanFactory.populateBean(AbstractAutowireCapableBeanFactory.java:1344)
26-Jan-2018 22:49:40         at org.springframework.beans.factory.support.AbstractAutowireCapableBeanFactory.doCreateBean(AbstractAutowireCapableBeanFactory.java:582)
26-Jan-2018 22:49:40         at org.springframework.beans.factory.support.AbstractAutowireCapableBeanFactory.createBean(AbstractAutowireCapableBeanFactory.java:502)
26-Jan-2018 22:49:40         at org.springframework.beans.factory.support.AbstractBeanFactory.lambda$doGetBean$0(AbstractBeanFactory.java:312)
26-Jan-2018 22:49:40         at org.springframework.beans.factory.support.DefaultSingletonBeanRegistry.getSingleton(DefaultSingletonBeanRegistry.java:228)
26-Jan-2018 22:49:40         at org.springframework.beans.factory.support.AbstractBeanFactory.doGetBean(AbstractBeanFactory.java:310)
26-Jan-2018 22:49:40         at org.springframework.beans.factory.support.AbstractBeanFactory.getBean(AbstractBeanFactory.java:200)
26-Jan-2018 22:49:40         at org.springframework.beans.factory.support.DefaultListableBeanFactory.preInstantiateSingletons(DefaultListableBeanFactory.java:761)
26-Jan-2018 22:49:40         at org.springframework.context.support.AbstractApplicationContext.finishBeanFactoryInitialization(AbstractApplicationContext.java:868)
26-Jan-2018 22:49:40         at org.springframework.context.support.AbstractApplicationContext.refresh(AbstractApplicationContext.java:549)
26-Jan-2018 22:49:40         at org.springframework.boot.SpringApplication.refresh(SpringApplication.java:752)
26-Jan-2018 22:49:40         at org.springframework.boot.SpringApplication.refreshContext(SpringApplication.java:388)
26-Jan-2018 22:49:40         at org.springframework.boot.SpringApplication.run(SpringApplication.java:327)
26-Jan-2018 22:49:40         at org.springframework.boot.test.context.SpringBootContextLoader.loadContext(SpringBootContextLoader.java:138)
26-Jan-2018 22:49:40         at org.springframework.test.context.cache.DefaultCacheAwareContextLoaderDelegate.loadContextInternal(DefaultCacheAwareContextLoaderDelegate.java:99)
26-Jan-2018 22:49:40         at org.springframework.test.context.cache.DefaultCacheAwareContextLoaderDelegate.loadContext(DefaultCacheAwareContextLoaderDelegate.java:117)
26-Jan-2018 22:49:40         ... 31 more
26-Jan-2018 22:49:40 Caused by: java.lang.NoSuchMethodError: io.micrometer.core.instrument.Tags.zip([Ljava/lang/String;)Lio/micrometer/core/instrument/Tags;
26-Jan-2018 22:49:40         at org.springframework.boot.actuate.autoconfigure.metrics.amqp.RabbitMetricsConfiguration.bindConnectionFactoryToRegistry(RabbitMetricsConfiguration.java:69)
26-Jan-2018 22:49:40         at java.util.LinkedHashMap.forEach(LinkedHashMap.java:684)
26-Jan-2018 22:49:40         at org.springframework.boot.actuate.autoconfigure.metrics.amqp.RabbitMetricsConfiguration.bindConnectionFactoriesToRegistry(RabbitMetricsConfiguration.java:64)
26-Jan-2018 22:49:40         at sun.reflect.NativeMethodAccessorImpl.invoke0(Native Method)
26-Jan-2018 22:49:40         at sun.reflect.NativeMethodAccessorImpl.invoke(NativeMethodAccessorImpl.java:62)
26-Jan-2018 22:49:40         at sun.reflect.DelegatingMethodAccessorImpl.invoke(DelegatingMethodAccessorImpl.java:43)
26-Jan-2018 22:49:40         at java.lang.reflect.Method.invoke(Method.java:498)
26-Jan-2018 22:49:40         at org.springframework.beans.factory.annotation.AutowiredAnnotationBeanPostProcessor$AutowiredMethodElement.inject(AutowiredAnnotationBeanPostProcessor.java:703)
26-Jan-2018 22:49:40         at org.springframework.beans.factory.annotation.InjectionMetadata.inject(InjectionMetadata.java:91)
26-Jan-2018 22:49:40         at org.springframework.beans.factory.annotation.AutowiredAnnotationBeanPostProcessor.postProcessPropertyValues(AutowiredAnnotationBeanPostProcessor.java:373)
26-Jan-2018 22:49:40         ... 47 more
26-Jan-2018 22:49:40
26-Jan-2018 22:49:40 testSuccessWithAppName(org.springframework.cloud.task.launcher.TaskLauncherSinkTests)  Time elapsed: 0.001 sec  <<< ERROR!
26-Jan-2018 22:49:40 java.lang.IllegalStateException: Failed to load ApplicationContext
26-Jan-2018 22:49:40         at org.springframework.test.context.cache.DefaultCacheAwareContextLoaderDelegate.loadContext(DefaultCacheAwareContextLoaderDelegate.java:125)
26-Jan-2018 22:49:40         at org.springframework.test.context.support.DefaultTestContext.getApplicationContext(DefaultTestContext.java:107)
26-Jan-2018 22:49:40         at org.springframework.test.context.web.ServletTestExecutionListener.setUpRequestContextIfNecessary(ServletTestExecutionListener.java:190)
26-Jan-2018 22:49:40         at org.springframework.test.context.web.ServletTestExecutionListener.prepareTestInstance(ServletTestExecutionListener.java:132)
26-Jan-2018 22:49:40         at org.springframework.test.context.TestContextManager.prepareTestInstance(TestContextManager.java:242)
26-Jan-2018 22:49:40         at org.springframework.test.context.junit4.SpringJUnit4ClassRunner.createTest(SpringJUnit4ClassRunner.java:227)
26-Jan-2018 22:49:40         at org.springframework.test.context.junit4.SpringJUnit4ClassRunner$1.runReflectiveCall(SpringJUnit4ClassRunner.java:289)
26-Jan-2018 22:49:40         at org.junit.internal.runners.model.ReflectiveCallable.run(ReflectiveCallable.java:12)
26-Jan-2018 22:49:40         at org.springframework.test.context.junit4.SpringJUnit4ClassRunner.methodBlock(SpringJUnit4ClassRunner.java:291)
26-Jan-2018 22:49:40         at org.springframework.test.context.junit4.SpringJUnit4ClassRunner.runChild(SpringJUnit4ClassRunner.java:246)
26-Jan-2018 22:49:40         at org.springframework.test.context.junit4.SpringJUnit4ClassRunner.runChild(SpringJUnit4ClassRunner.java:97)
26-Jan-2018 22:49:40         at org.junit.runners.ParentRunner$3.run(ParentRunner.java:290)
26-Jan-2018 22:49:40         at org.junit.runners.ParentRunner$1.schedule(ParentRunner.java:71)
26-Jan-2018 22:49:40         at org.junit.runners.ParentRunner.runChildren(ParentRunner.java:288)
26-Jan-2018 22:49:40         at org.junit.runners.ParentRunner.access$000(ParentRunner.java:58)
26-Jan-2018 22:49:40         at org.junit.runners.ParentRunner$2.evaluate(ParentRunner.java:268)
26-Jan-2018 22:49:40         at org.springframework.test.context.junit4.statements.RunBeforeTestClassCallbacks.evaluate(RunBeforeTestClassCallbacks.java:61)
26-Jan-2018 22:49:40         at org.springframework.test.context.junit4.statements.RunAfterTestClassCallbacks.evaluate(RunAfterTestClassCallbacks.java:70)
26-Jan-2018 22:49:40         at org.junit.runners.ParentRunner.run(ParentRunner.java:363)
26-Jan-2018 22:49:40         at org.springframework.test.context.junit4.SpringJUnit4ClassRunner.run(SpringJUnit4ClassRunner.java:190)
26-Jan-2018 22:49:40         at org.apache.maven.surefire.junit4.JUnit4Provider.execute(JUnit4Provider.java:252)
26-Jan-2018 22:49:40         at org.apache.maven.surefire.junit4.JUnit4Provider.executeTestSet(JUnit4Provider.java:141)
26-Jan-2018 22:49:40         at org.apache.maven.surefire.junit4.JUnit4Provider.invoke(JUnit4Provider.java:112)
26-Jan-2018 22:49:40         at sun.reflect.NativeMethodAccessorImpl.invoke0(Native Method)
26-Jan-2018 22:49:40         at sun.reflect.NativeMethodAccessorImpl.invoke(NativeMethodAccessorImpl.java:62)
26-Jan-2018 22:49:40         at sun.reflect.DelegatingMethodAccessorImpl.invoke(DelegatingMethodAccessorImpl.java:43)
26-Jan-2018 22:49:40         at java.lang.reflect.Method.invoke(Method.java:498)
26-Jan-2018 22:49:40         at org.apache.maven.surefire.util.ReflectionUtils.invokeMethodWithArray(ReflectionUtils.java:189)
26-Jan-2018 22:49:40         at org.apache.maven.surefire.booter.ProviderFactory$ProviderProxy.invoke(ProviderFactory.java:165)
26-Jan-2018 22:49:40         at org.apache.maven.surefire.booter.ProviderFactory.invokeProvider(ProviderFactory.java:85)
26-Jan-2018 22:49:40         at org.apache.maven.surefire.booter.ForkedBooter.runSuitesInProcess(ForkedBooter.java:115)
26-Jan-2018 22:49:40         at org.apache.maven.surefire.booter.ForkedBooter.main(ForkedBooter.java:75)
26-Jan-2018 22:49:40 Caused by: org.springframework.beans.factory.BeanCreationException: Error creating bean with name 'org.springframework.boot.actuate.autoconfigure.metrics.amqp.RabbitMetricsConfiguration': Injection of autowired dependencies failed; nested exception is java.lang.NoSuchMethodError: io.micrometer.core.instrument.Tags.zip([Ljava/lang/String;)Lio/micrometer/core/instrument/Tags;
26-Jan-2018 22:49:40         at org.springframework.beans.factory.annotation.AutowiredAnnotationBeanPostProcessor.postProcessPropertyValues(AutowiredAnnotationBeanPostProcessor.java:379)
26-Jan-2018 22:49:40         at org.springframework.beans.factory.support.AbstractAutowireCapableBeanFactory.populateBean(AbstractAutowireCapableBeanFactory.java:1344)
26-Jan-2018 22:49:40         at org.springframework.beans.factory.support.AbstractAutowireCapableBeanFactory.doCreateBean(AbstractAutowireCapableBeanFactory.java:582)
26-Jan-2018 22:49:40         at org.springframework.beans.factory.support.AbstractAutowireCapableBeanFactory.createBean(AbstractAutowireCapableBeanFactory.java:502)
26-Jan-2018 22:49:40         at org.springframework.beans.factory.support.AbstractBeanFactory.lambda$doGetBean$0(AbstractBeanFactory.java:312)
26-Jan-2018 22:49:40         at org.springframework.beans.factory.support.DefaultSingletonBeanRegistry.getSingleton(DefaultSingletonBeanRegistry.java:228)
26-Jan-2018 22:49:40         at org.springframework.beans.factory.support.AbstractBeanFactory.doGetBean(AbstractBeanFactory.java:310)
26-Jan-2018 22:49:40         at org.springframework.beans.factory.support.AbstractBeanFactory.getBean(AbstractBeanFactory.java:200)
26-Jan-2018 22:49:40         at org.springframework.beans.factory.support.DefaultListableBeanFactory.preInstantiateSingletons(DefaultListableBeanFactory.java:761)
26-Jan-2018 22:49:40         at org.springframework.context.support.AbstractApplicationContext.finishBeanFactoryInitialization(AbstractApplicationContext.java:868)
26-Jan-2018 22:49:40         at org.springframework.context.support.AbstractApplicationContext.refresh(AbstractApplicationContext.java:549)
26-Jan-2018 22:49:40         at org.springframework.boot.SpringApplication.refresh(SpringApplication.java:752)
26-Jan-2018 22:49:40         at org.springframework.boot.SpringApplication.refreshContext(SpringApplication.java:388)
26-Jan-2018 22:49:40         at org.springframework.boot.SpringApplication.run(SpringApplication.java:327)
26-Jan-2018 22:49:40         at org.springframework.boot.test.context.SpringBootContextLoader.loadContext(SpringBootContextLoader.java:138)
26-Jan-2018 22:49:40         at org.springframework.test.context.cache.DefaultCacheAwareContextLoaderDelegate.loadContextInternal(DefaultCacheAwareContextLoaderDelegate.java:99)
26-Jan-2018 22:49:40         at org.springframework.test.context.cache.DefaultCacheAwareContextLoaderDelegate.loadContext(DefaultCacheAwareContextLoaderDelegate.java:117)
26-Jan-2018 22:49:40         ... 31 more
26-Jan-2018 22:49:40 Caused by: java.lang.NoSuchMethodError: io.micrometer.core.instrument.Tags.zip([Ljava/lang/String;)Lio/micrometer/core/instrument/Tags;
26-Jan-2018 22:49:40         at org.springframework.boot.actuate.autoconfigure.metrics.amqp.RabbitMetricsConfiguration.bindConnectionFactoryToRegistry(RabbitMetricsConfiguration.java:69)
26-Jan-2018 22:49:40         at java.util.LinkedHashMap.forEach(LinkedHashMap.java:684)
26-Jan-2018 22:49:40         at org.springframework.boot.actuate.autoconfigure.metrics.amqp.RabbitMetricsConfiguration.bindConnectionFactoriesToRegistry(RabbitMetricsConfiguration.java:64)
26-Jan-2018 22:49:40         at sun.reflect.NativeMethodAccessorImpl.invoke0(Native Method)
26-Jan-2018 22:49:40         at sun.reflect.NativeMethodAccessorImpl.invoke(NativeMethodAccessorImpl.java:62)
26-Jan-2018 22:49:40         at sun.reflect.DelegatingMethodAccessorImpl.invoke(DelegatingMethodAccessorImpl.java:43)
26-Jan-2018 22:49:40         at java.lang.reflect.Method.invoke(Method.java:498)
26-Jan-2018 22:49:40         at org.springframework.beans.factory.annotation.AutowiredAnnotationBeanPostProcessor$AutowiredMethodElement.inject(AutowiredAnnotationBeanPostProcessor.java:703)
26-Jan-2018 22:49:40         at org.springframework.beans.factory.annotation.InjectionMetadata.inject(InjectionMetadata.java:91)
26-Jan-2018 22:49:40         at org.springframework.beans.factory.annotation.AutowiredAnnotationBeanPostProcessor.postProcessPropertyValues(AutowiredAnnotationBeanPostProcessor.java:373)
26-Jan-2018 22:49:40         ... 47 more
26-Jan-2018 22:49:40
26-Jan-2018 22:49:40 testSuccessNoParams(org.springframework.cloud.task.launcher.TaskLauncherSinkTests)  Time elapsed: 0.001 sec  <<< ERROR!
26-Jan-2018 22:49:40 java.lang.IllegalStateException: Failed to load ApplicationContext
26-Jan-2018 22:49:40         at org.springframework.test.context.cache.DefaultCacheAwareContextLoaderDelegate.loadContext(DefaultCacheAwareContextLoaderDelegate.java:125)
26-Jan-2018 22:49:40         at org.springframework.test.context.support.DefaultTestContext.getApplicationContext(DefaultTestContext.java:107)
26-Jan-2018 22:49:40         at org.springframework.test.context.web.ServletTestExecutionListener.setUpRequestContextIfNecessary(ServletTestExecutionListener.java:190)
26-Jan-2018 22:49:40         at org.springframework.test.context.web.ServletTestExecutionListener.prepareTestInstance(ServletTestExecutionListener.java:132)
26-Jan-2018 22:49:40         at org.springframework.test.context.TestContextManager.prepareTestInstance(TestContextManager.java:242)
26-Jan-2018 22:49:40         at org.springframework.test.context.junit4.SpringJUnit4ClassRunner.createTest(SpringJUnit4ClassRunner.java:227)
26-Jan-2018 22:49:40         at org.springframework.test.context.junit4.SpringJUnit4ClassRunner$1.runReflectiveCall(SpringJUnit4ClassRunner.java:289)
26-Jan-2018 22:49:40         at org.junit.internal.runners.model.ReflectiveCallable.run(ReflectiveCallable.java:12)
26-Jan-2018 22:49:40         at org.springframework.test.context.junit4.SpringJUnit4ClassRunner.methodBlock(SpringJUnit4ClassRunner.java:291)
26-Jan-2018 22:49:40         at org.springframework.test.context.junit4.SpringJUnit4ClassRunner.runChild(SpringJUnit4ClassRunner.java:246)
26-Jan-2018 22:49:40         at org.springframework.test.context.junit4.SpringJUnit4ClassRunner.runChild(SpringJUnit4ClassRunner.java:97)
26-Jan-2018 22:49:40         at org.junit.runners.ParentRunner$3.run(ParentRunner.java:290)
26-Jan-2018 22:49:40         at org.junit.runners.ParentRunner$1.schedule(ParentRunner.java:71)
26-Jan-2018 22:49:40         at org.junit.runners.ParentRunner.runChildren(ParentRunner.java:288)
26-Jan-2018 22:49:40         at org.junit.runners.ParentRunner.access$000(ParentRunner.java:58)
26-Jan-2018 22:49:40         at org.junit.runners.ParentRunner$2.evaluate(ParentRunner.java:268)
26-Jan-2018 22:49:40         at org.springframework.test.context.junit4.statements.RunBeforeTestClassCallbacks.evaluate(RunBeforeTestClassCallbacks.java:61)
26-Jan-2018 22:49:40         at org.springframework.test.context.junit4.statements.RunAfterTestClassCallbacks.evaluate(RunAfterTestClassCallbacks.java:70)
26-Jan-2018 22:49:40         at org.junit.runners.ParentRunner.run(ParentRunner.java:363)
26-Jan-2018 22:49:40         at org.springframework.test.context.junit4.SpringJUnit4ClassRunner.run(SpringJUnit4ClassRunner.java:190)
26-Jan-2018 22:49:40         at org.apache.maven.surefire.junit4.JUnit4Provider.execute(JUnit4Provider.java:252)
26-Jan-2018 22:49:40         at org.apache.maven.surefire.junit4.JUnit4Provider.executeTestSet(JUnit4Provider.java:141)
26-Jan-2018 22:49:40         at org.apache.maven.surefire.junit4.JUnit4Provider.invoke(JUnit4Provider.java:112)
26-Jan-2018 22:49:40         at sun.reflect.NativeMethodAccessorImpl.invoke0(Native Method)
26-Jan-2018 22:49:40         at sun.reflect.NativeMethodAccessorImpl.invoke(NativeMethodAccessorImpl.java:62)
26-Jan-2018 22:49:40         at sun.reflect.DelegatingMethodAccessorImpl.invoke(DelegatingMethodAccessorImpl.java:43)
26-Jan-2018 22:49:40         at java.lang.reflect.Method.invoke(Method.java:498)
26-Jan-2018 22:49:40         at org.apache.maven.surefire.util.ReflectionUtils.invokeMethodWithArray(ReflectionUtils.java:189)
26-Jan-2018 22:49:40         at org.apache.maven.surefire.booter.ProviderFactory$ProviderProxy.invoke(ProviderFactory.java:165)
26-Jan-2018 22:49:40         at org.apache.maven.surefire.booter.ProviderFactory.invokeProvider(ProviderFactory.java:85)
26-Jan-2018 22:49:40         at org.apache.maven.surefire.booter.ForkedBooter.runSuitesInProcess(ForkedBooter.java:115)
26-Jan-2018 22:49:40         at org.apache.maven.surefire.booter.ForkedBooter.main(ForkedBooter.java:75)
26-Jan-2018 22:49:40 Caused by: org.springframework.beans.factory.BeanCreationException: Error creating bean with name 'org.springframework.boot.actuate.autoconfigure.metrics.amqp.RabbitMetricsConfiguration': Injection of autowired dependencies failed; nested exception is java.lang.NoSuchMethodError: io.micrometer.core.instrument.Tags.zip([Ljava/lang/String;)Lio/micrometer/core/instrument/Tags;
26-Jan-2018 22:49:40         at org.springframework.beans.factory.annotation.AutowiredAnnotationBeanPostProcessor.postProcessPropertyValues(AutowiredAnnotationBeanPostProcessor.java:379)
26-Jan-2018 22:49:40         at org.springframework.beans.factory.support.AbstractAutowireCapableBeanFactory.populateBean(AbstractAutowireCapableBeanFactory.java:1344)
26-Jan-2018 22:49:40         at org.springframework.beans.factory.support.AbstractAutowireCapableBeanFactory.doCreateBean(AbstractAutowireCapableBeanFactory.java:582)
26-Jan-2018 22:49:40         at org.springframework.beans.factory.support.AbstractAutowireCapableBeanFactory.createBean(AbstractAutowireCapableBeanFactory.java:502)
26-Jan-2018 22:49:40         at org.springframework.beans.factory.support.AbstractBeanFactory.lambda$doGetBean$0(AbstractBeanFactory.java:312)
26-Jan-2018 22:49:40         at org.springframework.beans.factory.support.DefaultSingletonBeanRegistry.getSingleton(DefaultSingletonBeanRegistry.java:228)
26-Jan-2018 22:49:40         at org.springframework.beans.factory.support.AbstractBeanFactory.doGetBean(AbstractBeanFactory.java:310)
26-Jan-2018 22:49:40         at org.springframework.beans.factory.support.AbstractBeanFactory.getBean(AbstractBeanFactory.java:200)
26-Jan-2018 22:49:40         at org.springframework.beans.factory.support.DefaultListableBeanFactory.preInstantiateSingletons(DefaultListableBeanFactory.java:761)
26-Jan-2018 22:49:40         at org.springframework.context.support.AbstractApplicationContext.finishBeanFactoryInitialization(AbstractApplicationContext.java:868)
26-Jan-2018 22:49:40         at org.springframework.context.support.AbstractApplicationContext.refresh(AbstractApplicationContext.java:549)
26-Jan-2018 22:49:40         at org.springframework.boot.SpringApplication.refresh(SpringApplication.java:752)
26-Jan-2018 22:49:40         at org.springframework.boot.SpringApplication.refreshContext(SpringApplication.java:388)
26-Jan-2018 22:49:40         at org.springframework.boot.SpringApplication.run(SpringApplication.java:327)
26-Jan-2018 22:49:40         at org.springframework.boot.test.context.SpringBootContextLoader.loadContext(SpringBootContextLoader.java:138)
26-Jan-2018 22:49:40         at org.springframework.test.context.cache.DefaultCacheAwareContextLoaderDelegate.loadContextInternal(DefaultCacheAwareContextLoaderDelegate.java:99)
26-Jan-2018 22:49:40         at org.springframework.test.context.cache.DefaultCacheAwareContextLoaderDelegate.loadContext(DefaultCacheAwareContextLoaderDelegate.java:117)
26-Jan-2018 22:49:40         ... 31 more
26-Jan-2018 22:49:40 Caused by: java.lang.NoSuchMethodError: io.micrometer.core.instrument.Tags.zip([Ljava/lang/String;)Lio/micrometer/core/instrument/Tags;
26-Jan-2018 22:49:40         at org.springframework.boot.actuate.autoconfigure.metrics.amqp.RabbitMetricsConfiguration.bindConnectionFactoryToRegistry(RabbitMetricsConfiguration.java:69)
26-Jan-2018 22:49:40         at java.util.LinkedHashMap.forEach(LinkedHashMap.java:684)
26-Jan-2018 22:49:40         at org.springframework.boot.actuate.autoconfigure.metrics.amqp.RabbitMetricsConfiguration.bindConnectionFactoriesToRegistry(RabbitMetricsConfiguration.java:64)
26-Jan-2018 22:49:40         at sun.reflect.NativeMethodAccessorImpl.invoke0(Native Method)
26-Jan-2018 22:49:40         at sun.reflect.NativeMethodAccessorImpl.invoke(NativeMethodAccessorImpl.java:62)
26-Jan-2018 22:49:40         at sun.reflect.DelegatingMethodAccessorImpl.invoke(DelegatingMethodAccessorImpl.java:43)
26-Jan-2018 22:49:40         at java.lang.reflect.Method.invoke(Method.java:498)
26-Jan-2018 22:49:40         at org.springframework.beans.factory.annotation.AutowiredAnnotationBeanPostProcessor$AutowiredMethodElement.inject(AutowiredAnnotationBeanPostProcessor.java:703)
26-Jan-2018 22:49:40         at org.springframework.beans.factory.annotation.InjectionMetadata.inject(InjectionMetadata.java:91)
26-Jan-2018 22:49:40         at org.springframework.beans.factory.annotation.AutowiredAnnotationBeanPostProcessor.postProcessPropertyValues(AutowiredAnnotationBeanPostProcessor.java:373)
26-Jan-2018 22:49:40         ... 47 more
26-Jan-2018 22:49:40
26-Jan-2018 22:49:40 testSuccessWithParams(org.springframework.cloud.task.launcher.TaskLauncherSinkTests)  Time elapsed: 0 sec  <<< ERROR!
26-Jan-2018 22:49:40 java.lang.IllegalStateException: Failed to load ApplicationContext
26-Jan-2018 22:49:40         at org.springframework.test.context.cache.DefaultCacheAwareContextLoaderDelegate.loadContext(DefaultCacheAwareContextLoaderDelegate.java:125)
26-Jan-2018 22:49:40         at org.springframework.test.context.support.DefaultTestContext.getApplicationContext(DefaultTestContext.java:107)
26-Jan-2018 22:49:40         at org.springframework.test.context.web.ServletTestExecutionListener.setUpRequestContextIfNecessary(ServletTestExecutionListener.java:190)
26-Jan-2018 22:49:40         at org.springframework.test.context.web.ServletTestExecutionListener.prepareTestInstance(ServletTestExecutionListener.java:132)
26-Jan-2018 22:49:40         at org.springframework.test.context.TestContextManager.prepareTestInstance(TestContextManager.java:242)
26-Jan-2018 22:49:40         at org.springframework.test.context.junit4.SpringJUnit4ClassRunner.createTest(SpringJUnit4ClassRunner.java:227)
26-Jan-2018 22:49:40         at org.springframework.test.context.junit4.SpringJUnit4ClassRunner$1.runReflectiveCall(SpringJUnit4ClassRunner.java:289)
26-Jan-2018 22:49:40         at org.junit.internal.runners.model.ReflectiveCallable.run(ReflectiveCallable.java:12)
26-Jan-2018 22:49:40         at org.springframework.test.context.junit4.SpringJUnit4ClassRunner.methodBlock(SpringJUnit4ClassRunner.java:291)
26-Jan-2018 22:49:40         at org.springframework.test.context.junit4.SpringJUnit4ClassRunner.runChild(SpringJUnit4ClassRunner.java:246)
26-Jan-2018 22:49:40         at org.springframework.test.context.junit4.SpringJUnit4ClassRunner.runChild(SpringJUnit4ClassRunner.java:97)
26-Jan-2018 22:49:40         at org.junit.runners.ParentRunner$3.run(ParentRunner.java:290)
26-Jan-2018 22:49:40         at org.junit.runners.ParentRunner$1.schedule(ParentRunner.java:71)
26-Jan-2018 22:49:40         at org.junit.runners.ParentRunner.runChildren(ParentRunner.java:288)
26-Jan-2018 22:49:40         at org.junit.runners.ParentRunner.access$000(ParentRunner.java:58)
26-Jan-2018 22:49:40         at org.junit.runners.ParentRunner$2.evaluate(ParentRunner.java:268)
26-Jan-2018 22:49:40         at org.springframework.test.context.junit4.statements.RunBeforeTestClassCallbacks.evaluate(RunBeforeTestClassCallbacks.java:61)
26-Jan-2018 22:49:40         at org.springframework.test.context.junit4.statements.RunAfterTestClassCallbacks.evaluate(RunAfterTestClassCallbacks.java:70)
26-Jan-2018 22:49:40         at org.junit.runners.ParentRunner.run(ParentRunner.java:363)
26-Jan-2018 22:49:40         at org.springframework.test.context.junit4.SpringJUnit4ClassRunner.run(SpringJUnit4ClassRunner.java:190)
26-Jan-2018 22:49:40         at org.apache.maven.surefire.junit4.JUnit4Provider.execute(JUnit4Provider.java:252)
26-Jan-2018 22:49:40         at org.apache.maven.surefire.junit4.JUnit4Provider.executeTestSet(JUnit4Provider.java:141)
26-Jan-2018 22:49:40         at org.apache.maven.surefire.junit4.JUnit4Provider.invoke(JUnit4Provider.java:112)
26-Jan-2018 22:49:40         at sun.reflect.NativeMethodAccessorImpl.invoke0(Native Method)
26-Jan-2018 22:49:40         at sun.reflect.NativeMethodAccessorImpl.invoke(NativeMethodAccessorImpl.java:62)
26-Jan-2018 22:49:40         at sun.reflect.DelegatingMethodAccessorImpl.invoke(DelegatingMethodAccessorImpl.java:43)
26-Jan-2018 22:49:40         at java.lang.reflect.Method.invoke(Method.java:498)
26-Jan-2018 22:49:40         at org.apache.maven.surefire.util.ReflectionUtils.invokeMethodWithArray(ReflectionUtils.java:189)
26-Jan-2018 22:49:40         at org.apache.maven.surefire.booter.ProviderFactory$ProviderProxy.invoke(ProviderFactory.java:165)
26-Jan-2018 22:49:40         at org.apache.maven.surefire.booter.ProviderFactory.invokeProvider(ProviderFactory.java:85)
26-Jan-2018 22:49:40         at org.apache.maven.surefire.booter.ForkedBooter.runSuitesInProcess(ForkedBooter.java:115)
26-Jan-2018 22:49:40         at org.apache.maven.surefire.booter.ForkedBooter.main(ForkedBooter.java:75)
26-Jan-2018 22:49:40 Caused by: org.springframework.beans.factory.BeanCreationException: Error creating bean with name 'org.springframework.boot.actuate.autoconfigure.metrics.amqp.RabbitMetricsConfiguration': Injection of autowired dependencies failed; nested exception is java.lang.NoSuchMethodError: io.micrometer.core.instrument.Tags.zip([Ljava/lang/String;)Lio/micrometer/core/instrument/Tags;
26-Jan-2018 22:49:40         at org.springframework.beans.factory.annotation.AutowiredAnnotationBeanPostProcessor.postProcessPropertyValues(AutowiredAnnotationBeanPostProcessor.java:379)
26-Jan-2018 22:49:40         at org.springframework.beans.factory.support.AbstractAutowireCapableBeanFactory.populateBean(AbstractAutowireCapableBeanFactory.java:1344)
26-Jan-2018 22:49:40         at org.springframework.beans.factory.support.AbstractAutowireCapableBeanFactory.doCreateBean(AbstractAutowireCapableBeanFactory.java:582)
26-Jan-2018 22:49:40         at org.springframework.beans.factory.support.AbstractAutowireCapableBeanFactory.createBean(AbstractAutowireCapableBeanFactory.java:502)
26-Jan-2018 22:49:40         at org.springframework.beans.factory.support.AbstractBeanFactory.lambda$doGetBean$0(AbstractBeanFactory.java:312)
26-Jan-2018 22:49:40         at org.springframework.beans.factory.support.DefaultSingletonBeanRegistry.getSingleton(DefaultSingletonBeanRegistry.java:228)
26-Jan-2018 22:49:40         at org.springframework.beans.factory.support.AbstractBeanFactory.doGetBean(AbstractBeanFactory.java:310)
26-Jan-2018 22:49:40         at org.springframework.beans.factory.support.AbstractBeanFactory.getBean(AbstractBeanFactory.java:200)
26-Jan-2018 22:49:40         at org.springframework.beans.factory.support.DefaultListableBeanFactory.preInstantiateSingletons(DefaultListableBeanFactory.java:761)
26-Jan-2018 22:49:40         at org.springframework.context.support.AbstractApplicationContext.finishBeanFactoryInitialization(AbstractApplicationContext.java:868)
26-Jan-2018 22:49:40         at org.springframework.context.support.AbstractApplicationContext.refresh(AbstractApplicationContext.java:549)
26-Jan-2018 22:49:40         at org.springframework.boot.SpringApplication.refresh(SpringApplication.java:752)
26-Jan-2018 22:49:40         at org.springframework.boot.SpringApplication.refreshContext(SpringApplication.java:388)
26-Jan-2018 22:49:40         at org.springframework.boot.SpringApplication.run(SpringApplication.java:327)
26-Jan-2018 22:49:40         at org.springframework.boot.test.context.SpringBootContextLoader.loadContext(SpringBootContextLoader.java:138)
26-Jan-2018 22:49:40         at org.springframework.test.context.cache.DefaultCacheAwareContextLoaderDelegate.loadContextInternal(DefaultCacheAwareContextLoaderDelegate.java:99)
26-Jan-2018 22:49:40         at org.springframework.test.context.cache.DefaultCacheAwareContextLoaderDelegate.loadContext(DefaultCacheAwareContextLoaderDelegate.java:117)
26-Jan-2018 22:49:40         ... 31 more
26-Jan-2018 22:49:40 Caused by: java.lang.NoSuchMethodError: io.micrometer.core.instrument.Tags.zip([Ljava/lang/String;)Lio/micrometer/core/instrument/Tags;
26-Jan-2018 22:49:40         at org.springframework.boot.actuate.autoconfigure.metrics.amqp.RabbitMetricsConfiguration.bindConnectionFactoryToRegistry(RabbitMetricsConfiguration.java:69)
26-Jan-2018 22:49:40         at java.util.LinkedHashMap.forEach(LinkedHashMap.java:684)
26-Jan-2018 22:49:40         at org.springframework.boot.actuate.autoconfigure.metrics.amqp.RabbitMetricsConfiguration.bindConnectionFactoriesToRegistry(RabbitMetricsConfiguration.java:64)
26-Jan-2018 22:49:40         at sun.reflect.NativeMethodAccessorImpl.invoke0(Native Method)
26-Jan-2018 22:49:40         at sun.reflect.NativeMethodAccessorImpl.invoke(NativeMethodAccessorImpl.java:62)
26-Jan-2018 22:49:40         at sun.reflect.DelegatingMethodAccessorImpl.invoke(DelegatingMethodAccessorImpl.java:43)
26-Jan-2018 22:49:40         at java.lang.reflect.Method.invoke(Method.java:498)
26-Jan-2018 22:49:40         at org.springframework.beans.factory.annotation.AutowiredAnnotationBeanPostProcessor$AutowiredMethodElement.inject(AutowiredAnnotationBeanPostProcessor.java:703)
26-Jan-2018 22:49:40         at org.springframework.beans.factory.annotation.InjectionMetadata.inject(InjectionMetadata.java:91)
26-Jan-2018 22:49:40         at org.springframework.beans.factory.annotation.AutowiredAnnotationBeanPostProcessor.postProcessPropertyValues(AutowiredAnnotationBeanPostProcessor.java:373)
26-Jan-2018 22:49:40         ... 47 more
26-Jan-2018 22:49:40
26-Jan-2018 22:49:40 testInvalidJar(org.springframework.cloud.task.launcher.TaskLauncherSinkTests)  Time elapsed: 0.001 sec  <<< ERROR!
26-Jan-2018 22:49:40 java.lang.IllegalStateException: Failed to load ApplicationContext
26-Jan-2018 22:49:40         at org.springframework.test.context.cache.DefaultCacheAwareContextLoaderDelegate.loadContext(DefaultCacheAwareContextLoaderDelegate.java:125)
26-Jan-2018 22:49:40         at org.springframework.test.context.support.DefaultTestContext.getApplicationContext(DefaultTestContext.java:107)
26-Jan-2018 22:49:40         at org.springframework.test.context.web.ServletTestExecutionListener.setUpRequestContextIfNecessary(ServletTestExecutionListener.java:190)
26-Jan-2018 22:49:40         at org.springframework.test.context.web.ServletTestExecutionListener.prepareTestInstance(ServletTestExecutionListener.java:132)
26-Jan-2018 22:49:40         at org.springframework.test.context.TestContextManager.prepareTestInstance(TestContextManager.java:242)
26-Jan-2018 22:49:40         at org.springframework.test.context.junit4.SpringJUnit4ClassRunner.createTest(SpringJUnit4ClassRunner.java:227)
26-Jan-2018 22:49:40         at org.springframework.test.context.junit4.SpringJUnit4ClassRunner$1.runReflectiveCall(SpringJUnit4ClassRunner.java:289)
26-Jan-2018 22:49:40         at org.junit.internal.runners.model.ReflectiveCallable.run(ReflectiveCallable.java:12)
26-Jan-2018 22:49:40         at org.springframework.test.context.junit4.SpringJUnit4ClassRunner.methodBlock(SpringJUnit4ClassRunner.java:291)
26-Jan-2018 22:49:40         at org.springframework.test.context.junit4.SpringJUnit4ClassRunner.runChild(SpringJUnit4ClassRunner.java:246)
26-Jan-2018 22:49:40         at org.springframework.test.context.junit4.SpringJUnit4ClassRunner.runChild(SpringJUnit4ClassRunner.java:97)
26-Jan-2018 22:49:40         at org.junit.runners.ParentRunner$3.run(ParentRunner.java:290)
26-Jan-2018 22:49:40         at org.junit.runners.ParentRunner$1.schedule(ParentRunner.java:71)
26-Jan-2018 22:49:40         at org.junit.runners.ParentRunner.runChildren(ParentRunner.java:288)
26-Jan-2018 22:49:40         at org.junit.runners.ParentRunner.access$000(ParentRunner.java:58)
26-Jan-2018 22:49:40         at org.junit.runners.ParentRunner$2.evaluate(ParentRunner.java:268)
26-Jan-2018 22:49:40         at org.springframework.test.context.junit4.statements.RunBeforeTestClassCallbacks.evaluate(RunBeforeTestClassCallbacks.java:61)
26-Jan-2018 22:49:40         at org.springframework.test.context.junit4.statements.RunAfterTestClassCallbacks.evaluate(RunAfterTestClassCallbacks.java:70)
26-Jan-2018 22:49:40         at org.junit.runners.ParentRunner.run(ParentRunner.java:363)
26-Jan-2018 22:49:40         at org.springframework.test.context.junit4.SpringJUnit4ClassRunner.run(SpringJUnit4ClassRunner.java:190)
26-Jan-2018 22:49:40         at org.apache.maven.surefire.junit4.JUnit4Provider.execute(JUnit4Provider.java:252)
26-Jan-2018 22:49:40         at org.apache.maven.surefire.junit4.JUnit4Provider.executeTestSet(JUnit4Provider.java:141)
26-Jan-2018 22:49:40         at org.apache.maven.surefire.junit4.JUnit4Provider.invoke(JUnit4Provider.java:112)
26-Jan-2018 22:49:40         at sun.reflect.NativeMethodAccessorImpl.invoke0(Native Method)
26-Jan-2018 22:49:40         at sun.reflect.NativeMethodAccessorImpl.invoke(NativeMethodAccessorImpl.java:62)
26-Jan-2018 22:49:40         at sun.reflect.DelegatingMethodAccessorImpl.invoke(DelegatingMethodAccessorImpl.java:43)
26-Jan-2018 22:49:40         at java.lang.reflect.Method.invoke(Method.java:498)
26-Jan-2018 22:49:40         at org.apache.maven.surefire.util.ReflectionUtils.invokeMethodWithArray(ReflectionUtils.java:189)
26-Jan-2018 22:49:40         at org.apache.maven.surefire.booter.ProviderFactory$ProviderProxy.invoke(ProviderFactory.java:165)
26-Jan-2018 22:49:40         at org.apache.maven.surefire.booter.ProviderFactory.invokeProvider(ProviderFactory.java:85)
26-Jan-2018 22:49:40         at org.apache.maven.surefire.booter.ForkedBooter.runSuitesInProcess(ForkedBooter.java:115)
26-Jan-2018 22:49:40         at org.apache.maven.surefire.booter.ForkedBooter.main(ForkedBooter.java:75)
26-Jan-2018 22:49:40 Caused by: org.springframework.beans.factory.BeanCreationException: Error creating bean with name 'org.springframework.boot.actuate.autoconfigure.metrics.amqp.RabbitMetricsConfiguration': Injection of autowired dependencies failed; nested exception is java.lang.NoSuchMethodError: io.micrometer.core.instrument.Tags.zip([Ljava/lang/String;)Lio/micrometer/core/instrument/Tags;
26-Jan-2018 22:49:40         at org.springframework.beans.factory.annotation.AutowiredAnnotationBeanPostProcessor.postProcessPropertyValues(AutowiredAnnotationBeanPostProcessor.java:379)
26-Jan-2018 22:49:40         at org.springframework.beans.factory.support.AbstractAutowireCapableBeanFactory.populateBean(AbstractAutowireCapableBeanFactory.java:1344)
26-Jan-2018 22:49:40         at org.springframework.beans.factory.support.AbstractAutowireCapableBeanFactory.doCreateBean(AbstractAutowireCapableBeanFactory.java:582)
26-Jan-2018 22:49:40         at org.springframework.beans.factory.support.AbstractAutowireCapableBeanFactory.createBean(AbstractAutowireCapableBeanFactory.java:502)
26-Jan-2018 22:49:40         at org.springframework.beans.factory.support.AbstractBeanFactory.lambda$doGetBean$0(AbstractBeanFactory.java:312)
26-Jan-2018 22:49:40         at org.springframework.beans.factory.support.DefaultSingletonBeanRegistry.getSingleton(DefaultSingletonBeanRegistry.java:228)
26-Jan-2018 22:49:40         at org.springframework.beans.factory.support.AbstractBeanFactory.doGetBean(AbstractBeanFactory.java:310)
26-Jan-2018 22:49:40         at org.springframework.beans.factory.support.AbstractBeanFactory.getBean(AbstractBeanFactory.java:200)
26-Jan-2018 22:49:40         at org.springframework.beans.factory.support.DefaultListableBeanFactory.preInstantiateSingletons(DefaultListableBeanFactory.java:761)
26-Jan-2018 22:49:40         at org.springframework.context.support.AbstractApplicationContext.finishBeanFactoryInitialization(AbstractApplicationContext.java:868)
26-Jan-2018 22:49:40         at org.springframework.context.support.AbstractApplicationContext.refresh(AbstractApplicationContext.java:549)
26-Jan-2018 22:49:40         at org.springframework.boot.SpringApplication.refresh(SpringApplication.java:752)
26-Jan-2018 22:49:40         at org.springframework.boot.SpringApplication.refreshContext(SpringApplication.java:388)
26-Jan-2018 22:49:40         at org.springframework.boot.SpringApplication.run(SpringApplication.java:327)
26-Jan-2018 22:49:40         at org.springframework.boot.test.context.SpringBootContextLoader.loadContext(SpringBootContextLoader.java:138)
26-Jan-2018 22:49:40         at org.springframework.test.context.cache.DefaultCacheAwareContextLoaderDelegate.loadContextInternal(DefaultCacheAwareContextLoaderDelegate.java:99)
26-Jan-2018 22:49:40         at org.springframework.test.context.cache.DefaultCacheAwareContextLoaderDelegate.loadContext(DefaultCacheAwareContextLoaderDelegate.java:117)
26-Jan-2018 22:49:40         ... 31 more
26-Jan-2018 22:49:40 Caused by: java.lang.NoSuchMethodError: io.micrometer.core.instrument.Tags.zip([Ljava/lang/String;)Lio/micrometer/core/instrument/Tags;
26-Jan-2018 22:49:40         at org.springframework.boot.actuate.autoconfigure.metrics.amqp.RabbitMetricsConfiguration.bindConnectionFactoryToRegistry(RabbitMetricsConfiguration.java:69)
26-Jan-2018 22:49:40         at java.util.LinkedHashMap.forEach(LinkedHashMap.java:684)
26-Jan-2018 22:49:40         at org.springframework.boot.actuate.autoconfigure.metrics.amqp.RabbitMetricsConfiguration.bindConnectionFactoriesToRegistry(RabbitMetricsConfiguration.java:64)
26-Jan-2018 22:49:40         at sun.reflect.NativeMethodAccessorImpl.invoke0(Native Method)
26-Jan-2018 22:49:40         at sun.reflect.NativeMethodAccessorImpl.invoke(NativeMethodAccessorImpl.java:62)
26-Jan-2018 22:49:40         at sun.reflect.DelegatingMethodAccessorImpl.invoke(DelegatingMethodAccessorImpl.java:43)
26-Jan-2018 22:49:40         at java.lang.reflect.Method.invoke(Method.java:498)
26-Jan-2018 22:49:40         at org.springframework.beans.factory.annotation.AutowiredAnnotationBeanPostProcessor$AutowiredMethodElement.inject(AutowiredAnnotationBeanPostProcessor.java:703)
26-Jan-2018 22:49:40         at org.springframework.beans.factory.annotation.InjectionMetadata.inject(InjectionMetadata.java:91)
26-Jan-2018 22:49:40         at org.springframework.beans.factory.annotation.AutowiredAnnotationBeanPostProcessor.postProcessPropertyValues(AutowiredAnnotationBeanPostProcessor.java:373)
26-Jan-2018 22:49:40         ... 47 more
26-Jan-2018 22:49:40
26-Jan-2018 22:49:40 2018-01-26 22:49:40.853  INFO 21964 --- [      Thread-14] s.c.a.AnnotationConfigApplicationContext : Closing org.springframework.context.annotation.AnnotationConfigApplicationContext@159b1d5d: startup date [Fri Jan 26 22:49:29 UTC 2018]; root of context hierarchy
26-Jan-2018 22:49:40 2018-01-26 22:49:40.868  INFO 21964 --- [       Thread-9] s.c.a.AnnotationConfigApplicationContext : Closing org.springframework.context.annotation.AnnotationConfigApplicationContext@22cb2c7b: startup date [Fri Jan 26 22:49:27 UTC 2018]; root of context hierarchy
26-Jan-2018 22:49:40 2018-01-26 22:49:40.874  INFO 21964 --- [      Thread-12] s.c.a.AnnotationConfigApplicationContext : Closing org.springframework.context.annotation.AnnotationConfigApplicationContext@6cbf0694: startup date [Fri Jan 26 22:49:28 UTC 2018]; root of context hierarchy
26-Jan-2018 22:49:40 2018-01-26 22:49:40.874  INFO 21964 --- [      Thread-10] s.c.a.AnnotationConfigApplicationContext : Closing org.springframework.context.annotation.AnnotationConfigApplicationContext@67787f7b: startup date [Fri Jan 26 22:49:27 UTC 2018]; root of context hierarchy
26-Jan-2018 22:49:40 2018-01-26 22:49:40.857  INFO 21964 --- [       Thread-8] s.c.a.AnnotationConfigApplicationContext : Closing org.springframework.context.annotation.AnnotationConfigApplicationContext@7858b022: startup date [Fri Jan 26 22:49:26 UTC 2018]; root of context hierarchy
26-Jan-2018 22:49:40 2018-01-26 22:49:40.856  INFO 21964 --- [       Thread-2] s.c.a.AnnotationConfigApplicationContext : Closing org.springframework.context.annotation.AnnotationConfigApplicationContext@1f4f0fcc: startup date [Fri Jan 26 22:49:16 UTC 2018]; root of context hierarchy
26-Jan-2018 22:49:40 2018-01-26 22:49:40.875  INFO 21964 --- [      Thread-11] s.c.a.AnnotationConfigApplicationContext : Closing org.springframework.context.annotation.AnnotationConfigApplicationContext@225239d7: startup date [Fri Jan 26 22:49:28 UTC 2018]; root of context hierarchy
26-Jan-2018 22:49:40 2018-01-26 22:49:40.855  INFO 21964 --- [      Thread-13] s.c.a.AnnotationConfigApplicationContext : Closing org.springframework.context.annotation.AnnotationConfigApplicationContext@2f729f8f: startup date [Fri Jan 26 22:49:29 UTC 2018]; root of context hierarchy
26-Jan-2018 22:49:40 2018-01-26 22:49:40.854  INFO 21964 --- [      Thread-15] o.s.w.c.s.GenericWebApplicationContext   : Closing org.springframework.web.context.support.GenericWebApplicationContext@24e57f1e: startup date [Fri Jan 26 22:49:30 UTC 2018]; root of context hierarchy
26-Jan-2018 22:49:40 2018-01-26 22:49:40.877  INFO 21964 --- [      Thread-14] o.s.c.support.DefaultLifecycleProcessor  : Stopping beans in phase 2147482647
26-Jan-2018 22:49:40 2018-01-26 22:49:40.877  INFO 21964 --- [       Thread-2] o.s.c.support.DefaultLifecycleProcessor  : Stopping beans in phase 2147482647
26-Jan-2018 22:49:40 2018-01-26 22:49:40.854  INFO 21964 --- [       Thread-5] s.c.a.AnnotationConfigApplicationContext : Closing org.springframework.context.annotation.AnnotationConfigApplicationContext@1760332e: startup date [Fri Jan 26 22:49:25 UTC 2018]; root of context hierarchy
26-Jan-2018 22:49:40 2018-01-26 22:49:40.878  INFO 21964 --- [      Thread-14] o.s.c.support.DefaultLifecycleProcessor  : Stopping beans in phase 0
26-Jan-2018 22:49:40 2018-01-26 22:49:40.878  INFO 21964 --- [      Thread-14] o.s.i.endpoint.EventDrivenConsumer       : Removing {logging-channel-adapter:_org.springframework.integration.errorLogger} as a subscriber to the 'errorChannel' channel
26-Jan-2018 22:49:40 2018-01-26 22:49:40.854  INFO 21964 --- [       Thread-4] s.c.a.AnnotationConfigApplicationContext : Closing org.springframework.context.annotation.AnnotationConfigApplicationContext@1671a2ca: startup date [Fri Jan 26 22:49:25 UTC 2018]; root of context hierarchy
26-Jan-2018 22:49:40 2018-01-26 22:49:40.880  INFO 21964 --- [       Thread-2] o.s.c.support.DefaultLifecycleProcessor  : Stopping beans in phase 0
26-Jan-2018 22:49:40 2018-01-26 22:49:40.880  INFO 21964 --- [       Thread-2] ProxyFactoryBean$MethodInvocationGateway : stopped taskEventListener
26-Jan-2018 22:49:40 2018-01-26 22:49:40.880  INFO 21964 --- [       Thread-2] ProxyFactoryBean$MethodInvocationGateway : stopped taskEventListener
26-Jan-2018 22:49:40 2018-01-26 22:49:40.880  INFO 21964 --- [       Thread-2] ProxyFactoryBean$MethodInvocationGateway : stopped taskEventListener
26-Jan-2018 22:49:40 2018-01-26 22:49:40.880  INFO 21964 --- [       Thread-9] o.s.c.support.DefaultLifecycleProcessor  : Stopping beans in phase 2147482647
26-Jan-2018 22:49:40 2018-01-26 22:49:40.880  INFO 21964 --- [       Thread-2] o.s.i.gateway.GatewayProxyFactoryBean    : stopped taskEventListener
26-Jan-2018 22:49:40 2018-01-26 22:49:40.880  INFO 21964 --- [       Thread-9] o.s.c.support.DefaultLifecycleProcessor  : Stopping beans in phase 0
26-Jan-2018 22:49:40 2018-01-26 22:49:40.880  INFO 21964 --- [       Thread-2] o.s.i.endpoint.EventDrivenConsumer       : Removing {logging-channel-adapter:_org.springframework.integration.errorLogger} as a subscriber to the 'errorChannel' channel
26-Jan-2018 22:49:40 2018-01-26 22:49:40.880  INFO 21964 --- [       Thread-9] o.s.i.endpoint.EventDrivenConsumer       : Removing {logging-channel-adapter:_org.springframework.integration.errorLogger} as a subscriber to the 'errorChannel' channel
26-Jan-2018 22:49:40 2018-01-26 22:49:40.884  INFO 21964 --- [      Thread-13] o.s.c.support.DefaultLifecycleProcessor  : Stopping beans in phase 2147482647
26-Jan-2018 22:49:40 2018-01-26 22:49:40.884  INFO 21964 --- [      Thread-11] o.s.c.support.DefaultLifecycleProcessor  : Stopping beans in phase 2147482647
26-Jan-2018 22:49:40 2018-01-26 22:49:40.884  INFO 21964 --- [      Thread-13] o.s.c.support.DefaultLifecycleProcessor  : Stopping beans in phase 0
26-Jan-2018 22:49:40 2018-01-26 22:49:40.884  INFO 21964 --- [      Thread-11] o.s.c.support.DefaultLifecycleProcessor  : Stopping beans in phase 0
26-Jan-2018 22:49:40 2018-01-26 22:49:40.884  INFO 21964 --- [      Thread-13] o.s.i.endpoint.EventDrivenConsumer       : Removing {logging-channel-adapter:_org.springframework.integration.errorLogger} as a subscriber to the 'errorChannel' channel
26-Jan-2018 22:49:40 2018-01-26 22:49:40.884  INFO 21964 --- [       Thread-8] o.s.c.support.DefaultLifecycleProcessor  : Stopping beans in phase 2147482647
26-Jan-2018 22:49:40 2018-01-26 22:49:40.884  INFO 21964 --- [       Thread-5] o.s.c.support.DefaultLifecycleProcessor  : Stopping beans in phase 2147482647
26-Jan-2018 22:49:40 2018-01-26 22:49:40.884  INFO 21964 --- [      Thread-12] o.s.c.support.DefaultLifecycleProcessor  : Stopping beans in phase 2147482647
26-Jan-2018 22:49:40 2018-01-26 22:49:40.884  INFO 21964 --- [       Thread-8] o.s.c.support.DefaultLifecycleProcessor  : Stopping beans in phase 0
26-Jan-2018 22:49:40 2018-01-26 22:49:40.885  INFO 21964 --- [      Thread-12] o.s.c.support.DefaultLifecycleProcessor  : Stopping beans in phase 0
26-Jan-2018 22:49:40 2018-01-26 22:49:40.885  INFO 21964 --- [       Thread-8] o.s.i.endpoint.EventDrivenConsumer       : Removing {logging-channel-adapter:_org.springframework.integration.errorLogger} as a subscriber to the 'errorChannel' channel
26-Jan-2018 22:49:40 2018-01-26 22:49:40.885  INFO 21964 --- [       Thread-5] o.s.c.support.DefaultLifecycleProcessor  : Stopping beans in phase 0
26-Jan-2018 22:49:40 2018-01-26 22:49:40.885  INFO 21964 --- [      Thread-12] o.s.i.endpoint.EventDrivenConsumer       : Removing {logging-channel-adapter:_org.springframework.integration.errorLogger} as a subscriber to the 'errorChannel' channel
26-Jan-2018 22:49:40 2018-01-26 22:49:40.885  INFO 21964 --- [       Thread-5] o.s.i.endpoint.EventDrivenConsumer       : Removing {logging-channel-adapter:_org.springframework.integration.errorLogger} as a subscriber to the 'errorChannel' channel
26-Jan-2018 22:49:40 2018-01-26 22:49:40.885  INFO 21964 --- [       Thread-4] o.s.c.support.DefaultLifecycleProcessor  : Stopping beans in phase 2147482647
26-Jan-2018 22:49:40 2018-01-26 22:49:40.885  INFO 21964 --- [       Thread-4] o.s.c.support.DefaultLifecycleProcessor  : Stopping beans in phase 0
26-Jan-2018 22:49:40 2018-01-26 22:49:40.885  INFO 21964 --- [       Thread-4] o.s.i.endpoint.EventDrivenConsumer       : Removing {logging-channel-adapter:_org.springframework.integration.errorLogger} as a subscriber to the 'errorChannel' channel
26-Jan-2018 22:49:40 2018-01-26 22:49:40.885  INFO 21964 --- [      Thread-14] o.s.i.channel.PublishSubscribeChannel    : Channel 'application.errorChannel' has 0 subscriber(s).
26-Jan-2018 22:49:40 2018-01-26 22:49:40.886  INFO 21964 --- [       Thread-2] o.s.i.channel.PublishSubscribeChannel    : Channel 'application.errorChannel' has 0 subscriber(s).
26-Jan-2018 22:49:40 2018-01-26 22:49:40.886  INFO 21964 --- [       Thread-9] o.s.i.channel.PublishSubscribeChannel    : Channel 'application.errorChannel' has 0 subscriber(s).
26-Jan-2018 22:49:40 2018-01-26 22:49:40.886  INFO 21964 --- [       Thread-2] o.s.i.endpoint.EventDrivenConsumer       : stopped _org.springframework.integration.errorLogger
26-Jan-2018 22:49:40 2018-01-26 22:49:40.886  INFO 21964 --- [       Thread-9] o.s.i.endpoint.EventDrivenConsumer       : stopped _org.springframework.integration.errorLogger
26-Jan-2018 22:49:40 2018-01-26 22:49:40.886  INFO 21964 --- [      Thread-13] o.s.i.channel.PublishSubscribeChannel    : Channel 'application.errorChannel' has 0 subscriber(s).
26-Jan-2018 22:49:40 2018-01-26 22:49:40.886  INFO 21964 --- [       Thread-9] o.s.c.support.DefaultLifecycleProcessor  : Stopping beans in phase -2147482648
26-Jan-2018 22:49:40 2018-01-26 22:49:40.886  INFO 21964 --- [      Thread-13] o.s.i.endpoint.EventDrivenConsumer       : stopped _org.springframework.integration.errorLogger
26-Jan-2018 22:49:40 2018-01-26 22:49:40.886  INFO 21964 --- [      Thread-13] o.s.c.support.DefaultLifecycleProcessor  : Stopping beans in phase -2147482648
26-Jan-2018 22:49:40 2018-01-26 22:49:40.886  INFO 21964 --- [       Thread-8] o.s.i.channel.PublishSubscribeChannel    : Channel 'application.errorChannel' has 0 subscriber(s).
26-Jan-2018 22:49:40 2018-01-26 22:49:40.886  INFO 21964 --- [      Thread-12] o.s.i.channel.PublishSubscribeChannel    : Channel 'application.errorChannel' has 0 subscriber(s).
26-Jan-2018 22:49:40 2018-01-26 22:49:40.886  INFO 21964 --- [       Thread-5] o.s.i.channel.PublishSubscribeChannel    : Channel 'application.errorChannel' has 0 subscriber(s).
26-Jan-2018 22:49:40 2018-01-26 22:49:40.886  INFO 21964 --- [      Thread-12] o.s.i.endpoint.EventDrivenConsumer       : stopped _org.springframework.integration.errorLogger
26-Jan-2018 22:49:40 2018-01-26 22:49:40.886  INFO 21964 --- [       Thread-5] o.s.i.endpoint.EventDrivenConsumer       : stopped _org.springframework.integration.errorLogger
26-Jan-2018 22:49:40 2018-01-26 22:49:40.887  INFO 21964 --- [      Thread-12] o.s.c.support.DefaultLifecycleProcessor  : Stopping beans in phase -2147482648
26-Jan-2018 22:49:40 2018-01-26 22:49:40.887  INFO 21964 --- [      Thread-10] o.s.c.support.DefaultLifecycleProcessor  : Stopping beans in phase 2147482647
26-Jan-2018 22:49:40 2018-01-26 22:49:40.887  INFO 21964 --- [      Thread-10] o.s.c.support.DefaultLifecycleProcessor  : Stopping beans in phase 0
26-Jan-2018 22:49:40 2018-01-26 22:49:40.886  INFO 21964 --- [      Thread-11] o.s.i.endpoint.EventDrivenConsumer       : Removing {logging-channel-adapter:_org.springframework.integration.errorLogger} as a subscriber to the 'errorChannel' channel
26-Jan-2018 22:49:40 2018-01-26 22:49:40.886  INFO 21964 --- [      Thread-14] o.s.i.endpoint.EventDrivenConsumer       : stopped _org.springframework.integration.errorLogger
26-Jan-2018 22:49:40 2018-01-26 22:49:40.886  INFO 21964 --- [       Thread-2] o.s.c.support.DefaultLifecycleProcessor  : Stopping beans in phase -2147482648
26-Jan-2018 22:49:40 2018-01-26 22:49:40.887  INFO 21964 --- [      Thread-14] o.s.c.support.DefaultLifecycleProcessor  : Stopping beans in phase -2147482648
26-Jan-2018 22:49:40 2018-01-26 22:49:40.886  INFO 21964 --- [       Thread-8] o.s.i.endpoint.EventDrivenConsumer       : stopped _org.springframework.integration.errorLogger
26-Jan-2018 22:49:40 2018-01-26 22:49:40.887  INFO 21964 --- [       Thread-5] o.s.c.support.DefaultLifecycleProcessor  : Stopping beans in phase -2147482648
26-Jan-2018 22:49:40 2018-01-26 22:49:40.888  INFO 21964 --- [       Thread-8] o.s.c.support.DefaultLifecycleProcessor  : Stopping beans in phase -2147482648
26-Jan-2018 22:49:40 2018-01-26 22:49:40.888  INFO 21964 --- [       Thread-2] o.s.s.c.ThreadPoolTaskScheduler          : Shutting down ExecutorService 'taskScheduler'
26-Jan-2018 22:49:40 2018-01-26 22:49:40.888  INFO 21964 --- [       Thread-2] o.s.j.d.e.EmbeddedDatabaseFactory        : Shutting down embedded database: url='jdbc:h2:mem:testdb;DB_CLOSE_DELAY=-1;DB_CLOSE_ON_EXIT=false'
26-Jan-2018 22:49:40 2018-01-26 22:49:40.889  INFO 21964 --- [       Thread-4] o.s.i.channel.PublishSubscribeChannel    : Channel 'application.errorChannel' has 0 subscriber(s).
26-Jan-2018 22:49:40 2018-01-26 22:49:40.890  INFO 21964 --- [       Thread-9] o.s.s.c.ThreadPoolTaskScheduler          : Shutting down ExecutorService 'taskScheduler'
26-Jan-2018 22:49:40 2018-01-26 22:49:40.890  INFO 21964 --- [      Thread-13] o.s.s.c.ThreadPoolTaskScheduler          : Shutting down ExecutorService 'taskScheduler'
26-Jan-2018 22:49:40 2018-01-26 22:49:40.891  INFO 21964 --- [      Thread-12] o.s.s.c.ThreadPoolTaskScheduler          : Shutting down ExecutorService 'taskScheduler'
26-Jan-2018 22:49:40 2018-01-26 22:49:40.889  INFO 21964 --- [       Thread-4] o.s.i.endpoint.EventDrivenConsumer       : stopped _org.springframework.integration.errorLogger
26-Jan-2018 22:49:40 2018-01-26 22:49:40.891  INFO 21964 --- [      Thread-10] o.s.i.endpoint.EventDrivenConsumer       : Removing {logging-channel-adapter:_org.springframework.integration.errorLogger} as a subscriber to the 'errorChannel' channel
26-Jan-2018 22:49:40 2018-01-26 22:49:40.891  INFO 21964 --- [       Thread-4] o.s.c.support.DefaultLifecycleProcessor  : Stopping beans in phase -2147482648
26-Jan-2018 22:49:40 2018-01-26 22:49:40.892  INFO 21964 --- [      Thread-11] o.s.i.channel.PublishSubscribeChannel    : Channel 'application.errorChannel' has 0 subscriber(s).
26-Jan-2018 22:49:40 2018-01-26 22:49:40.892  INFO 21964 --- [      Thread-11] o.s.i.endpoint.EventDrivenConsumer       : stopped _org.springframework.integration.errorLogger
26-Jan-2018 22:49:40 2018-01-26 22:49:40.892  INFO 21964 --- [      Thread-11] o.s.c.support.DefaultLifecycleProcessor  : Stopping beans in phase -2147482648
26-Jan-2018 22:49:40 2018-01-26 22:49:40.893  INFO 21964 --- [       Thread-8] o.s.s.c.ThreadPoolTaskScheduler          : Shutting down ExecutorService 'taskScheduler'
26-Jan-2018 22:49:40 2018-01-26 22:49:40.893  INFO 21964 --- [       Thread-5] o.s.s.c.ThreadPoolTaskScheduler          : Shutting down ExecutorService 'taskScheduler'
26-Jan-2018 22:49:40 2018-01-26 22:49:40.893  INFO 21964 --- [      Thread-14] o.s.s.c.ThreadPoolTaskScheduler          : Shutting down ExecutorService 'taskScheduler'
26-Jan-2018 22:49:40 2018-01-26 22:49:40.901  INFO 21964 --- [       Thread-4] o.s.s.c.ThreadPoolTaskScheduler          : Shutting down ExecutorService 'taskScheduler'
26-Jan-2018 22:49:40 2018-01-26 22:49:40.902  INFO 21964 --- [      Thread-10] o.s.i.channel.PublishSubscribeChannel    : Channel 'application.errorChannel' has 0 subscriber(s).
26-Jan-2018 22:49:40 2018-01-26 22:49:40.902  INFO 21964 --- [      Thread-10] o.s.i.endpoint.EventDrivenConsumer       : stopped _org.springframework.integration.errorLogger
26-Jan-2018 22:49:40 2018-01-26 22:49:40.902  INFO 21964 --- [      Thread-10] o.s.c.support.DefaultLifecycleProcessor  : Stopping beans in phase -2147482648
26-Jan-2018 22:49:40 2018-01-26 22:49:40.905  INFO 21964 --- [      Thread-10] o.s.s.c.ThreadPoolTaskScheduler          : Shutting down ExecutorService 'taskScheduler'
26-Jan-2018 22:49:40 2018-01-26 22:49:40.901  INFO 21964 --- [      Thread-11] o.s.s.c.ThreadPoolTaskScheduler          : Shutting down ExecutorService 'taskScheduler'
26-Jan-2018 22:49:41
26-Jan-2018 22:49:41 Results :
26-Jan-2018 22:49:41
26-Jan-2018 22:49:41 Tests in error:
26-Jan-2018 22:49:41   testPostProcessor(org.springframework.cloud.task.batch.listener.TaskBatchEventListenerBeanPostProcessorTests): Failed to load ApplicationContext
26-Jan-2018 22:49:41   testNoTaskLauncher(org.springframework.cloud.task.launcher.TaskLauncherSinkTests): Failed to load ApplicationContext
26-Jan-2018 22:49:41   testNoRun(org.springframework.cloud.task.launcher.TaskLauncherSinkTests): Failed to load ApplicationContext
26-Jan-2018 22:49:41   testSuccessWithAppName(org.springframework.cloud.task.launcher.TaskLauncherSinkTests): Failed to load ApplicationContext
26-Jan-2018 22:49:41   testSuccessNoParams(org.springframework.cloud.task.launcher.TaskLauncherSinkTests): Failed to load ApplicationContext
26-Jan-2018 22:49:41   testSuccessWithParams(org.springframework.cloud.task.launcher.TaskLauncherSinkTests): Failed to load ApplicationContext
26-Jan-2018 22:49:41   testInvalidJar(org.springframework.cloud.task.launcher.TaskLauncherSinkTests): Failed to load ApplicationContext
26-Jan-2018 22:49:41
26-Jan-2018 22:49:41 Tests run: 79, Failures: 0, Errors: 7, Skipped: 0
26-Jan-2018 22:49:41
26-Jan-2018 22:49:41 [INFO] ------------------------------------------------------------------------
26-Jan-2018 22:49:41 [INFO] Reactor Summary:
26-Jan-2018 22:49:41 [INFO]
26-Jan-2018 22:49:41 [INFO] Spring Cloud Task Dependencies ..................... SUCCESS [  0.252 s]
26-Jan-2018 22:49:41 [INFO] Spring Cloud Task Build ............................ SUCCESS [  1.494 s]
26-Jan-2018 22:49:41 [INFO] Spring Cloud Task Core ............................. SUCCESS [ 29.930 s]
26-Jan-2018 22:49:41 [INFO] Spring Cloud Task Batch ............................ SUCCESS [ 52.323 s]
26-Jan-2018 22:49:41 [INFO] Spring Cloud Task Stream ........................... FAILURE [ 31.201 s]
26-Jan-2018 22:49:41 [INFO] Spring Cloud Task Starter .......................... SKIPPED
26-Jan-2018 22:49:41 [INFO] Timestamp Task ..................................... SKIPPED
26-Jan-2018 22:49:41 [INFO] Batch Job Sample Application ....................... SKIPPED
26-Jan-2018 22:49:41 [INFO] Task Sink Sample Application ....................... SKIPPED
26-Jan-2018 22:49:41 [INFO] Task Processor Sample Application .................. SKIPPED
26-Jan-2018 22:49:41 [INFO] Partitioned Batch Job .............................. SKIPPED
26-Jan-2018 22:49:41 [INFO] Task Events ........................................ SKIPPED
26-Jan-2018 22:49:41 [INFO] Batch Events Sample Application .................... SKIPPED
26-Jan-2018 22:49:41 [INFO] Spring Cloud Task JPA Sample Application ........... SKIPPED
26-Jan-2018 22:49:41 [INFO] Spring Cloud Task Samples .......................... SKIPPED
26-Jan-2018 22:49:41 [INFO] Spring Cloud Task Integration Tests ................ SKIPPED
26-Jan-2018 22:49:41 [INFO] Spring Cloud Task Docs ............................. SKIPPED
26-Jan-2018 22:49:41 [INFO] ------------------------------------------------------------------------
26-Jan-2018 22:49:41 [INFO] BUILD FAILURE
26-Jan-2018 22:49:41 [INFO] ------------------------------------------------------------------------
26-Jan-2018 22:49:41 [INFO] Total time: 01:59 min
26-Jan-2018 22:49:41 [INFO] Finished at: 2018-01-26T22:49:41Z
26-Jan-2018 22:49:41 [INFO] Final Memory: 94M/524M
26-Jan-2018 22:49:41 [INFO] ------------------------------------------------------------------------
26-Jan-2018 22:49:41 [ERROR] Failed to execute goal org.apache.maven.plugins:maven-surefire-plugin:2.12.4:test (default-test) on project spring-cloud-task-stream: There are test failures.
26-Jan-2018 22:49:41 [ERROR]
26-Jan-2018 22:49:41 [ERROR] Please refer to /opt/bamboo-home/xml-data/build-dir/SCT-STASK-JOB1/spring-cloud-task-stream/target/surefire-reports for the individual test results.
26-Jan-2018 22:49:41 [ERROR] -> [Help 1]
26-Jan-2018 22:49:41 [ERROR]
26-Jan-2018 22:49:41 [ERROR] To see the full stack trace of the errors, re-run Maven with the -e switch.
26-Jan-2018 22:49:41 [ERROR] Re-run Maven using the -X switch to enable full debug logging.
26-Jan-2018 22:49:41 [ERROR]
26-Jan-2018 22:49:41 [ERROR] For more information about the errors and possible solutions, please read the following articles:
26-Jan-2018 22:49:41 [ERROR] [Help 1] http://cwiki.apache.org/confluence/display/MAVEN/MojoFailureException
26-Jan-2018 22:49:41 [ERROR]
26-Jan-2018 22:49:41 [ERROR] After correcting the problems, you can resume the build with the command
26-Jan-2018 22:49:41 [ERROR]   mvn <goals> -rf :spring-cloud-task-stream
26-Jan-2018 22:49:41
26-Jan-2018 22:49:41 Finished task 'Build and publish Spring Cloud Task Modules' with result: Failed
26-Jan-2018 22:49:41 Running post build plugin 'Docker Container Cleanup'
26-Jan-2018 22:49:41 Running post build plugin 'NCover Results Collector'
26-Jan-2018 22:49:41 Running post build plugin 'Artifactory Release Management Staging'
26-Jan-2018 22:49:41 Running post build plugin 'Artifactory Build Info Copier'
26-Jan-2018 22:49:41 Running post build plugin 'Artifactory Gradle Properties Info Copier'
26-Jan-2018 22:49:41 Running post build plugin 'Clover Results Collector'
26-Jan-2018 22:49:41 Running post build plugin 'npm Cache Cleanup'
26-Jan-2018 22:49:41 Running post build plugin 'Artifact Copier'
26-Jan-2018 22:49:41 Publishing an artifact: Test Results
26-Jan-2018 22:49:41 Finished publishing of artifact Shared artifact: [Test Results], pattern: [**/target/surefire-reports/**/*.*] in 162.6 ms
26-Jan-2018 22:49:41 Finalising the build...
26-Jan-2018 22:49:41 Stopping timer.
26-Jan-2018 22:49:41 Build SCT-STASK-JOB1-364 completed.
26-Jan-2018 22:49:41 Running on server: post build plugin 'NCover Results Collector'
26-Jan-2018 22:49:41 Running on server: post build plugin 'Build Hanging Detection Configuration'
26-Jan-2018 22:49:41 Running on server: post build plugin 'Clover Delta Calculator'
26-Jan-2018 22:49:41 Running on server: post build plugin 'Maven Dependencies Postprocessor'
26-Jan-2018 22:49:41 All post build plugins have finished
26-Jan-2018 22:49:41 Generating build results summary...
26-Jan-2018 22:49:42 Saving build results to disk...
26-Jan-2018 22:49:42 Logging substituted variables...
26-Jan-2018 22:49:42 Indexing build results...
26-Jan-2018 22:49:42 Finished building SCT-STASK-JOB1-364.