Build #365

Builds the Spring Cloud Task project

Build: #365 failed

Job: Build Spring Cloud Task Project failed

Stages & jobs

  1. Default Stage

Build log

The build generated 12,988 lines of output.The output is too long and has been truncated to the last 1,000 lines. Download or view full build log

26-Jan-2018 22:59:23         at org.springframework.test.context.junit4.SpringJUnit4ClassRunner.runChild(SpringJUnit4ClassRunner.java:97) [spring-test-5.0.3.RELEASE.jar:5.0.3.RELEASE]
26-Jan-2018 22:59:23         at org.junit.runners.ParentRunner$3.run(ParentRunner.java:290) [junit-4.12.jar:4.12]
26-Jan-2018 22:59:23         at org.junit.runners.ParentRunner$1.schedule(ParentRunner.java:71) [junit-4.12.jar:4.12]
26-Jan-2018 22:59:23         at org.junit.runners.ParentRunner.runChildren(ParentRunner.java:288) [junit-4.12.jar:4.12]
26-Jan-2018 22:59:23         at org.junit.runners.ParentRunner.access$000(ParentRunner.java:58) [junit-4.12.jar:4.12]
26-Jan-2018 22:59:23         at org.junit.runners.ParentRunner$2.evaluate(ParentRunner.java:268) [junit-4.12.jar:4.12]
26-Jan-2018 22:59:23         at org.springframework.test.context.junit4.statements.RunBeforeTestClassCallbacks.evaluate(RunBeforeTestClassCallbacks.java:61) [spring-test-5.0.3.RELEASE.jar:5.0.3.RELEASE]
26-Jan-2018 22:59:23         at org.springframework.test.context.junit4.statements.RunAfterTestClassCallbacks.evaluate(RunAfterTestClassCallbacks.java:70) [spring-test-5.0.3.RELEASE.jar:5.0.3.RELEASE]
26-Jan-2018 22:59:23         at org.junit.runners.ParentRunner.run(ParentRunner.java:363) [junit-4.12.jar:4.12]
26-Jan-2018 22:59:23         at org.springframework.test.context.junit4.SpringJUnit4ClassRunner.run(SpringJUnit4ClassRunner.java:190) [spring-test-5.0.3.RELEASE.jar:5.0.3.RELEASE]
26-Jan-2018 22:59:23         at org.apache.maven.surefire.junit4.JUnit4Provider.execute(JUnit4Provider.java:252) [surefire-junit4-2.12.4.jar:2.12.4]
26-Jan-2018 22:59:23         at org.apache.maven.surefire.junit4.JUnit4Provider.executeTestSet(JUnit4Provider.java:141) [surefire-junit4-2.12.4.jar:2.12.4]
26-Jan-2018 22:59:23         at org.apache.maven.surefire.junit4.JUnit4Provider.invoke(JUnit4Provider.java:112) [surefire-junit4-2.12.4.jar:2.12.4]
26-Jan-2018 22:59:23         at sun.reflect.NativeMethodAccessorImpl.invoke0(Native Method) ~[na:1.8.0_144]
26-Jan-2018 22:59:23         at sun.reflect.NativeMethodAccessorImpl.invoke(NativeMethodAccessorImpl.java:62) ~[na:1.8.0_144]
26-Jan-2018 22:59:23         at sun.reflect.DelegatingMethodAccessorImpl.invoke(DelegatingMethodAccessorImpl.java:43) ~[na:1.8.0_144]
26-Jan-2018 22:59:23         at java.lang.reflect.Method.invoke(Method.java:498) ~[na:1.8.0_144]
26-Jan-2018 22:59:23         at org.apache.maven.surefire.util.ReflectionUtils.invokeMethodWithArray(ReflectionUtils.java:189) [surefire-api-2.12.4.jar:2.12.4]
26-Jan-2018 22:59:23         at org.apache.maven.surefire.booter.ProviderFactory$ProviderProxy.invoke(ProviderFactory.java:165) [surefire-booter-2.12.4.jar:2.12.4]
26-Jan-2018 22:59:23         at org.apache.maven.surefire.booter.ProviderFactory.invokeProvider(ProviderFactory.java:85) [surefire-booter-2.12.4.jar:2.12.4]
26-Jan-2018 22:59:23         at org.apache.maven.surefire.booter.ForkedBooter.runSuitesInProcess(ForkedBooter.java:115) [surefire-booter-2.12.4.jar:2.12.4]
26-Jan-2018 22:59:23         at org.apache.maven.surefire.booter.ForkedBooter.main(ForkedBooter.java:75) [surefire-booter-2.12.4.jar:2.12.4]
26-Jan-2018 22:59:23 Caused by: java.lang.NoSuchMethodError: io.micrometer.core.instrument.Tags.zip([Ljava/lang/String;)Lio/micrometer/core/instrument/Tags;
26-Jan-2018 22:59:23         at org.springframework.boot.actuate.autoconfigure.metrics.amqp.RabbitMetricsConfiguration.bindConnectionFactoryToRegistry(RabbitMetricsConfiguration.java:69) ~[spring-boot-actuator-autoconfigure-2.0.0.BUILD-SNAPSHOT.jar:2.0.0.BUILD-SNAPSHOT]
26-Jan-2018 22:59:23         at java.util.LinkedHashMap.forEach(LinkedHashMap.java:684) ~[na:1.8.0_144]
26-Jan-2018 22:59:23         at org.springframework.boot.actuate.autoconfigure.metrics.amqp.RabbitMetricsConfiguration.bindConnectionFactoriesToRegistry(RabbitMetricsConfiguration.java:64) ~[spring-boot-actuator-autoconfigure-2.0.0.BUILD-SNAPSHOT.jar:2.0.0.BUILD-SNAPSHOT]
26-Jan-2018 22:59:23         at sun.reflect.NativeMethodAccessorImpl.invoke0(Native Method) ~[na:1.8.0_144]
26-Jan-2018 22:59:23         at sun.reflect.NativeMethodAccessorImpl.invoke(NativeMethodAccessorImpl.java:62) ~[na:1.8.0_144]
26-Jan-2018 22:59:23         at sun.reflect.DelegatingMethodAccessorImpl.invoke(DelegatingMethodAccessorImpl.java:43) ~[na:1.8.0_144]
26-Jan-2018 22:59:23         at java.lang.reflect.Method.invoke(Method.java:498) ~[na:1.8.0_144]
26-Jan-2018 22:59:23         at org.springframework.beans.factory.annotation.AutowiredAnnotationBeanPostProcessor$AutowiredMethodElement.inject(AutowiredAnnotationBeanPostProcessor.java:703) ~[spring-beans-5.0.3.RELEASE.jar:5.0.3.RELEASE]
26-Jan-2018 22:59:23         at org.springframework.beans.factory.annotation.InjectionMetadata.inject(InjectionMetadata.java:91) ~[spring-beans-5.0.3.RELEASE.jar:5.0.3.RELEASE]
26-Jan-2018 22:59:23         at org.springframework.beans.factory.annotation.AutowiredAnnotationBeanPostProcessor.postProcessPropertyValues(AutowiredAnnotationBeanPostProcessor.java:373) ~[spring-beans-5.0.3.RELEASE.jar:5.0.3.RELEASE]
26-Jan-2018 22:59:23         ... 47 common frames omitted
26-Jan-2018 22:59:23
26-Jan-2018 22:59:23 2018-01-26 22:59:23.855 ERROR 15800 --- [           main] o.s.test.context.TestContextManager      : Caught exception while allowing TestExecutionListener [org.springframework.test.context.web.ServletTestExecutionListener@38f1aa6f] to prepare test instance [org.springframework.cloud.task.launcher.TaskLauncherSinkTests@596b5915]
26-Jan-2018 22:59:23
26-Jan-2018 22:59:23 java.lang.IllegalStateException: Failed to load ApplicationContext
26-Jan-2018 22:59:23         at org.springframework.test.context.cache.DefaultCacheAwareContextLoaderDelegate.loadContext(DefaultCacheAwareContextLoaderDelegate.java:125) ~[spring-test-5.0.3.RELEASE.jar:5.0.3.RELEASE]
26-Jan-2018 22:59:23         at org.springframework.test.context.support.DefaultTestContext.getApplicationContext(DefaultTestContext.java:107) ~[spring-test-5.0.3.RELEASE.jar:5.0.3.RELEASE]
26-Jan-2018 22:59:23         at org.springframework.test.context.web.ServletTestExecutionListener.setUpRequestContextIfNecessary(ServletTestExecutionListener.java:190) ~[spring-test-5.0.3.RELEASE.jar:5.0.3.RELEASE]
26-Jan-2018 22:59:23         at org.springframework.test.context.web.ServletTestExecutionListener.prepareTestInstance(ServletTestExecutionListener.java:132) ~[spring-test-5.0.3.RELEASE.jar:5.0.3.RELEASE]
26-Jan-2018 22:59:23         at org.springframework.test.context.TestContextManager.prepareTestInstance(TestContextManager.java:242) ~[spring-test-5.0.3.RELEASE.jar:5.0.3.RELEASE]
26-Jan-2018 22:59:23         at org.springframework.test.context.junit4.SpringJUnit4ClassRunner.createTest(SpringJUnit4ClassRunner.java:227) [spring-test-5.0.3.RELEASE.jar:5.0.3.RELEASE]
26-Jan-2018 22:59:23         at org.springframework.test.context.junit4.SpringJUnit4ClassRunner$1.runReflectiveCall(SpringJUnit4ClassRunner.java:289) [spring-test-5.0.3.RELEASE.jar:5.0.3.RELEASE]
26-Jan-2018 22:59:23         at org.junit.internal.runners.model.ReflectiveCallable.run(ReflectiveCallable.java:12) [junit-4.12.jar:4.12]
26-Jan-2018 22:59:23         at org.springframework.test.context.junit4.SpringJUnit4ClassRunner.methodBlock(SpringJUnit4ClassRunner.java:291) [spring-test-5.0.3.RELEASE.jar:5.0.3.RELEASE]
26-Jan-2018 22:59:23         at org.springframework.test.context.junit4.SpringJUnit4ClassRunner.runChild(SpringJUnit4ClassRunner.java:246) [spring-test-5.0.3.RELEASE.jar:5.0.3.RELEASE]
26-Jan-2018 22:59:23         at org.springframework.test.context.junit4.SpringJUnit4ClassRunner.runChild(SpringJUnit4ClassRunner.java:97) [spring-test-5.0.3.RELEASE.jar:5.0.3.RELEASE]
26-Jan-2018 22:59:23         at org.junit.runners.ParentRunner$3.run(ParentRunner.java:290) [junit-4.12.jar:4.12]
26-Jan-2018 22:59:23         at org.junit.runners.ParentRunner$1.schedule(ParentRunner.java:71) [junit-4.12.jar:4.12]
26-Jan-2018 22:59:23         at org.junit.runners.ParentRunner.runChildren(ParentRunner.java:288) [junit-4.12.jar:4.12]
26-Jan-2018 22:59:23         at org.junit.runners.ParentRunner.access$000(ParentRunner.java:58) [junit-4.12.jar:4.12]
26-Jan-2018 22:59:23         at org.junit.runners.ParentRunner$2.evaluate(ParentRunner.java:268) [junit-4.12.jar:4.12]
26-Jan-2018 22:59:23         at org.springframework.test.context.junit4.statements.RunBeforeTestClassCallbacks.evaluate(RunBeforeTestClassCallbacks.java:61) [spring-test-5.0.3.RELEASE.jar:5.0.3.RELEASE]
26-Jan-2018 22:59:23         at org.springframework.test.context.junit4.statements.RunAfterTestClassCallbacks.evaluate(RunAfterTestClassCallbacks.java:70) [spring-test-5.0.3.RELEASE.jar:5.0.3.RELEASE]
26-Jan-2018 22:59:23         at org.junit.runners.ParentRunner.run(ParentRunner.java:363) [junit-4.12.jar:4.12]
26-Jan-2018 22:59:23         at org.springframework.test.context.junit4.SpringJUnit4ClassRunner.run(SpringJUnit4ClassRunner.java:190) [spring-test-5.0.3.RELEASE.jar:5.0.3.RELEASE]
26-Jan-2018 22:59:23         at org.apache.maven.surefire.junit4.JUnit4Provider.execute(JUnit4Provider.java:252) [surefire-junit4-2.12.4.jar:2.12.4]
26-Jan-2018 22:59:23         at org.apache.maven.surefire.junit4.JUnit4Provider.executeTestSet(JUnit4Provider.java:141) [surefire-junit4-2.12.4.jar:2.12.4]
26-Jan-2018 22:59:23         at org.apache.maven.surefire.junit4.JUnit4Provider.invoke(JUnit4Provider.java:112) [surefire-junit4-2.12.4.jar:2.12.4]
26-Jan-2018 22:59:23         at sun.reflect.NativeMethodAccessorImpl.invoke0(Native Method) ~[na:1.8.0_144]
26-Jan-2018 22:59:23         at sun.reflect.NativeMethodAccessorImpl.invoke(NativeMethodAccessorImpl.java:62) ~[na:1.8.0_144]
26-Jan-2018 22:59:23         at sun.reflect.DelegatingMethodAccessorImpl.invoke(DelegatingMethodAccessorImpl.java:43) ~[na:1.8.0_144]
26-Jan-2018 22:59:23         at java.lang.reflect.Method.invoke(Method.java:498) ~[na:1.8.0_144]
26-Jan-2018 22:59:23         at org.apache.maven.surefire.util.ReflectionUtils.invokeMethodWithArray(ReflectionUtils.java:189) [surefire-api-2.12.4.jar:2.12.4]
26-Jan-2018 22:59:23         at org.apache.maven.surefire.booter.ProviderFactory$ProviderProxy.invoke(ProviderFactory.java:165) [surefire-booter-2.12.4.jar:2.12.4]
26-Jan-2018 22:59:23         at org.apache.maven.surefire.booter.ProviderFactory.invokeProvider(ProviderFactory.java:85) [surefire-booter-2.12.4.jar:2.12.4]
26-Jan-2018 22:59:23         at org.apache.maven.surefire.booter.ForkedBooter.runSuitesInProcess(ForkedBooter.java:115) [surefire-booter-2.12.4.jar:2.12.4]
26-Jan-2018 22:59:23         at org.apache.maven.surefire.booter.ForkedBooter.main(ForkedBooter.java:75) [surefire-booter-2.12.4.jar:2.12.4]
26-Jan-2018 22:59:23 Caused by: org.springframework.beans.factory.BeanCreationException: Error creating bean with name 'org.springframework.boot.actuate.autoconfigure.metrics.amqp.RabbitMetricsConfiguration': Injection of autowired dependencies failed; nested exception is java.lang.NoSuchMethodError: io.micrometer.core.instrument.Tags.zip([Ljava/lang/String;)Lio/micrometer/core/instrument/Tags;
26-Jan-2018 22:59:23         at org.springframework.beans.factory.annotation.AutowiredAnnotationBeanPostProcessor.postProcessPropertyValues(AutowiredAnnotationBeanPostProcessor.java:379) ~[spring-beans-5.0.3.RELEASE.jar:5.0.3.RELEASE]
26-Jan-2018 22:59:23         at org.springframework.beans.factory.support.AbstractAutowireCapableBeanFactory.populateBean(AbstractAutowireCapableBeanFactory.java:1344) ~[spring-beans-5.0.3.RELEASE.jar:5.0.3.RELEASE]
26-Jan-2018 22:59:23         at org.springframework.beans.factory.support.AbstractAutowireCapableBeanFactory.doCreateBean(AbstractAutowireCapableBeanFactory.java:582) ~[spring-beans-5.0.3.RELEASE.jar:5.0.3.RELEASE]
26-Jan-2018 22:59:23         at org.springframework.beans.factory.support.AbstractAutowireCapableBeanFactory.createBean(AbstractAutowireCapableBeanFactory.java:502) ~[spring-beans-5.0.3.RELEASE.jar:5.0.3.RELEASE]
26-Jan-2018 22:59:23         at org.springframework.beans.factory.support.AbstractBeanFactory.lambda$doGetBean$0(AbstractBeanFactory.java:312) ~[spring-beans-5.0.3.RELEASE.jar:5.0.3.RELEASE]
26-Jan-2018 22:59:23         at org.springframework.beans.factory.support.DefaultSingletonBeanRegistry.getSingleton(DefaultSingletonBeanRegistry.java:228) ~[spring-beans-5.0.3.RELEASE.jar:5.0.3.RELEASE]
26-Jan-2018 22:59:23         at org.springframework.beans.factory.support.AbstractBeanFactory.doGetBean(AbstractBeanFactory.java:310) ~[spring-beans-5.0.3.RELEASE.jar:5.0.3.RELEASE]
26-Jan-2018 22:59:23         at org.springframework.beans.factory.support.AbstractBeanFactory.getBean(AbstractBeanFactory.java:200) ~[spring-beans-5.0.3.RELEASE.jar:5.0.3.RELEASE]
26-Jan-2018 22:59:23         at org.springframework.beans.factory.support.DefaultListableBeanFactory.preInstantiateSingletons(DefaultListableBeanFactory.java:761) ~[spring-beans-5.0.3.RELEASE.jar:5.0.3.RELEASE]
26-Jan-2018 22:59:23         at org.springframework.context.support.AbstractApplicationContext.finishBeanFactoryInitialization(AbstractApplicationContext.java:868) ~[spring-context-5.0.3.RELEASE.jar:5.0.3.RELEASE]
26-Jan-2018 22:59:23         at org.springframework.context.support.AbstractApplicationContext.refresh(AbstractApplicationContext.java:549) ~[spring-context-5.0.3.RELEASE.jar:5.0.3.RELEASE]
26-Jan-2018 22:59:23         at org.springframework.boot.SpringApplication.refresh(SpringApplication.java:752) ~[spring-boot-2.0.0.BUILD-SNAPSHOT.jar:2.0.0.BUILD-SNAPSHOT]
26-Jan-2018 22:59:23         at org.springframework.boot.SpringApplication.refreshContext(SpringApplication.java:388) ~[spring-boot-2.0.0.BUILD-SNAPSHOT.jar:2.0.0.BUILD-SNAPSHOT]
26-Jan-2018 22:59:23         at org.springframework.boot.SpringApplication.run(SpringApplication.java:327) ~[spring-boot-2.0.0.BUILD-SNAPSHOT.jar:2.0.0.BUILD-SNAPSHOT]
26-Jan-2018 22:59:23         at org.springframework.boot.test.context.SpringBootContextLoader.loadContext(SpringBootContextLoader.java:138) ~[spring-boot-test-2.0.0.BUILD-SNAPSHOT.jar:2.0.0.BUILD-SNAPSHOT]
26-Jan-2018 22:59:23         at org.springframework.test.context.cache.DefaultCacheAwareContextLoaderDelegate.loadContextInternal(DefaultCacheAwareContextLoaderDelegate.java:99) ~[spring-test-5.0.3.RELEASE.jar:5.0.3.RELEASE]
26-Jan-2018 22:59:23         at org.springframework.test.context.cache.DefaultCacheAwareContextLoaderDelegate.loadContext(DefaultCacheAwareContextLoaderDelegate.java:117) ~[spring-test-5.0.3.RELEASE.jar:5.0.3.RELEASE]
26-Jan-2018 22:59:23         ... 31 common frames omitted
26-Jan-2018 22:59:23 Caused by: java.lang.NoSuchMethodError: io.micrometer.core.instrument.Tags.zip([Ljava/lang/String;)Lio/micrometer/core/instrument/Tags;
26-Jan-2018 22:59:23         at org.springframework.boot.actuate.autoconfigure.metrics.amqp.RabbitMetricsConfiguration.bindConnectionFactoryToRegistry(RabbitMetricsConfiguration.java:69) ~[spring-boot-actuator-autoconfigure-2.0.0.BUILD-SNAPSHOT.jar:2.0.0.BUILD-SNAPSHOT]
26-Jan-2018 22:59:23         at java.util.LinkedHashMap.forEach(LinkedHashMap.java:684) ~[na:1.8.0_144]
26-Jan-2018 22:59:23         at org.springframework.boot.actuate.autoconfigure.metrics.amqp.RabbitMetricsConfiguration.bindConnectionFactoriesToRegistry(RabbitMetricsConfiguration.java:64) ~[spring-boot-actuator-autoconfigure-2.0.0.BUILD-SNAPSHOT.jar:2.0.0.BUILD-SNAPSHOT]
26-Jan-2018 22:59:23         at sun.reflect.NativeMethodAccessorImpl.invoke0(Native Method) ~[na:1.8.0_144]
26-Jan-2018 22:59:23         at sun.reflect.NativeMethodAccessorImpl.invoke(NativeMethodAccessorImpl.java:62) ~[na:1.8.0_144]
26-Jan-2018 22:59:23         at sun.reflect.DelegatingMethodAccessorImpl.invoke(DelegatingMethodAccessorImpl.java:43) ~[na:1.8.0_144]
26-Jan-2018 22:59:23         at java.lang.reflect.Method.invoke(Method.java:498) ~[na:1.8.0_144]
26-Jan-2018 22:59:23         at org.springframework.beans.factory.annotation.AutowiredAnnotationBeanPostProcessor$AutowiredMethodElement.inject(AutowiredAnnotationBeanPostProcessor.java:703) ~[spring-beans-5.0.3.RELEASE.jar:5.0.3.RELEASE]
26-Jan-2018 22:59:23         at org.springframework.beans.factory.annotation.InjectionMetadata.inject(InjectionMetadata.java:91) ~[spring-beans-5.0.3.RELEASE.jar:5.0.3.RELEASE]
26-Jan-2018 22:59:23         at org.springframework.beans.factory.annotation.AutowiredAnnotationBeanPostProcessor.postProcessPropertyValues(AutowiredAnnotationBeanPostProcessor.java:373) ~[spring-beans-5.0.3.RELEASE.jar:5.0.3.RELEASE]
26-Jan-2018 22:59:23         ... 47 common frames omitted
26-Jan-2018 22:59:23
26-Jan-2018 22:59:23
26-Jan-2018 22:59:23   .   ____          _            __ _ _
26-Jan-2018 22:59:23 /\\ / ___'_ __ _ _(_)_ __  __ _ \ \ \ \
26-Jan-2018 22:59:23 ( ( )\___ | '_ | '_| | '_ \/ _` | \ \ \ \
26-Jan-2018 22:59:23 \\/  ___)| |_)| | | | | || (_| |  ) ) ) )
26-Jan-2018 22:59:23   '  |____| .__|_| |_|_| |_\__, | / / / /
26-Jan-2018 22:59:23 =========|_|==============|___/=/_/_/_/
26-Jan-2018 22:59:23 :: Spring Boot ::  (v2.0.0.BUILD-SNAPSHOT)
26-Jan-2018 22:59:23
26-Jan-2018 22:59:23 2018-01-26 22:59:23.878  INFO 15800 --- [           main] o.s.c.t.launcher.TaskLauncherSinkTests   : Starting TaskLauncherSinkTests on bamboo-14 with PID 15800 (started by bamboo in /opt/bamboo-home/xml-data/build-dir/SCT-STASK-JOB1/spring-cloud-task-stream)
26-Jan-2018 22:59:23 2018-01-26 22:59:23.878  INFO 15800 --- [           main] o.s.c.t.launcher.TaskLauncherSinkTests   : No active profile set, falling back to default profiles: default
26-Jan-2018 22:59:23 2018-01-26 22:59:23.881  INFO 15800 --- [           main] o.s.w.c.s.GenericWebApplicationContext   : Refreshing org.springframework.web.context.support.GenericWebApplicationContext@22947122: startup date [Fri Jan 26 22:59:23 UTC 2018]; root of context hierarchy
26-Jan-2018 22:59:24 2018-01-26 22:59:24.077  INFO 15800 --- [           main] o.s.i.config.IntegrationRegistrar        : No bean named 'integrationHeaderChannelRegistry' has been explicitly defined. Therefore, a default DefaultHeaderChannelRegistry will be created.
26-Jan-2018 22:59:24 2018-01-26 22:59:24.083  INFO 15800 --- [           main] o.s.b.f.s.DefaultListableBeanFactory     : Overriding bean definition for bean 'binderFactory' with a different definition: replacing [Root bean: class [null]; scope=; abstract=false; lazyInit=false; autowireMode=3; dependencyCheck=0; autowireCandidate=true; primary=false; factoryBeanName=org.springframework.cloud.stream.config.BinderFactoryConfiguration; factoryMethodName=binderFactory; initMethodName=null; destroyMethodName=(inferred); defined in org.springframework.cloud.stream.config.BinderFactoryConfiguration] with [Root bean: class [null]; scope=; abstract=false; lazyInit=false; autowireMode=3; dependencyCheck=0; autowireCandidate=true; primary=false; factoryBeanName=org.springframework.cloud.stream.test.binder.TestSupportBinderAutoConfiguration; factoryMethodName=binderFactory; initMethodName=null; destroyMethodName=(inferred); defined in class path resource [org/springframework/cloud/stream/test/binder/TestSupportBinderAutoConfiguration.class]]
26-Jan-2018 22:59:24 2018-01-26 22:59:24.166  INFO 15800 --- [           main] faultConfiguringBeanFactoryPostProcessor : No bean named 'errorChannel' has been explicitly defined. Therefore, a default PublishSubscribeChannel will be created.
26-Jan-2018 22:59:24 2018-01-26 22:59:24.166  INFO 15800 --- [           main] faultConfiguringBeanFactoryPostProcessor : No bean named 'taskScheduler' has been explicitly defined. Therefore, a default ThreadPoolTaskScheduler will be created.
26-Jan-2018 22:59:24 2018-01-26 22:59:24.206  INFO 15800 --- [           main] trationDelegate$BeanPostProcessorChecker : Bean 'org.springframework.amqp.rabbit.annotation.RabbitBootstrapConfiguration' of type [org.springframework.amqp.rabbit.annotation.RabbitBootstrapConfiguration$$EnhancerBySpringCGLIB$$e3d85b4f] is not eligible for getting processed by all BeanPostProcessors (for example: not eligible for auto-proxying)
26-Jan-2018 22:59:24 2018-01-26 22:59:24.230  INFO 15800 --- [           main] trationDelegate$BeanPostProcessorChecker : Bean 'org.springframework.transaction.annotation.ProxyTransactionManagementConfiguration' of type [org.springframework.transaction.annotation.ProxyTransactionManagementConfiguration$$EnhancerBySpringCGLIB$$1d6c9d21] is not eligible for getting processed by all BeanPostProcessors (for example: not eligible for auto-proxying)
26-Jan-2018 22:59:24 2018-01-26 22:59:24.246  INFO 15800 --- [           main] trationDelegate$BeanPostProcessorChecker : Bean 'org.springframework.cloud.stream.config.BindingServiceConfiguration$PostProcessorConfiguration' of type [org.springframework.cloud.stream.config.BindingServiceConfiguration$PostProcessorConfiguration$$EnhancerBySpringCGLIB$$df343b26] is not eligible for getting processed by all BeanPostProcessors (for example: not eligible for auto-proxying)
26-Jan-2018 22:59:24 2018-01-26 22:59:24.256  INFO 15800 --- [           main] trationDelegate$BeanPostProcessorChecker : Bean 'org.springframework.cloud.stream.config.SpelExpressionConverterConfiguration' of type [org.springframework.cloud.stream.config.SpelExpressionConverterConfiguration$$EnhancerBySpringCGLIB$$1da8f516] is not eligible for getting processed by all BeanPostProcessors (for example: not eligible for auto-proxying)
26-Jan-2018 22:59:24 2018-01-26 22:59:24.259  INFO 15800 --- [           main] trationDelegate$BeanPostProcessorChecker : Bean 'spelConverter' of type [org.springframework.cloud.stream.config.SpelExpressionConverterConfiguration$SpelConverter] is not eligible for getting processed by all BeanPostProcessors (for example: not eligible for auto-proxying)
26-Jan-2018 22:59:24 2018-01-26 22:59:24.261  INFO 15800 --- [           main] trationDelegate$BeanPostProcessorChecker : Bean 'org.springframework.boot.context.properties.ConfigurationPropertiesBinderBuilder$ConversionServiceFactory' of type [org.springframework.boot.context.properties.ConfigurationPropertiesBinderBuilder$ConversionServiceFactory] is not eligible for getting processed by all BeanPostProcessors (for example: not eligible for auto-proxying)
26-Jan-2018 22:59:24 2018-01-26 22:59:24.269  INFO 15800 --- [           main] trationDelegate$BeanPostProcessorChecker : Bean 'spring.cloud.stream.integration-org.springframework.cloud.stream.config.SpringIntegrationProperties' of type [org.springframework.cloud.stream.config.SpringIntegrationProperties] is not eligible for getting processed by all BeanPostProcessors (for example: not eligible for auto-proxying)
26-Jan-2018 22:59:24 2018-01-26 22:59:24.598  INFO 15800 --- [           main] o.s.s.c.ThreadPoolTaskScheduler          : Initializing ExecutorService  'taskScheduler'
26-Jan-2018 22:59:24 2018-01-26 22:59:24.826  INFO 15800 --- [           main] o.s.j.d.e.EmbeddedDatabaseFactory        : Starting embedded database: url='jdbc:h2:mem:testdb;DB_CLOSE_DELAY=-1;DB_CLOSE_ON_EXIT=false', username='sa'
26-Jan-2018 22:59:25 2018-01-26 22:59:24.999  INFO 15800 --- [           main] s.w.s.m.m.a.RequestMappingHandlerAdapter : Looking for @ControllerAdvice: org.springframework.web.context.support.GenericWebApplicationContext@22947122: startup date [Fri Jan 26 22:59:23 UTC 2018]; root of context hierarchy
26-Jan-2018 22:59:25 2018-01-26 22:59:25.031  INFO 15800 --- [           main] s.w.s.m.m.a.RequestMappingHandlerMapping : Mapped "{[/error],produces=[text/html]}" onto public org.springframework.web.servlet.ModelAndView org.springframework.boot.autoconfigure.web.servlet.error.BasicErrorController.errorHtml(javax.servlet.http.HttpServletRequest,javax.servlet.http.HttpServletResponse)
26-Jan-2018 22:59:25 2018-01-26 22:59:25.031  INFO 15800 --- [           main] s.w.s.m.m.a.RequestMappingHandlerMapping : Mapped "{[/error]}" onto public org.springframework.http.ResponseEntity<java.util.Map<java.lang.String, java.lang.Object>> org.springframework.boot.autoconfigure.web.servlet.error.BasicErrorController.error(javax.servlet.http.HttpServletRequest)
26-Jan-2018 22:59:25 2018-01-26 22:59:25.085  INFO 15800 --- [           main] o.s.w.s.handler.SimpleUrlHandlerMapping  : Mapped URL path [/webjars/**] onto handler of type [class org.springframework.web.servlet.resource.ResourceHttpRequestHandler]
26-Jan-2018 22:59:25 2018-01-26 22:59:25.085  INFO 15800 --- [           main] o.s.w.s.handler.SimpleUrlHandlerMapping  : Mapped URL path [/**] onto handler of type [class org.springframework.web.servlet.resource.ResourceHttpRequestHandler]
26-Jan-2018 22:59:25 2018-01-26 22:59:25.136  INFO 15800 --- [           main] o.s.w.s.handler.SimpleUrlHandlerMapping  : Mapped URL path [/**/favicon.ico] onto handler of type [class org.springframework.web.servlet.resource.ResourceHttpRequestHandler]
26-Jan-2018 22:59:25 2018-01-26 22:59:25.628  WARN 15800 --- [           main] o.s.w.c.s.GenericWebApplicationContext   : Exception encountered during context initialization - cancelling refresh attempt: org.springframework.beans.factory.BeanCreationException: Error creating bean with name 'org.springframework.boot.actuate.autoconfigure.metrics.amqp.RabbitMetricsConfiguration': Injection of autowired dependencies failed; nested exception is java.lang.NoSuchMethodError: io.micrometer.core.instrument.Tags.zip([Ljava/lang/String;)Lio/micrometer/core/instrument/Tags;
26-Jan-2018 22:59:25 2018-01-26 22:59:25.629  INFO 15800 --- [           main] o.s.j.d.e.EmbeddedDatabaseFactory        : Shutting down embedded database: url='jdbc:h2:mem:testdb;DB_CLOSE_DELAY=-1;DB_CLOSE_ON_EXIT=false'
26-Jan-2018 22:59:25 2018-01-26 22:59:25.630  INFO 15800 --- [           main] o.s.s.c.ThreadPoolTaskScheduler          : Shutting down ExecutorService 'taskScheduler'
26-Jan-2018 22:59:25 2018-01-26 22:59:25.636  INFO 15800 --- [           main] ConditionEvaluationReportLoggingListener :
26-Jan-2018 22:59:25
26-Jan-2018 22:59:25 Error starting ApplicationContext. To display the conditions report re-run your application with 'debug' enabled.
26-Jan-2018 22:59:25 2018-01-26 22:59:25.637 ERROR 15800 --- [           main] o.s.boot.SpringApplication               : Application run failed
26-Jan-2018 22:59:25
26-Jan-2018 22:59:25 org.springframework.beans.factory.BeanCreationException: Error creating bean with name 'org.springframework.boot.actuate.autoconfigure.metrics.amqp.RabbitMetricsConfiguration': Injection of autowired dependencies failed; nested exception is java.lang.NoSuchMethodError: io.micrometer.core.instrument.Tags.zip([Ljava/lang/String;)Lio/micrometer/core/instrument/Tags;
26-Jan-2018 22:59:25         at org.springframework.beans.factory.annotation.AutowiredAnnotationBeanPostProcessor.postProcessPropertyValues(AutowiredAnnotationBeanPostProcessor.java:379) ~[spring-beans-5.0.3.RELEASE.jar:5.0.3.RELEASE]
26-Jan-2018 22:59:25         at org.springframework.beans.factory.support.AbstractAutowireCapableBeanFactory.populateBean(AbstractAutowireCapableBeanFactory.java:1344) ~[spring-beans-5.0.3.RELEASE.jar:5.0.3.RELEASE]
26-Jan-2018 22:59:25         at org.springframework.beans.factory.support.AbstractAutowireCapableBeanFactory.doCreateBean(AbstractAutowireCapableBeanFactory.java:582) ~[spring-beans-5.0.3.RELEASE.jar:5.0.3.RELEASE]
26-Jan-2018 22:59:25         at org.springframework.beans.factory.support.AbstractAutowireCapableBeanFactory.createBean(AbstractAutowireCapableBeanFactory.java:502) ~[spring-beans-5.0.3.RELEASE.jar:5.0.3.RELEASE]
26-Jan-2018 22:59:25         at org.springframework.beans.factory.support.AbstractBeanFactory.lambda$doGetBean$0(AbstractBeanFactory.java:312) ~[spring-beans-5.0.3.RELEASE.jar:5.0.3.RELEASE]
26-Jan-2018 22:59:25         at org.springframework.beans.factory.support.DefaultSingletonBeanRegistry.getSingleton(DefaultSingletonBeanRegistry.java:228) ~[spring-beans-5.0.3.RELEASE.jar:5.0.3.RELEASE]
26-Jan-2018 22:59:25         at org.springframework.beans.factory.support.AbstractBeanFactory.doGetBean(AbstractBeanFactory.java:310) ~[spring-beans-5.0.3.RELEASE.jar:5.0.3.RELEASE]
26-Jan-2018 22:59:25         at org.springframework.beans.factory.support.AbstractBeanFactory.getBean(AbstractBeanFactory.java:200) ~[spring-beans-5.0.3.RELEASE.jar:5.0.3.RELEASE]
26-Jan-2018 22:59:25         at org.springframework.beans.factory.support.DefaultListableBeanFactory.preInstantiateSingletons(DefaultListableBeanFactory.java:761) ~[spring-beans-5.0.3.RELEASE.jar:5.0.3.RELEASE]
26-Jan-2018 22:59:25         at org.springframework.context.support.AbstractApplicationContext.finishBeanFactoryInitialization(AbstractApplicationContext.java:868) ~[spring-context-5.0.3.RELEASE.jar:5.0.3.RELEASE]
26-Jan-2018 22:59:25         at org.springframework.context.support.AbstractApplicationContext.refresh(AbstractApplicationContext.java:549) ~[spring-context-5.0.3.RELEASE.jar:5.0.3.RELEASE]
26-Jan-2018 22:59:25         at org.springframework.boot.SpringApplication.refresh(SpringApplication.java:752) ~[spring-boot-2.0.0.BUILD-SNAPSHOT.jar:2.0.0.BUILD-SNAPSHOT]
26-Jan-2018 22:59:25         at org.springframework.boot.SpringApplication.refreshContext(SpringApplication.java:388) ~[spring-boot-2.0.0.BUILD-SNAPSHOT.jar:2.0.0.BUILD-SNAPSHOT]
26-Jan-2018 22:59:25         at org.springframework.boot.SpringApplication.run(SpringApplication.java:327) ~[spring-boot-2.0.0.BUILD-SNAPSHOT.jar:2.0.0.BUILD-SNAPSHOT]
26-Jan-2018 22:59:25         at org.springframework.boot.test.context.SpringBootContextLoader.loadContext(SpringBootContextLoader.java:138) [spring-boot-test-2.0.0.BUILD-SNAPSHOT.jar:2.0.0.BUILD-SNAPSHOT]
26-Jan-2018 22:59:25         at org.springframework.test.context.cache.DefaultCacheAwareContextLoaderDelegate.loadContextInternal(DefaultCacheAwareContextLoaderDelegate.java:99) [spring-test-5.0.3.RELEASE.jar:5.0.3.RELEASE]
26-Jan-2018 22:59:25         at org.springframework.test.context.cache.DefaultCacheAwareContextLoaderDelegate.loadContext(DefaultCacheAwareContextLoaderDelegate.java:117) [spring-test-5.0.3.RELEASE.jar:5.0.3.RELEASE]
26-Jan-2018 22:59:25         at org.springframework.test.context.support.DefaultTestContext.getApplicationContext(DefaultTestContext.java:107) [spring-test-5.0.3.RELEASE.jar:5.0.3.RELEASE]
26-Jan-2018 22:59:25         at org.springframework.test.context.web.ServletTestExecutionListener.setUpRequestContextIfNecessary(ServletTestExecutionListener.java:190) [spring-test-5.0.3.RELEASE.jar:5.0.3.RELEASE]
26-Jan-2018 22:59:25         at org.springframework.test.context.web.ServletTestExecutionListener.prepareTestInstance(ServletTestExecutionListener.java:132) [spring-test-5.0.3.RELEASE.jar:5.0.3.RELEASE]
26-Jan-2018 22:59:25         at org.springframework.test.context.TestContextManager.prepareTestInstance(TestContextManager.java:242) [spring-test-5.0.3.RELEASE.jar:5.0.3.RELEASE]
26-Jan-2018 22:59:25         at org.springframework.test.context.junit4.SpringJUnit4ClassRunner.createTest(SpringJUnit4ClassRunner.java:227) [spring-test-5.0.3.RELEASE.jar:5.0.3.RELEASE]
26-Jan-2018 22:59:25         at org.springframework.test.context.junit4.SpringJUnit4ClassRunner$1.runReflectiveCall(SpringJUnit4ClassRunner.java:289) [spring-test-5.0.3.RELEASE.jar:5.0.3.RELEASE]
26-Jan-2018 22:59:25         at org.junit.internal.runners.model.ReflectiveCallable.run(ReflectiveCallable.java:12) [junit-4.12.jar:4.12]
26-Jan-2018 22:59:25         at org.springframework.test.context.junit4.SpringJUnit4ClassRunner.methodBlock(SpringJUnit4ClassRunner.java:291) [spring-test-5.0.3.RELEASE.jar:5.0.3.RELEASE]
26-Jan-2018 22:59:25         at org.springframework.test.context.junit4.SpringJUnit4ClassRunner.runChild(SpringJUnit4ClassRunner.java:246) [spring-test-5.0.3.RELEASE.jar:5.0.3.RELEASE]
26-Jan-2018 22:59:25         at org.springframework.test.context.junit4.SpringJUnit4ClassRunner.runChild(SpringJUnit4ClassRunner.java:97) [spring-test-5.0.3.RELEASE.jar:5.0.3.RELEASE]
26-Jan-2018 22:59:25         at org.junit.runners.ParentRunner$3.run(ParentRunner.java:290) [junit-4.12.jar:4.12]
26-Jan-2018 22:59:25         at org.junit.runners.ParentRunner$1.schedule(ParentRunner.java:71) [junit-4.12.jar:4.12]
26-Jan-2018 22:59:25         at org.junit.runners.ParentRunner.runChildren(ParentRunner.java:288) [junit-4.12.jar:4.12]
26-Jan-2018 22:59:25         at org.junit.runners.ParentRunner.access$000(ParentRunner.java:58) [junit-4.12.jar:4.12]
26-Jan-2018 22:59:25         at org.junit.runners.ParentRunner$2.evaluate(ParentRunner.java:268) [junit-4.12.jar:4.12]
26-Jan-2018 22:59:25         at org.springframework.test.context.junit4.statements.RunBeforeTestClassCallbacks.evaluate(RunBeforeTestClassCallbacks.java:61) [spring-test-5.0.3.RELEASE.jar:5.0.3.RELEASE]
26-Jan-2018 22:59:25         at org.springframework.test.context.junit4.statements.RunAfterTestClassCallbacks.evaluate(RunAfterTestClassCallbacks.java:70) [spring-test-5.0.3.RELEASE.jar:5.0.3.RELEASE]
26-Jan-2018 22:59:25         at org.junit.runners.ParentRunner.run(ParentRunner.java:363) [junit-4.12.jar:4.12]
26-Jan-2018 22:59:25         at org.springframework.test.context.junit4.SpringJUnit4ClassRunner.run(SpringJUnit4ClassRunner.java:190) [spring-test-5.0.3.RELEASE.jar:5.0.3.RELEASE]
26-Jan-2018 22:59:25         at org.apache.maven.surefire.junit4.JUnit4Provider.execute(JUnit4Provider.java:252) [surefire-junit4-2.12.4.jar:2.12.4]
26-Jan-2018 22:59:25         at org.apache.maven.surefire.junit4.JUnit4Provider.executeTestSet(JUnit4Provider.java:141) [surefire-junit4-2.12.4.jar:2.12.4]
26-Jan-2018 22:59:25         at org.apache.maven.surefire.junit4.JUnit4Provider.invoke(JUnit4Provider.java:112) [surefire-junit4-2.12.4.jar:2.12.4]
26-Jan-2018 22:59:25         at sun.reflect.NativeMethodAccessorImpl.invoke0(Native Method) ~[na:1.8.0_144]
26-Jan-2018 22:59:25         at sun.reflect.NativeMethodAccessorImpl.invoke(NativeMethodAccessorImpl.java:62) ~[na:1.8.0_144]
26-Jan-2018 22:59:25         at sun.reflect.DelegatingMethodAccessorImpl.invoke(DelegatingMethodAccessorImpl.java:43) ~[na:1.8.0_144]
26-Jan-2018 22:59:25         at java.lang.reflect.Method.invoke(Method.java:498) ~[na:1.8.0_144]
26-Jan-2018 22:59:25         at org.apache.maven.surefire.util.ReflectionUtils.invokeMethodWithArray(ReflectionUtils.java:189) [surefire-api-2.12.4.jar:2.12.4]
26-Jan-2018 22:59:25         at org.apache.maven.surefire.booter.ProviderFactory$ProviderProxy.invoke(ProviderFactory.java:165) [surefire-booter-2.12.4.jar:2.12.4]
26-Jan-2018 22:59:25         at org.apache.maven.surefire.booter.ProviderFactory.invokeProvider(ProviderFactory.java:85) [surefire-booter-2.12.4.jar:2.12.4]
26-Jan-2018 22:59:25         at org.apache.maven.surefire.booter.ForkedBooter.runSuitesInProcess(ForkedBooter.java:115) [surefire-booter-2.12.4.jar:2.12.4]
26-Jan-2018 22:59:25         at org.apache.maven.surefire.booter.ForkedBooter.main(ForkedBooter.java:75) [surefire-booter-2.12.4.jar:2.12.4]
26-Jan-2018 22:59:25 Caused by: java.lang.NoSuchMethodError: io.micrometer.core.instrument.Tags.zip([Ljava/lang/String;)Lio/micrometer/core/instrument/Tags;
26-Jan-2018 22:59:25         at org.springframework.boot.actuate.autoconfigure.metrics.amqp.RabbitMetricsConfiguration.bindConnectionFactoryToRegistry(RabbitMetricsConfiguration.java:69) ~[spring-boot-actuator-autoconfigure-2.0.0.BUILD-SNAPSHOT.jar:2.0.0.BUILD-SNAPSHOT]
26-Jan-2018 22:59:25         at java.util.LinkedHashMap.forEach(LinkedHashMap.java:684) ~[na:1.8.0_144]
26-Jan-2018 22:59:25         at org.springframework.boot.actuate.autoconfigure.metrics.amqp.RabbitMetricsConfiguration.bindConnectionFactoriesToRegistry(RabbitMetricsConfiguration.java:64) ~[spring-boot-actuator-autoconfigure-2.0.0.BUILD-SNAPSHOT.jar:2.0.0.BUILD-SNAPSHOT]
26-Jan-2018 22:59:25         at sun.reflect.NativeMethodAccessorImpl.invoke0(Native Method) ~[na:1.8.0_144]
26-Jan-2018 22:59:25         at sun.reflect.NativeMethodAccessorImpl.invoke(NativeMethodAccessorImpl.java:62) ~[na:1.8.0_144]
26-Jan-2018 22:59:25         at sun.reflect.DelegatingMethodAccessorImpl.invoke(DelegatingMethodAccessorImpl.java:43) ~[na:1.8.0_144]
26-Jan-2018 22:59:25         at java.lang.reflect.Method.invoke(Method.java:498) ~[na:1.8.0_144]
26-Jan-2018 22:59:25         at org.springframework.beans.factory.annotation.AutowiredAnnotationBeanPostProcessor$AutowiredMethodElement.inject(AutowiredAnnotationBeanPostProcessor.java:703) ~[spring-beans-5.0.3.RELEASE.jar:5.0.3.RELEASE]
26-Jan-2018 22:59:25         at org.springframework.beans.factory.annotation.InjectionMetadata.inject(InjectionMetadata.java:91) ~[spring-beans-5.0.3.RELEASE.jar:5.0.3.RELEASE]
26-Jan-2018 22:59:25         at org.springframework.beans.factory.annotation.AutowiredAnnotationBeanPostProcessor.postProcessPropertyValues(AutowiredAnnotationBeanPostProcessor.java:373) ~[spring-beans-5.0.3.RELEASE.jar:5.0.3.RELEASE]
26-Jan-2018 22:59:25         ... 47 common frames omitted
26-Jan-2018 22:59:25
26-Jan-2018 22:59:25 2018-01-26 22:59:25.638 ERROR 15800 --- [           main] o.s.test.context.TestContextManager      : Caught exception while allowing TestExecutionListener [org.springframework.test.context.web.ServletTestExecutionListener@38f1aa6f] to prepare test instance [org.springframework.cloud.task.launcher.TaskLauncherSinkTests@51ad2133]
26-Jan-2018 22:59:25
26-Jan-2018 22:59:25 java.lang.IllegalStateException: Failed to load ApplicationContext
26-Jan-2018 22:59:25         at org.springframework.test.context.cache.DefaultCacheAwareContextLoaderDelegate.loadContext(DefaultCacheAwareContextLoaderDelegate.java:125) ~[spring-test-5.0.3.RELEASE.jar:5.0.3.RELEASE]
26-Jan-2018 22:59:25         at org.springframework.test.context.support.DefaultTestContext.getApplicationContext(DefaultTestContext.java:107) ~[spring-test-5.0.3.RELEASE.jar:5.0.3.RELEASE]
26-Jan-2018 22:59:25         at org.springframework.test.context.web.ServletTestExecutionListener.setUpRequestContextIfNecessary(ServletTestExecutionListener.java:190) ~[spring-test-5.0.3.RELEASE.jar:5.0.3.RELEASE]
26-Jan-2018 22:59:25         at org.springframework.test.context.web.ServletTestExecutionListener.prepareTestInstance(ServletTestExecutionListener.java:132) ~[spring-test-5.0.3.RELEASE.jar:5.0.3.RELEASE]
26-Jan-2018 22:59:25         at org.springframework.test.context.TestContextManager.prepareTestInstance(TestContextManager.java:242) ~[spring-test-5.0.3.RELEASE.jar:5.0.3.RELEASE]
26-Jan-2018 22:59:25         at org.springframework.test.context.junit4.SpringJUnit4ClassRunner.createTest(SpringJUnit4ClassRunner.java:227) [spring-test-5.0.3.RELEASE.jar:5.0.3.RELEASE]
26-Jan-2018 22:59:25         at org.springframework.test.context.junit4.SpringJUnit4ClassRunner$1.runReflectiveCall(SpringJUnit4ClassRunner.java:289) [spring-test-5.0.3.RELEASE.jar:5.0.3.RELEASE]
26-Jan-2018 22:59:25         at org.junit.internal.runners.model.ReflectiveCallable.run(ReflectiveCallable.java:12) [junit-4.12.jar:4.12]
26-Jan-2018 22:59:25         at org.springframework.test.context.junit4.SpringJUnit4ClassRunner.methodBlock(SpringJUnit4ClassRunner.java:291) [spring-test-5.0.3.RELEASE.jar:5.0.3.RELEASE]
26-Jan-2018 22:59:25         at org.springframework.test.context.junit4.SpringJUnit4ClassRunner.runChild(SpringJUnit4ClassRunner.java:246) [spring-test-5.0.3.RELEASE.jar:5.0.3.RELEASE]
26-Jan-2018 22:59:25         at org.springframework.test.context.junit4.SpringJUnit4ClassRunner.runChild(SpringJUnit4ClassRunner.java:97) [spring-test-5.0.3.RELEASE.jar:5.0.3.RELEASE]
26-Jan-2018 22:59:25         at org.junit.runners.ParentRunner$3.run(ParentRunner.java:290) [junit-4.12.jar:4.12]
26-Jan-2018 22:59:25         at org.junit.runners.ParentRunner$1.schedule(ParentRunner.java:71) [junit-4.12.jar:4.12]
26-Jan-2018 22:59:25         at org.junit.runners.ParentRunner.runChildren(ParentRunner.java:288) [junit-4.12.jar:4.12]
26-Jan-2018 22:59:25         at org.junit.runners.ParentRunner.access$000(ParentRunner.java:58) [junit-4.12.jar:4.12]
26-Jan-2018 22:59:25         at org.junit.runners.ParentRunner$2.evaluate(ParentRunner.java:268) [junit-4.12.jar:4.12]
26-Jan-2018 22:59:25         at org.springframework.test.context.junit4.statements.RunBeforeTestClassCallbacks.evaluate(RunBeforeTestClassCallbacks.java:61) [spring-test-5.0.3.RELEASE.jar:5.0.3.RELEASE]
26-Jan-2018 22:59:25         at org.springframework.test.context.junit4.statements.RunAfterTestClassCallbacks.evaluate(RunAfterTestClassCallbacks.java:70) [spring-test-5.0.3.RELEASE.jar:5.0.3.RELEASE]
26-Jan-2018 22:59:25         at org.junit.runners.ParentRunner.run(ParentRunner.java:363) [junit-4.12.jar:4.12]
26-Jan-2018 22:59:25         at org.springframework.test.context.junit4.SpringJUnit4ClassRunner.run(SpringJUnit4ClassRunner.java:190) [spring-test-5.0.3.RELEASE.jar:5.0.3.RELEASE]
26-Jan-2018 22:59:25         at org.apache.maven.surefire.junit4.JUnit4Provider.execute(JUnit4Provider.java:252) [surefire-junit4-2.12.4.jar:2.12.4]
26-Jan-2018 22:59:25         at org.apache.maven.surefire.junit4.JUnit4Provider.executeTestSet(JUnit4Provider.java:141) [surefire-junit4-2.12.4.jar:2.12.4]
26-Jan-2018 22:59:25         at org.apache.maven.surefire.junit4.JUnit4Provider.invoke(JUnit4Provider.java:112) [surefire-junit4-2.12.4.jar:2.12.4]
26-Jan-2018 22:59:25         at sun.reflect.NativeMethodAccessorImpl.invoke0(Native Method) ~[na:1.8.0_144]
26-Jan-2018 22:59:25         at sun.reflect.NativeMethodAccessorImpl.invoke(NativeMethodAccessorImpl.java:62) ~[na:1.8.0_144]
26-Jan-2018 22:59:25         at sun.reflect.DelegatingMethodAccessorImpl.invoke(DelegatingMethodAccessorImpl.java:43) ~[na:1.8.0_144]
26-Jan-2018 22:59:25         at java.lang.reflect.Method.invoke(Method.java:498) ~[na:1.8.0_144]
26-Jan-2018 22:59:25         at org.apache.maven.surefire.util.ReflectionUtils.invokeMethodWithArray(ReflectionUtils.java:189) [surefire-api-2.12.4.jar:2.12.4]
26-Jan-2018 22:59:25         at org.apache.maven.surefire.booter.ProviderFactory$ProviderProxy.invoke(ProviderFactory.java:165) [surefire-booter-2.12.4.jar:2.12.4]
26-Jan-2018 22:59:25         at org.apache.maven.surefire.booter.ProviderFactory.invokeProvider(ProviderFactory.java:85) [surefire-booter-2.12.4.jar:2.12.4]
26-Jan-2018 22:59:25         at org.apache.maven.surefire.booter.ForkedBooter.runSuitesInProcess(ForkedBooter.java:115) [surefire-booter-2.12.4.jar:2.12.4]
26-Jan-2018 22:59:25         at org.apache.maven.surefire.booter.ForkedBooter.main(ForkedBooter.java:75) [surefire-booter-2.12.4.jar:2.12.4]
26-Jan-2018 22:59:25 Caused by: org.springframework.beans.factory.BeanCreationException: Error creating bean with name 'org.springframework.boot.actuate.autoconfigure.metrics.amqp.RabbitMetricsConfiguration': Injection of autowired dependencies failed; nested exception is java.lang.NoSuchMethodError: io.micrometer.core.instrument.Tags.zip([Ljava/lang/String;)Lio/micrometer/core/instrument/Tags;
26-Jan-2018 22:59:25         at org.springframework.beans.factory.annotation.AutowiredAnnotationBeanPostProcessor.postProcessPropertyValues(AutowiredAnnotationBeanPostProcessor.java:379) ~[spring-beans-5.0.3.RELEASE.jar:5.0.3.RELEASE]
26-Jan-2018 22:59:25         at org.springframework.beans.factory.support.AbstractAutowireCapableBeanFactory.populateBean(AbstractAutowireCapableBeanFactory.java:1344) ~[spring-beans-5.0.3.RELEASE.jar:5.0.3.RELEASE]
26-Jan-2018 22:59:25         at org.springframework.beans.factory.support.AbstractAutowireCapableBeanFactory.doCreateBean(AbstractAutowireCapableBeanFactory.java:582) ~[spring-beans-5.0.3.RELEASE.jar:5.0.3.RELEASE]
26-Jan-2018 22:59:25         at org.springframework.beans.factory.support.AbstractAutowireCapableBeanFactory.createBean(AbstractAutowireCapableBeanFactory.java:502) ~[spring-beans-5.0.3.RELEASE.jar:5.0.3.RELEASE]
26-Jan-2018 22:59:25         at org.springframework.beans.factory.support.AbstractBeanFactory.lambda$doGetBean$0(AbstractBeanFactory.java:312) ~[spring-beans-5.0.3.RELEASE.jar:5.0.3.RELEASE]
26-Jan-2018 22:59:25         at org.springframework.beans.factory.support.DefaultSingletonBeanRegistry.getSingleton(DefaultSingletonBeanRegistry.java:228) ~[spring-beans-5.0.3.RELEASE.jar:5.0.3.RELEASE]
26-Jan-2018 22:59:25         at org.springframework.beans.factory.support.AbstractBeanFactory.doGetBean(AbstractBeanFactory.java:310) ~[spring-beans-5.0.3.RELEASE.jar:5.0.3.RELEASE]
26-Jan-2018 22:59:25         at org.springframework.beans.factory.support.AbstractBeanFactory.getBean(AbstractBeanFactory.java:200) ~[spring-beans-5.0.3.RELEASE.jar:5.0.3.RELEASE]
26-Jan-2018 22:59:25         at org.springframework.beans.factory.support.DefaultListableBeanFactory.preInstantiateSingletons(DefaultListableBeanFactory.java:761) ~[spring-beans-5.0.3.RELEASE.jar:5.0.3.RELEASE]
26-Jan-2018 22:59:25         at org.springframework.context.support.AbstractApplicationContext.finishBeanFactoryInitialization(AbstractApplicationContext.java:868) ~[spring-context-5.0.3.RELEASE.jar:5.0.3.RELEASE]
26-Jan-2018 22:59:25         at org.springframework.context.support.AbstractApplicationContext.refresh(AbstractApplicationContext.java:549) ~[spring-context-5.0.3.RELEASE.jar:5.0.3.RELEASE]
26-Jan-2018 22:59:25         at org.springframework.boot.SpringApplication.refresh(SpringApplication.java:752) ~[spring-boot-2.0.0.BUILD-SNAPSHOT.jar:2.0.0.BUILD-SNAPSHOT]
26-Jan-2018 22:59:25         at org.springframework.boot.SpringApplication.refreshContext(SpringApplication.java:388) ~[spring-boot-2.0.0.BUILD-SNAPSHOT.jar:2.0.0.BUILD-SNAPSHOT]
26-Jan-2018 22:59:25         at org.springframework.boot.SpringApplication.run(SpringApplication.java:327) ~[spring-boot-2.0.0.BUILD-SNAPSHOT.jar:2.0.0.BUILD-SNAPSHOT]
26-Jan-2018 22:59:25         at org.springframework.boot.test.context.SpringBootContextLoader.loadContext(SpringBootContextLoader.java:138) ~[spring-boot-test-2.0.0.BUILD-SNAPSHOT.jar:2.0.0.BUILD-SNAPSHOT]
26-Jan-2018 22:59:25         at org.springframework.test.context.cache.DefaultCacheAwareContextLoaderDelegate.loadContextInternal(DefaultCacheAwareContextLoaderDelegate.java:99) ~[spring-test-5.0.3.RELEASE.jar:5.0.3.RELEASE]
26-Jan-2018 22:59:25         at org.springframework.test.context.cache.DefaultCacheAwareContextLoaderDelegate.loadContext(DefaultCacheAwareContextLoaderDelegate.java:117) ~[spring-test-5.0.3.RELEASE.jar:5.0.3.RELEASE]
26-Jan-2018 22:59:25         ... 31 common frames omitted
26-Jan-2018 22:59:25 Caused by: java.lang.NoSuchMethodError: io.micrometer.core.instrument.Tags.zip([Ljava/lang/String;)Lio/micrometer/core/instrument/Tags;
26-Jan-2018 22:59:25         at org.springframework.boot.actuate.autoconfigure.metrics.amqp.RabbitMetricsConfiguration.bindConnectionFactoryToRegistry(RabbitMetricsConfiguration.java:69) ~[spring-boot-actuator-autoconfigure-2.0.0.BUILD-SNAPSHOT.jar:2.0.0.BUILD-SNAPSHOT]
26-Jan-2018 22:59:25         at java.util.LinkedHashMap.forEach(LinkedHashMap.java:684) ~[na:1.8.0_144]
26-Jan-2018 22:59:25         at org.springframework.boot.actuate.autoconfigure.metrics.amqp.RabbitMetricsConfiguration.bindConnectionFactoriesToRegistry(RabbitMetricsConfiguration.java:64) ~[spring-boot-actuator-autoconfigure-2.0.0.BUILD-SNAPSHOT.jar:2.0.0.BUILD-SNAPSHOT]
26-Jan-2018 22:59:25         at sun.reflect.NativeMethodAccessorImpl.invoke0(Native Method) ~[na:1.8.0_144]
26-Jan-2018 22:59:25         at sun.reflect.NativeMethodAccessorImpl.invoke(NativeMethodAccessorImpl.java:62) ~[na:1.8.0_144]
26-Jan-2018 22:59:25         at sun.reflect.DelegatingMethodAccessorImpl.invoke(DelegatingMethodAccessorImpl.java:43) ~[na:1.8.0_144]
26-Jan-2018 22:59:25         at java.lang.reflect.Method.invoke(Method.java:498) ~[na:1.8.0_144]
26-Jan-2018 22:59:25         at org.springframework.beans.factory.annotation.AutowiredAnnotationBeanPostProcessor$AutowiredMethodElement.inject(AutowiredAnnotationBeanPostProcessor.java:703) ~[spring-beans-5.0.3.RELEASE.jar:5.0.3.RELEASE]
26-Jan-2018 22:59:25         at org.springframework.beans.factory.annotation.InjectionMetadata.inject(InjectionMetadata.java:91) ~[spring-beans-5.0.3.RELEASE.jar:5.0.3.RELEASE]
26-Jan-2018 22:59:25         at org.springframework.beans.factory.annotation.AutowiredAnnotationBeanPostProcessor.postProcessPropertyValues(AutowiredAnnotationBeanPostProcessor.java:373) ~[spring-beans-5.0.3.RELEASE.jar:5.0.3.RELEASE]
26-Jan-2018 22:59:25         ... 47 common frames omitted
26-Jan-2018 22:59:25
26-Jan-2018 22:59:25
26-Jan-2018 22:59:25   .   ____          _            __ _ _
26-Jan-2018 22:59:25 /\\ / ___'_ __ _ _(_)_ __  __ _ \ \ \ \
26-Jan-2018 22:59:25 ( ( )\___ | '_ | '_| | '_ \/ _` | \ \ \ \
26-Jan-2018 22:59:25 \\/  ___)| |_)| | | | | || (_| |  ) ) ) )
26-Jan-2018 22:59:25   '  |____| .__|_| |_|_| |_\__, | / / / /
26-Jan-2018 22:59:25 =========|_|==============|___/=/_/_/_/
26-Jan-2018 22:59:25 :: Spring Boot ::  (v2.0.0.BUILD-SNAPSHOT)
26-Jan-2018 22:59:25
26-Jan-2018 22:59:25 2018-01-26 22:59:25.659  INFO 15800 --- [           main] o.s.c.t.launcher.TaskLauncherSinkTests   : Starting TaskLauncherSinkTests on bamboo-14 with PID 15800 (started by bamboo in /opt/bamboo-home/xml-data/build-dir/SCT-STASK-JOB1/spring-cloud-task-stream)
26-Jan-2018 22:59:25 2018-01-26 22:59:25.660  INFO 15800 --- [           main] o.s.c.t.launcher.TaskLauncherSinkTests   : No active profile set, falling back to default profiles: default
26-Jan-2018 22:59:25 2018-01-26 22:59:25.663  INFO 15800 --- [           main] o.s.w.c.s.GenericWebApplicationContext   : Refreshing org.springframework.web.context.support.GenericWebApplicationContext@64ab9d28: startup date [Fri Jan 26 22:59:25 UTC 2018]; root of context hierarchy
26-Jan-2018 22:59:25 2018-01-26 22:59:25.853  INFO 15800 --- [           main] o.s.i.config.IntegrationRegistrar        : No bean named 'integrationHeaderChannelRegistry' has been explicitly defined. Therefore, a default DefaultHeaderChannelRegistry will be created.
26-Jan-2018 22:59:25 2018-01-26 22:59:25.861  INFO 15800 --- [           main] o.s.b.f.s.DefaultListableBeanFactory     : Overriding bean definition for bean 'binderFactory' with a different definition: replacing [Root bean: class [null]; scope=; abstract=false; lazyInit=false; autowireMode=3; dependencyCheck=0; autowireCandidate=true; primary=false; factoryBeanName=org.springframework.cloud.stream.config.BinderFactoryConfiguration; factoryMethodName=binderFactory; initMethodName=null; destroyMethodName=(inferred); defined in org.springframework.cloud.stream.config.BinderFactoryConfiguration] with [Root bean: class [null]; scope=; abstract=false; lazyInit=false; autowireMode=3; dependencyCheck=0; autowireCandidate=true; primary=false; factoryBeanName=org.springframework.cloud.stream.test.binder.TestSupportBinderAutoConfiguration; factoryMethodName=binderFactory; initMethodName=null; destroyMethodName=(inferred); defined in class path resource [org/springframework/cloud/stream/test/binder/TestSupportBinderAutoConfiguration.class]]
26-Jan-2018 22:59:25 2018-01-26 22:59:25.953  INFO 15800 --- [           main] faultConfiguringBeanFactoryPostProcessor : No bean named 'errorChannel' has been explicitly defined. Therefore, a default PublishSubscribeChannel will be created.
26-Jan-2018 22:59:25 2018-01-26 22:59:25.953  INFO 15800 --- [           main] faultConfiguringBeanFactoryPostProcessor : No bean named 'taskScheduler' has been explicitly defined. Therefore, a default ThreadPoolTaskScheduler will be created.
26-Jan-2018 22:59:25 2018-01-26 22:59:25.992  INFO 15800 --- [           main] trationDelegate$BeanPostProcessorChecker : Bean 'org.springframework.amqp.rabbit.annotation.RabbitBootstrapConfiguration' of type [org.springframework.amqp.rabbit.annotation.RabbitBootstrapConfiguration$$EnhancerBySpringCGLIB$$e3d85b4f] is not eligible for getting processed by all BeanPostProcessors (for example: not eligible for auto-proxying)
26-Jan-2018 22:59:26 2018-01-26 22:59:26.017  INFO 15800 --- [           main] trationDelegate$BeanPostProcessorChecker : Bean 'org.springframework.transaction.annotation.ProxyTransactionManagementConfiguration' of type [org.springframework.transaction.annotation.ProxyTransactionManagementConfiguration$$EnhancerBySpringCGLIB$$1d6c9d21] is not eligible for getting processed by all BeanPostProcessors (for example: not eligible for auto-proxying)
26-Jan-2018 22:59:26 2018-01-26 22:59:26.037  INFO 15800 --- [           main] trationDelegate$BeanPostProcessorChecker : Bean 'org.springframework.cloud.stream.config.BindingServiceConfiguration$PostProcessorConfiguration' of type [org.springframework.cloud.stream.config.BindingServiceConfiguration$PostProcessorConfiguration$$EnhancerBySpringCGLIB$$df343b26] is not eligible for getting processed by all BeanPostProcessors (for example: not eligible for auto-proxying)
26-Jan-2018 22:59:26 2018-01-26 22:59:26.052  INFO 15800 --- [           main] trationDelegate$BeanPostProcessorChecker : Bean 'org.springframework.cloud.stream.config.SpelExpressionConverterConfiguration' of type [org.springframework.cloud.stream.config.SpelExpressionConverterConfiguration$$EnhancerBySpringCGLIB$$1da8f516] is not eligible for getting processed by all BeanPostProcessors (for example: not eligible for auto-proxying)
26-Jan-2018 22:59:26 2018-01-26 22:59:26.057  INFO 15800 --- [           main] trationDelegate$BeanPostProcessorChecker : Bean 'spelConverter' of type [org.springframework.cloud.stream.config.SpelExpressionConverterConfiguration$SpelConverter] is not eligible for getting processed by all BeanPostProcessors (for example: not eligible for auto-proxying)
26-Jan-2018 22:59:26 2018-01-26 22:59:26.061  INFO 15800 --- [           main] trationDelegate$BeanPostProcessorChecker : Bean 'org.springframework.boot.context.properties.ConfigurationPropertiesBinderBuilder$ConversionServiceFactory' of type [org.springframework.boot.context.properties.ConfigurationPropertiesBinderBuilder$ConversionServiceFactory] is not eligible for getting processed by all BeanPostProcessors (for example: not eligible for auto-proxying)
26-Jan-2018 22:59:26 2018-01-26 22:59:26.070  INFO 15800 --- [           main] trationDelegate$BeanPostProcessorChecker : Bean 'spring.cloud.stream.integration-org.springframework.cloud.stream.config.SpringIntegrationProperties' of type [org.springframework.cloud.stream.config.SpringIntegrationProperties] is not eligible for getting processed by all BeanPostProcessors (for example: not eligible for auto-proxying)
26-Jan-2018 22:59:26 2018-01-26 22:59:26.429  INFO 15800 --- [           main] o.s.s.c.ThreadPoolTaskScheduler          : Initializing ExecutorService  'taskScheduler'
26-Jan-2018 22:59:26 2018-01-26 22:59:26.612  INFO 15800 --- [           main] o.s.j.d.e.EmbeddedDatabaseFactory        : Starting embedded database: url='jdbc:h2:mem:testdb;DB_CLOSE_DELAY=-1;DB_CLOSE_ON_EXIT=false', username='sa'
26-Jan-2018 22:59:26 2018-01-26 22:59:26.776  INFO 15800 --- [           main] s.w.s.m.m.a.RequestMappingHandlerAdapter : Looking for @ControllerAdvice: org.springframework.web.context.support.GenericWebApplicationContext@64ab9d28: startup date [Fri Jan 26 22:59:25 UTC 2018]; root of context hierarchy
26-Jan-2018 22:59:26 2018-01-26 22:59:26.807  INFO 15800 --- [           main] s.w.s.m.m.a.RequestMappingHandlerMapping : Mapped "{[/error],produces=[text/html]}" onto public org.springframework.web.servlet.ModelAndView org.springframework.boot.autoconfigure.web.servlet.error.BasicErrorController.errorHtml(javax.servlet.http.HttpServletRequest,javax.servlet.http.HttpServletResponse)
26-Jan-2018 22:59:26 2018-01-26 22:59:26.807  INFO 15800 --- [           main] s.w.s.m.m.a.RequestMappingHandlerMapping : Mapped "{[/error]}" onto public org.springframework.http.ResponseEntity<java.util.Map<java.lang.String, java.lang.Object>> org.springframework.boot.autoconfigure.web.servlet.error.BasicErrorController.error(javax.servlet.http.HttpServletRequest)
26-Jan-2018 22:59:26 2018-01-26 22:59:26.860  INFO 15800 --- [           main] o.s.w.s.handler.SimpleUrlHandlerMapping  : Mapped URL path [/webjars/**] onto handler of type [class org.springframework.web.servlet.resource.ResourceHttpRequestHandler]
26-Jan-2018 22:59:26 2018-01-26 22:59:26.860  INFO 15800 --- [           main] o.s.w.s.handler.SimpleUrlHandlerMapping  : Mapped URL path [/**] onto handler of type [class org.springframework.web.servlet.resource.ResourceHttpRequestHandler]
26-Jan-2018 22:59:26 2018-01-26 22:59:26.909  INFO 15800 --- [           main] o.s.w.s.handler.SimpleUrlHandlerMapping  : Mapped URL path [/**/favicon.ico] onto handler of type [class org.springframework.web.servlet.resource.ResourceHttpRequestHandler]
26-Jan-2018 22:59:27 2018-01-26 22:59:27.520  WARN 15800 --- [           main] o.s.w.c.s.GenericWebApplicationContext   : Exception encountered during context initialization - cancelling refresh attempt: org.springframework.beans.factory.BeanCreationException: Error creating bean with name 'org.springframework.boot.actuate.autoconfigure.metrics.amqp.RabbitMetricsConfiguration': Injection of autowired dependencies failed; nested exception is java.lang.NoSuchMethodError: io.micrometer.core.instrument.Tags.zip([Ljava/lang/String;)Lio/micrometer/core/instrument/Tags;
26-Jan-2018 22:59:27 2018-01-26 22:59:27.521  INFO 15800 --- [           main] o.s.j.d.e.EmbeddedDatabaseFactory        : Shutting down embedded database: url='jdbc:h2:mem:testdb;DB_CLOSE_DELAY=-1;DB_CLOSE_ON_EXIT=false'
26-Jan-2018 22:59:27 2018-01-26 22:59:27.522  INFO 15800 --- [           main] o.s.s.c.ThreadPoolTaskScheduler          : Shutting down ExecutorService 'taskScheduler'
26-Jan-2018 22:59:27 2018-01-26 22:59:27.528  INFO 15800 --- [           main] ConditionEvaluationReportLoggingListener :
26-Jan-2018 22:59:27
26-Jan-2018 22:59:27 Error starting ApplicationContext. To display the conditions report re-run your application with 'debug' enabled.
26-Jan-2018 22:59:27 2018-01-26 22:59:27.529 ERROR 15800 --- [           main] o.s.boot.SpringApplication               : Application run failed
26-Jan-2018 22:59:27
26-Jan-2018 22:59:27 org.springframework.beans.factory.BeanCreationException: Error creating bean with name 'org.springframework.boot.actuate.autoconfigure.metrics.amqp.RabbitMetricsConfiguration': Injection of autowired dependencies failed; nested exception is java.lang.NoSuchMethodError: io.micrometer.core.instrument.Tags.zip([Ljava/lang/String;)Lio/micrometer/core/instrument/Tags;
26-Jan-2018 22:59:27         at org.springframework.beans.factory.annotation.AutowiredAnnotationBeanPostProcessor.postProcessPropertyValues(AutowiredAnnotationBeanPostProcessor.java:379) ~[spring-beans-5.0.3.RELEASE.jar:5.0.3.RELEASE]
26-Jan-2018 22:59:27         at org.springframework.beans.factory.support.AbstractAutowireCapableBeanFactory.populateBean(AbstractAutowireCapableBeanFactory.java:1344) ~[spring-beans-5.0.3.RELEASE.jar:5.0.3.RELEASE]
26-Jan-2018 22:59:27         at org.springframework.beans.factory.support.AbstractAutowireCapableBeanFactory.doCreateBean(AbstractAutowireCapableBeanFactory.java:582) ~[spring-beans-5.0.3.RELEASE.jar:5.0.3.RELEASE]
26-Jan-2018 22:59:27         at org.springframework.beans.factory.support.AbstractAutowireCapableBeanFactory.createBean(AbstractAutowireCapableBeanFactory.java:502) ~[spring-beans-5.0.3.RELEASE.jar:5.0.3.RELEASE]
26-Jan-2018 22:59:27         at org.springframework.beans.factory.support.AbstractBeanFactory.lambda$doGetBean$0(AbstractBeanFactory.java:312) ~[spring-beans-5.0.3.RELEASE.jar:5.0.3.RELEASE]
26-Jan-2018 22:59:27         at org.springframework.beans.factory.support.DefaultSingletonBeanRegistry.getSingleton(DefaultSingletonBeanRegistry.java:228) ~[spring-beans-5.0.3.RELEASE.jar:5.0.3.RELEASE]
26-Jan-2018 22:59:27         at org.springframework.beans.factory.support.AbstractBeanFactory.doGetBean(AbstractBeanFactory.java:310) ~[spring-beans-5.0.3.RELEASE.jar:5.0.3.RELEASE]
26-Jan-2018 22:59:27         at org.springframework.beans.factory.support.AbstractBeanFactory.getBean(AbstractBeanFactory.java:200) ~[spring-beans-5.0.3.RELEASE.jar:5.0.3.RELEASE]
26-Jan-2018 22:59:27         at org.springframework.beans.factory.support.DefaultListableBeanFactory.preInstantiateSingletons(DefaultListableBeanFactory.java:761) ~[spring-beans-5.0.3.RELEASE.jar:5.0.3.RELEASE]
26-Jan-2018 22:59:27         at org.springframework.context.support.AbstractApplicationContext.finishBeanFactoryInitialization(AbstractApplicationContext.java:868) ~[spring-context-5.0.3.RELEASE.jar:5.0.3.RELEASE]
26-Jan-2018 22:59:27         at org.springframework.context.support.AbstractApplicationContext.refresh(AbstractApplicationContext.java:549) ~[spring-context-5.0.3.RELEASE.jar:5.0.3.RELEASE]
26-Jan-2018 22:59:27         at org.springframework.boot.SpringApplication.refresh(SpringApplication.java:752) ~[spring-boot-2.0.0.BUILD-SNAPSHOT.jar:2.0.0.BUILD-SNAPSHOT]
26-Jan-2018 22:59:27         at org.springframework.boot.SpringApplication.refreshContext(SpringApplication.java:388) ~[spring-boot-2.0.0.BUILD-SNAPSHOT.jar:2.0.0.BUILD-SNAPSHOT]
26-Jan-2018 22:59:27         at org.springframework.boot.SpringApplication.run(SpringApplication.java:327) ~[spring-boot-2.0.0.BUILD-SNAPSHOT.jar:2.0.0.BUILD-SNAPSHOT]
26-Jan-2018 22:59:27         at org.springframework.boot.test.context.SpringBootContextLoader.loadContext(SpringBootContextLoader.java:138) [spring-boot-test-2.0.0.BUILD-SNAPSHOT.jar:2.0.0.BUILD-SNAPSHOT]
26-Jan-2018 22:59:27         at org.springframework.test.context.cache.DefaultCacheAwareContextLoaderDelegate.loadContextInternal(DefaultCacheAwareContextLoaderDelegate.java:99) [spring-test-5.0.3.RELEASE.jar:5.0.3.RELEASE]
26-Jan-2018 22:59:27         at org.springframework.test.context.cache.DefaultCacheAwareContextLoaderDelegate.loadContext(DefaultCacheAwareContextLoaderDelegate.java:117) [spring-test-5.0.3.RELEASE.jar:5.0.3.RELEASE]
26-Jan-2018 22:59:27         at org.springframework.test.context.support.DefaultTestContext.getApplicationContext(DefaultTestContext.java:107) [spring-test-5.0.3.RELEASE.jar:5.0.3.RELEASE]
26-Jan-2018 22:59:27         at org.springframework.test.context.web.ServletTestExecutionListener.setUpRequestContextIfNecessary(ServletTestExecutionListener.java:190) [spring-test-5.0.3.RELEASE.jar:5.0.3.RELEASE]
26-Jan-2018 22:59:27         at org.springframework.test.context.web.ServletTestExecutionListener.prepareTestInstance(ServletTestExecutionListener.java:132) [spring-test-5.0.3.RELEASE.jar:5.0.3.RELEASE]
26-Jan-2018 22:59:27         at org.springframework.test.context.TestContextManager.prepareTestInstance(TestContextManager.java:242) [spring-test-5.0.3.RELEASE.jar:5.0.3.RELEASE]
26-Jan-2018 22:59:27         at org.springframework.test.context.junit4.SpringJUnit4ClassRunner.createTest(SpringJUnit4ClassRunner.java:227) [spring-test-5.0.3.RELEASE.jar:5.0.3.RELEASE]
26-Jan-2018 22:59:27         at org.springframework.test.context.junit4.SpringJUnit4ClassRunner$1.runReflectiveCall(SpringJUnit4ClassRunner.java:289) [spring-test-5.0.3.RELEASE.jar:5.0.3.RELEASE]
26-Jan-2018 22:59:27         at org.junit.internal.runners.model.ReflectiveCallable.run(ReflectiveCallable.java:12) [junit-4.12.jar:4.12]
26-Jan-2018 22:59:27         at org.springframework.test.context.junit4.SpringJUnit4ClassRunner.methodBlock(SpringJUnit4ClassRunner.java:291) [spring-test-5.0.3.RELEASE.jar:5.0.3.RELEASE]
26-Jan-2018 22:59:27         at org.springframework.test.context.junit4.SpringJUnit4ClassRunner.runChild(SpringJUnit4ClassRunner.java:246) [spring-test-5.0.3.RELEASE.jar:5.0.3.RELEASE]
26-Jan-2018 22:59:27         at org.springframework.test.context.junit4.SpringJUnit4ClassRunner.runChild(SpringJUnit4ClassRunner.java:97) [spring-test-5.0.3.RELEASE.jar:5.0.3.RELEASE]
26-Jan-2018 22:59:27         at org.junit.runners.ParentRunner$3.run(ParentRunner.java:290) [junit-4.12.jar:4.12]
26-Jan-2018 22:59:27         at org.junit.runners.ParentRunner$1.schedule(ParentRunner.java:71) [junit-4.12.jar:4.12]
26-Jan-2018 22:59:27         at org.junit.runners.ParentRunner.runChildren(ParentRunner.java:288) [junit-4.12.jar:4.12]
26-Jan-2018 22:59:27         at org.junit.runners.ParentRunner.access$000(ParentRunner.java:58) [junit-4.12.jar:4.12]
26-Jan-2018 22:59:27         at org.junit.runners.ParentRunner$2.evaluate(ParentRunner.java:268) [junit-4.12.jar:4.12]
26-Jan-2018 22:59:27         at org.springframework.test.context.junit4.statements.RunBeforeTestClassCallbacks.evaluate(RunBeforeTestClassCallbacks.java:61) [spring-test-5.0.3.RELEASE.jar:5.0.3.RELEASE]
26-Jan-2018 22:59:27         at org.springframework.test.context.junit4.statements.RunAfterTestClassCallbacks.evaluate(RunAfterTestClassCallbacks.java:70) [spring-test-5.0.3.RELEASE.jar:5.0.3.RELEASE]
26-Jan-2018 22:59:27         at org.junit.runners.ParentRunner.run(ParentRunner.java:363) [junit-4.12.jar:4.12]
26-Jan-2018 22:59:27         at org.springframework.test.context.junit4.SpringJUnit4ClassRunner.run(SpringJUnit4ClassRunner.java:190) [spring-test-5.0.3.RELEASE.jar:5.0.3.RELEASE]
26-Jan-2018 22:59:27         at org.apache.maven.surefire.junit4.JUnit4Provider.execute(JUnit4Provider.java:252) [surefire-junit4-2.12.4.jar:2.12.4]
26-Jan-2018 22:59:27         at org.apache.maven.surefire.junit4.JUnit4Provider.executeTestSet(JUnit4Provider.java:141) [surefire-junit4-2.12.4.jar:2.12.4]
26-Jan-2018 22:59:27         at org.apache.maven.surefire.junit4.JUnit4Provider.invoke(JUnit4Provider.java:112) [surefire-junit4-2.12.4.jar:2.12.4]
26-Jan-2018 22:59:27         at sun.reflect.NativeMethodAccessorImpl.invoke0(Native Method) ~[na:1.8.0_144]
26-Jan-2018 22:59:27         at sun.reflect.NativeMethodAccessorImpl.invoke(NativeMethodAccessorImpl.java:62) ~[na:1.8.0_144]
26-Jan-2018 22:59:27         at sun.reflect.DelegatingMethodAccessorImpl.invoke(DelegatingMethodAccessorImpl.java:43) ~[na:1.8.0_144]
26-Jan-2018 22:59:27         at java.lang.reflect.Method.invoke(Method.java:498) ~[na:1.8.0_144]
26-Jan-2018 22:59:27         at org.apache.maven.surefire.util.ReflectionUtils.invokeMethodWithArray(ReflectionUtils.java:189) [surefire-api-2.12.4.jar:2.12.4]
26-Jan-2018 22:59:27         at org.apache.maven.surefire.booter.ProviderFactory$ProviderProxy.invoke(ProviderFactory.java:165) [surefire-booter-2.12.4.jar:2.12.4]
26-Jan-2018 22:59:27         at org.apache.maven.surefire.booter.ProviderFactory.invokeProvider(ProviderFactory.java:85) [surefire-booter-2.12.4.jar:2.12.4]
26-Jan-2018 22:59:27         at org.apache.maven.surefire.booter.ForkedBooter.runSuitesInProcess(ForkedBooter.java:115) [surefire-booter-2.12.4.jar:2.12.4]
26-Jan-2018 22:59:27         at org.apache.maven.surefire.booter.ForkedBooter.main(ForkedBooter.java:75) [surefire-booter-2.12.4.jar:2.12.4]
26-Jan-2018 22:59:27 Caused by: java.lang.NoSuchMethodError: io.micrometer.core.instrument.Tags.zip([Ljava/lang/String;)Lio/micrometer/core/instrument/Tags;
26-Jan-2018 22:59:27         at org.springframework.boot.actuate.autoconfigure.metrics.amqp.RabbitMetricsConfiguration.bindConnectionFactoryToRegistry(RabbitMetricsConfiguration.java:69) ~[spring-boot-actuator-autoconfigure-2.0.0.BUILD-SNAPSHOT.jar:2.0.0.BUILD-SNAPSHOT]
26-Jan-2018 22:59:27         at java.util.LinkedHashMap.forEach(LinkedHashMap.java:684) ~[na:1.8.0_144]
26-Jan-2018 22:59:27         at org.springframework.boot.actuate.autoconfigure.metrics.amqp.RabbitMetricsConfiguration.bindConnectionFactoriesToRegistry(RabbitMetricsConfiguration.java:64) ~[spring-boot-actuator-autoconfigure-2.0.0.BUILD-SNAPSHOT.jar:2.0.0.BUILD-SNAPSHOT]
26-Jan-2018 22:59:27         at sun.reflect.NativeMethodAccessorImpl.invoke0(Native Method) ~[na:1.8.0_144]
26-Jan-2018 22:59:27         at sun.reflect.NativeMethodAccessorImpl.invoke(NativeMethodAccessorImpl.java:62) ~[na:1.8.0_144]
26-Jan-2018 22:59:27         at sun.reflect.DelegatingMethodAccessorImpl.invoke(DelegatingMethodAccessorImpl.java:43) ~[na:1.8.0_144]
26-Jan-2018 22:59:27         at java.lang.reflect.Method.invoke(Method.java:498) ~[na:1.8.0_144]
26-Jan-2018 22:59:27         at org.springframework.beans.factory.annotation.AutowiredAnnotationBeanPostProcessor$AutowiredMethodElement.inject(AutowiredAnnotationBeanPostProcessor.java:703) ~[spring-beans-5.0.3.RELEASE.jar:5.0.3.RELEASE]
26-Jan-2018 22:59:27         at org.springframework.beans.factory.annotation.InjectionMetadata.inject(InjectionMetadata.java:91) ~[spring-beans-5.0.3.RELEASE.jar:5.0.3.RELEASE]
26-Jan-2018 22:59:27         at org.springframework.beans.factory.annotation.AutowiredAnnotationBeanPostProcessor.postProcessPropertyValues(AutowiredAnnotationBeanPostProcessor.java:373) ~[spring-beans-5.0.3.RELEASE.jar:5.0.3.RELEASE]
26-Jan-2018 22:59:27         ... 47 common frames omitted
26-Jan-2018 22:59:27
26-Jan-2018 22:59:27 2018-01-26 22:59:27.531 ERROR 15800 --- [           main] o.s.test.context.TestContextManager      : Caught exception while allowing TestExecutionListener [org.springframework.test.context.web.ServletTestExecutionListener@38f1aa6f] to prepare test instance [org.springframework.cloud.task.launcher.TaskLauncherSinkTests@28c4f570]
26-Jan-2018 22:59:27
26-Jan-2018 22:59:27 java.lang.IllegalStateException: Failed to load ApplicationContext
26-Jan-2018 22:59:27         at org.springframework.test.context.cache.DefaultCacheAwareContextLoaderDelegate.loadContext(DefaultCacheAwareContextLoaderDelegate.java:125) ~[spring-test-5.0.3.RELEASE.jar:5.0.3.RELEASE]
26-Jan-2018 22:59:27         at org.springframework.test.context.support.DefaultTestContext.getApplicationContext(DefaultTestContext.java:107) ~[spring-test-5.0.3.RELEASE.jar:5.0.3.RELEASE]
26-Jan-2018 22:59:27         at org.springframework.test.context.web.ServletTestExecutionListener.setUpRequestContextIfNecessary(ServletTestExecutionListener.java:190) ~[spring-test-5.0.3.RELEASE.jar:5.0.3.RELEASE]
26-Jan-2018 22:59:27         at org.springframework.test.context.web.ServletTestExecutionListener.prepareTestInstance(ServletTestExecutionListener.java:132) ~[spring-test-5.0.3.RELEASE.jar:5.0.3.RELEASE]
26-Jan-2018 22:59:27         at org.springframework.test.context.TestContextManager.prepareTestInstance(TestContextManager.java:242) ~[spring-test-5.0.3.RELEASE.jar:5.0.3.RELEASE]
26-Jan-2018 22:59:27         at org.springframework.test.context.junit4.SpringJUnit4ClassRunner.createTest(SpringJUnit4ClassRunner.java:227) [spring-test-5.0.3.RELEASE.jar:5.0.3.RELEASE]
26-Jan-2018 22:59:27         at org.springframework.test.context.junit4.SpringJUnit4ClassRunner$1.runReflectiveCall(SpringJUnit4ClassRunner.java:289) [spring-test-5.0.3.RELEASE.jar:5.0.3.RELEASE]
26-Jan-2018 22:59:27         at org.junit.internal.runners.model.ReflectiveCallable.run(ReflectiveCallable.java:12) [junit-4.12.jar:4.12]
26-Jan-2018 22:59:27         at org.springframework.test.context.junit4.SpringJUnit4ClassRunner.methodBlock(SpringJUnit4ClassRunner.java:291) [spring-test-5.0.3.RELEASE.jar:5.0.3.RELEASE]
26-Jan-2018 22:59:27         at org.springframework.test.context.junit4.SpringJUnit4ClassRunner.runChild(SpringJUnit4ClassRunner.java:246) [spring-test-5.0.3.RELEASE.jar:5.0.3.RELEASE]
26-Jan-2018 22:59:27         at org.springframework.test.context.junit4.SpringJUnit4ClassRunner.runChild(SpringJUnit4ClassRunner.java:97) [spring-test-5.0.3.RELEASE.jar:5.0.3.RELEASE]
26-Jan-2018 22:59:27         at org.junit.runners.ParentRunner$3.run(ParentRunner.java:290) [junit-4.12.jar:4.12]
26-Jan-2018 22:59:27         at org.junit.runners.ParentRunner$1.schedule(ParentRunner.java:71) [junit-4.12.jar:4.12]
26-Jan-2018 22:59:27         at org.junit.runners.ParentRunner.runChildren(ParentRunner.java:288) [junit-4.12.jar:4.12]
26-Jan-2018 22:59:27         at org.junit.runners.ParentRunner.access$000(ParentRunner.java:58) [junit-4.12.jar:4.12]
26-Jan-2018 22:59:27         at org.junit.runners.ParentRunner$2.evaluate(ParentRunner.java:268) [junit-4.12.jar:4.12]
26-Jan-2018 22:59:27         at org.springframework.test.context.junit4.statements.RunBeforeTestClassCallbacks.evaluate(RunBeforeTestClassCallbacks.java:61) [spring-test-5.0.3.RELEASE.jar:5.0.3.RELEASE]
26-Jan-2018 22:59:27         at org.springframework.test.context.junit4.statements.RunAfterTestClassCallbacks.evaluate(RunAfterTestClassCallbacks.java:70) [spring-test-5.0.3.RELEASE.jar:5.0.3.RELEASE]
26-Jan-2018 22:59:27         at org.junit.runners.ParentRunner.run(ParentRunner.java:363) [junit-4.12.jar:4.12]
26-Jan-2018 22:59:27         at org.springframework.test.context.junit4.SpringJUnit4ClassRunner.run(SpringJUnit4ClassRunner.java:190) [spring-test-5.0.3.RELEASE.jar:5.0.3.RELEASE]
26-Jan-2018 22:59:27         at org.apache.maven.surefire.junit4.JUnit4Provider.execute(JUnit4Provider.java:252) [surefire-junit4-2.12.4.jar:2.12.4]
26-Jan-2018 22:59:27         at org.apache.maven.surefire.junit4.JUnit4Provider.executeTestSet(JUnit4Provider.java:141) [surefire-junit4-2.12.4.jar:2.12.4]
26-Jan-2018 22:59:27         at org.apache.maven.surefire.junit4.JUnit4Provider.invoke(JUnit4Provider.java:112) [surefire-junit4-2.12.4.jar:2.12.4]
26-Jan-2018 22:59:27         at sun.reflect.NativeMethodAccessorImpl.invoke0(Native Method) ~[na:1.8.0_144]
26-Jan-2018 22:59:27         at sun.reflect.NativeMethodAccessorImpl.invoke(NativeMethodAccessorImpl.java:62) ~[na:1.8.0_144]
26-Jan-2018 22:59:27         at sun.reflect.DelegatingMethodAccessorImpl.invoke(DelegatingMethodAccessorImpl.java:43) ~[na:1.8.0_144]
26-Jan-2018 22:59:27         at java.lang.reflect.Method.invoke(Method.java:498) ~[na:1.8.0_144]
26-Jan-2018 22:59:27         at org.apache.maven.surefire.util.ReflectionUtils.invokeMethodWithArray(ReflectionUtils.java:189) [surefire-api-2.12.4.jar:2.12.4]
26-Jan-2018 22:59:27         at org.apache.maven.surefire.booter.ProviderFactory$ProviderProxy.invoke(ProviderFactory.java:165) [surefire-booter-2.12.4.jar:2.12.4]
26-Jan-2018 22:59:27         at org.apache.maven.surefire.booter.ProviderFactory.invokeProvider(ProviderFactory.java:85) [surefire-booter-2.12.4.jar:2.12.4]
26-Jan-2018 22:59:27         at org.apache.maven.surefire.booter.ForkedBooter.runSuitesInProcess(ForkedBooter.java:115) [surefire-booter-2.12.4.jar:2.12.4]
26-Jan-2018 22:59:27         at org.apache.maven.surefire.booter.ForkedBooter.main(ForkedBooter.java:75) [surefire-booter-2.12.4.jar:2.12.4]
26-Jan-2018 22:59:27 Caused by: org.springframework.beans.factory.BeanCreationException: Error creating bean with name 'org.springframework.boot.actuate.autoconfigure.metrics.amqp.RabbitMetricsConfiguration': Injection of autowired dependencies failed; nested exception is java.lang.NoSuchMethodError: io.micrometer.core.instrument.Tags.zip([Ljava/lang/String;)Lio/micrometer/core/instrument/Tags;
26-Jan-2018 22:59:27         at org.springframework.beans.factory.annotation.AutowiredAnnotationBeanPostProcessor.postProcessPropertyValues(AutowiredAnnotationBeanPostProcessor.java:379) ~[spring-beans-5.0.3.RELEASE.jar:5.0.3.RELEASE]
26-Jan-2018 22:59:27         at org.springframework.beans.factory.support.AbstractAutowireCapableBeanFactory.populateBean(AbstractAutowireCapableBeanFactory.java:1344) ~[spring-beans-5.0.3.RELEASE.jar:5.0.3.RELEASE]
26-Jan-2018 22:59:27         at org.springframework.beans.factory.support.AbstractAutowireCapableBeanFactory.doCreateBean(AbstractAutowireCapableBeanFactory.java:582) ~[spring-beans-5.0.3.RELEASE.jar:5.0.3.RELEASE]
26-Jan-2018 22:59:27         at org.springframework.beans.factory.support.AbstractAutowireCapableBeanFactory.createBean(AbstractAutowireCapableBeanFactory.java:502) ~[spring-beans-5.0.3.RELEASE.jar:5.0.3.RELEASE]
26-Jan-2018 22:59:27         at org.springframework.beans.factory.support.AbstractBeanFactory.lambda$doGetBean$0(AbstractBeanFactory.java:312) ~[spring-beans-5.0.3.RELEASE.jar:5.0.3.RELEASE]
26-Jan-2018 22:59:27         at org.springframework.beans.factory.support.DefaultSingletonBeanRegistry.getSingleton(DefaultSingletonBeanRegistry.java:228) ~[spring-beans-5.0.3.RELEASE.jar:5.0.3.RELEASE]
26-Jan-2018 22:59:27         at org.springframework.beans.factory.support.AbstractBeanFactory.doGetBean(AbstractBeanFactory.java:310) ~[spring-beans-5.0.3.RELEASE.jar:5.0.3.RELEASE]
26-Jan-2018 22:59:27         at org.springframework.beans.factory.support.AbstractBeanFactory.getBean(AbstractBeanFactory.java:200) ~[spring-beans-5.0.3.RELEASE.jar:5.0.3.RELEASE]
26-Jan-2018 22:59:27         at org.springframework.beans.factory.support.DefaultListableBeanFactory.preInstantiateSingletons(DefaultListableBeanFactory.java:761) ~[spring-beans-5.0.3.RELEASE.jar:5.0.3.RELEASE]
26-Jan-2018 22:59:27         at org.springframework.context.support.AbstractApplicationContext.finishBeanFactoryInitialization(AbstractApplicationContext.java:868) ~[spring-context-5.0.3.RELEASE.jar:5.0.3.RELEASE]
26-Jan-2018 22:59:27         at org.springframework.context.support.AbstractApplicationContext.refresh(AbstractApplicationContext.java:549) ~[spring-context-5.0.3.RELEASE.jar:5.0.3.RELEASE]
26-Jan-2018 22:59:27         at org.springframework.boot.SpringApplication.refresh(SpringApplication.java:752) ~[spring-boot-2.0.0.BUILD-SNAPSHOT.jar:2.0.0.BUILD-SNAPSHOT]
26-Jan-2018 22:59:27         at org.springframework.boot.SpringApplication.refreshContext(SpringApplication.java:388) ~[spring-boot-2.0.0.BUILD-SNAPSHOT.jar:2.0.0.BUILD-SNAPSHOT]
26-Jan-2018 22:59:27         at org.springframework.boot.SpringApplication.run(SpringApplication.java:327) ~[spring-boot-2.0.0.BUILD-SNAPSHOT.jar:2.0.0.BUILD-SNAPSHOT]
26-Jan-2018 22:59:27         at org.springframework.boot.test.context.SpringBootContextLoader.loadContext(SpringBootContextLoader.java:138) ~[spring-boot-test-2.0.0.BUILD-SNAPSHOT.jar:2.0.0.BUILD-SNAPSHOT]
26-Jan-2018 22:59:27         at org.springframework.test.context.cache.DefaultCacheAwareContextLoaderDelegate.loadContextInternal(DefaultCacheAwareContextLoaderDelegate.java:99) ~[spring-test-5.0.3.RELEASE.jar:5.0.3.RELEASE]
26-Jan-2018 22:59:27         at org.springframework.test.context.cache.DefaultCacheAwareContextLoaderDelegate.loadContext(DefaultCacheAwareContextLoaderDelegate.java:117) ~[spring-test-5.0.3.RELEASE.jar:5.0.3.RELEASE]
26-Jan-2018 22:59:27         ... 31 common frames omitted
26-Jan-2018 22:59:27 Caused by: java.lang.NoSuchMethodError: io.micrometer.core.instrument.Tags.zip([Ljava/lang/String;)Lio/micrometer/core/instrument/Tags;
26-Jan-2018 22:59:27         at org.springframework.boot.actuate.autoconfigure.metrics.amqp.RabbitMetricsConfiguration.bindConnectionFactoryToRegistry(RabbitMetricsConfiguration.java:69) ~[spring-boot-actuator-autoconfigure-2.0.0.BUILD-SNAPSHOT.jar:2.0.0.BUILD-SNAPSHOT]
26-Jan-2018 22:59:27         at java.util.LinkedHashMap.forEach(LinkedHashMap.java:684) ~[na:1.8.0_144]
26-Jan-2018 22:59:27         at org.springframework.boot.actuate.autoconfigure.metrics.amqp.RabbitMetricsConfiguration.bindConnectionFactoriesToRegistry(RabbitMetricsConfiguration.java:64) ~[spring-boot-actuator-autoconfigure-2.0.0.BUILD-SNAPSHOT.jar:2.0.0.BUILD-SNAPSHOT]
26-Jan-2018 22:59:27         at sun.reflect.NativeMethodAccessorImpl.invoke0(Native Method) ~[na:1.8.0_144]
26-Jan-2018 22:59:27         at sun.reflect.NativeMethodAccessorImpl.invoke(NativeMethodAccessorImpl.java:62) ~[na:1.8.0_144]
26-Jan-2018 22:59:27         at sun.reflect.DelegatingMethodAccessorImpl.invoke(DelegatingMethodAccessorImpl.java:43) ~[na:1.8.0_144]
26-Jan-2018 22:59:27         at java.lang.reflect.Method.invoke(Method.java:498) ~[na:1.8.0_144]
26-Jan-2018 22:59:27         at org.springframework.beans.factory.annotation.AutowiredAnnotationBeanPostProcessor$AutowiredMethodElement.inject(AutowiredAnnotationBeanPostProcessor.java:703) ~[spring-beans-5.0.3.RELEASE.jar:5.0.3.RELEASE]
26-Jan-2018 22:59:27         at org.springframework.beans.factory.annotation.InjectionMetadata.inject(InjectionMetadata.java:91) ~[spring-beans-5.0.3.RELEASE.jar:5.0.3.RELEASE]
26-Jan-2018 22:59:27         at org.springframework.beans.factory.annotation.AutowiredAnnotationBeanPostProcessor.postProcessPropertyValues(AutowiredAnnotationBeanPostProcessor.java:373) ~[spring-beans-5.0.3.RELEASE.jar:5.0.3.RELEASE]
26-Jan-2018 22:59:27         ... 47 common frames omitted
26-Jan-2018 22:59:27
26-Jan-2018 22:59:27 Tests run: 6, Failures: 0, Errors: 6, Skipped: 0, Time elapsed: 12.025 sec <<< FAILURE!
26-Jan-2018 22:59:27 testNoTaskLauncher(org.springframework.cloud.task.launcher.TaskLauncherSinkTests)  Time elapsed: 0.001 sec  <<< ERROR!
26-Jan-2018 22:59:27 java.lang.IllegalStateException: Failed to load ApplicationContext
26-Jan-2018 22:59:27         at org.springframework.test.context.cache.DefaultCacheAwareContextLoaderDelegate.loadContext(DefaultCacheAwareContextLoaderDelegate.java:125)
26-Jan-2018 22:59:27         at org.springframework.test.context.support.DefaultTestContext.getApplicationContext(DefaultTestContext.java:107)
26-Jan-2018 22:59:27         at org.springframework.test.context.web.ServletTestExecutionListener.setUpRequestContextIfNecessary(ServletTestExecutionListener.java:190)
26-Jan-2018 22:59:27         at org.springframework.test.context.web.ServletTestExecutionListener.prepareTestInstance(ServletTestExecutionListener.java:132)
26-Jan-2018 22:59:27         at org.springframework.test.context.TestContextManager.prepareTestInstance(TestContextManager.java:242)
26-Jan-2018 22:59:27         at org.springframework.test.context.junit4.SpringJUnit4ClassRunner.createTest(SpringJUnit4ClassRunner.java:227)
26-Jan-2018 22:59:27         at org.springframework.test.context.junit4.SpringJUnit4ClassRunner$1.runReflectiveCall(SpringJUnit4ClassRunner.java:289)
26-Jan-2018 22:59:27         at org.junit.internal.runners.model.ReflectiveCallable.run(ReflectiveCallable.java:12)
26-Jan-2018 22:59:27         at org.springframework.test.context.junit4.SpringJUnit4ClassRunner.methodBlock(SpringJUnit4ClassRunner.java:291)
26-Jan-2018 22:59:27         at org.springframework.test.context.junit4.SpringJUnit4ClassRunner.runChild(SpringJUnit4ClassRunner.java:246)
26-Jan-2018 22:59:27         at org.springframework.test.context.junit4.SpringJUnit4ClassRunner.runChild(SpringJUnit4ClassRunner.java:97)
26-Jan-2018 22:59:27         at org.junit.runners.ParentRunner$3.run(ParentRunner.java:290)
26-Jan-2018 22:59:27         at org.junit.runners.ParentRunner$1.schedule(ParentRunner.java:71)
26-Jan-2018 22:59:27         at org.junit.runners.ParentRunner.runChildren(ParentRunner.java:288)
26-Jan-2018 22:59:27         at org.junit.runners.ParentRunner.access$000(ParentRunner.java:58)
26-Jan-2018 22:59:27         at org.junit.runners.ParentRunner$2.evaluate(ParentRunner.java:268)
26-Jan-2018 22:59:27         at org.springframework.test.context.junit4.statements.RunBeforeTestClassCallbacks.evaluate(RunBeforeTestClassCallbacks.java:61)
26-Jan-2018 22:59:27         at org.springframework.test.context.junit4.statements.RunAfterTestClassCallbacks.evaluate(RunAfterTestClassCallbacks.java:70)
26-Jan-2018 22:59:27         at org.junit.runners.ParentRunner.run(ParentRunner.java:363)
26-Jan-2018 22:59:27         at org.springframework.test.context.junit4.SpringJUnit4ClassRunner.run(SpringJUnit4ClassRunner.java:190)
26-Jan-2018 22:59:27         at org.apache.maven.surefire.junit4.JUnit4Provider.execute(JUnit4Provider.java:252)
26-Jan-2018 22:59:27         at org.apache.maven.surefire.junit4.JUnit4Provider.executeTestSet(JUnit4Provider.java:141)
26-Jan-2018 22:59:27         at org.apache.maven.surefire.junit4.JUnit4Provider.invoke(JUnit4Provider.java:112)
26-Jan-2018 22:59:27         at sun.reflect.NativeMethodAccessorImpl.invoke0(Native Method)
26-Jan-2018 22:59:27         at sun.reflect.NativeMethodAccessorImpl.invoke(NativeMethodAccessorImpl.java:62)
26-Jan-2018 22:59:27         at sun.reflect.DelegatingMethodAccessorImpl.invoke(DelegatingMethodAccessorImpl.java:43)
26-Jan-2018 22:59:27         at java.lang.reflect.Method.invoke(Method.java:498)
26-Jan-2018 22:59:27         at org.apache.maven.surefire.util.ReflectionUtils.invokeMethodWithArray(ReflectionUtils.java:189)
26-Jan-2018 22:59:27         at org.apache.maven.surefire.booter.ProviderFactory$ProviderProxy.invoke(ProviderFactory.java:165)
26-Jan-2018 22:59:27         at org.apache.maven.surefire.booter.ProviderFactory.invokeProvider(ProviderFactory.java:85)
26-Jan-2018 22:59:27         at org.apache.maven.surefire.booter.ForkedBooter.runSuitesInProcess(ForkedBooter.java:115)
26-Jan-2018 22:59:27         at org.apache.maven.surefire.booter.ForkedBooter.main(ForkedBooter.java:75)
26-Jan-2018 22:59:27 Caused by: org.springframework.beans.factory.BeanCreationException: Error creating bean with name 'org.springframework.boot.actuate.autoconfigure.metrics.amqp.RabbitMetricsConfiguration': Injection of autowired dependencies failed; nested exception is java.lang.NoSuchMethodError: io.micrometer.core.instrument.Tags.zip([Ljava/lang/String;)Lio/micrometer/core/instrument/Tags;
26-Jan-2018 22:59:27         at org.springframework.beans.factory.annotation.AutowiredAnnotationBeanPostProcessor.postProcessPropertyValues(AutowiredAnnotationBeanPostProcessor.java:379)
26-Jan-2018 22:59:27         at org.springframework.beans.factory.support.AbstractAutowireCapableBeanFactory.populateBean(AbstractAutowireCapableBeanFactory.java:1344)
26-Jan-2018 22:59:27         at org.springframework.beans.factory.support.AbstractAutowireCapableBeanFactory.doCreateBean(AbstractAutowireCapableBeanFactory.java:582)
26-Jan-2018 22:59:27         at org.springframework.beans.factory.support.AbstractAutowireCapableBeanFactory.createBean(AbstractAutowireCapableBeanFactory.java:502)
26-Jan-2018 22:59:27         at org.springframework.beans.factory.support.AbstractBeanFactory.lambda$doGetBean$0(AbstractBeanFactory.java:312)
26-Jan-2018 22:59:27         at org.springframework.beans.factory.support.DefaultSingletonBeanRegistry.getSingleton(DefaultSingletonBeanRegistry.java:228)
26-Jan-2018 22:59:27         at org.springframework.beans.factory.support.AbstractBeanFactory.doGetBean(AbstractBeanFactory.java:310)
26-Jan-2018 22:59:27         at org.springframework.beans.factory.support.AbstractBeanFactory.getBean(AbstractBeanFactory.java:200)
26-Jan-2018 22:59:27         at org.springframework.beans.factory.support.DefaultListableBeanFactory.preInstantiateSingletons(DefaultListableBeanFactory.java:761)
26-Jan-2018 22:59:27         at org.springframework.context.support.AbstractApplicationContext.finishBeanFactoryInitialization(AbstractApplicationContext.java:868)
26-Jan-2018 22:59:27         at org.springframework.context.support.AbstractApplicationContext.refresh(AbstractApplicationContext.java:549)
26-Jan-2018 22:59:27         at org.springframework.boot.SpringApplication.refresh(SpringApplication.java:752)
26-Jan-2018 22:59:27         at org.springframework.boot.SpringApplication.refreshContext(SpringApplication.java:388)
26-Jan-2018 22:59:27         at org.springframework.boot.SpringApplication.run(SpringApplication.java:327)
26-Jan-2018 22:59:27         at org.springframework.boot.test.context.SpringBootContextLoader.loadContext(SpringBootContextLoader.java:138)
26-Jan-2018 22:59:27         at org.springframework.test.context.cache.DefaultCacheAwareContextLoaderDelegate.loadContextInternal(DefaultCacheAwareContextLoaderDelegate.java:99)
26-Jan-2018 22:59:27         at org.springframework.test.context.cache.DefaultCacheAwareContextLoaderDelegate.loadContext(DefaultCacheAwareContextLoaderDelegate.java:117)
26-Jan-2018 22:59:27         ... 31 more
26-Jan-2018 22:59:27 Caused by: java.lang.NoSuchMethodError: io.micrometer.core.instrument.Tags.zip([Ljava/lang/String;)Lio/micrometer/core/instrument/Tags;
26-Jan-2018 22:59:27         at org.springframework.boot.actuate.autoconfigure.metrics.amqp.RabbitMetricsConfiguration.bindConnectionFactoryToRegistry(RabbitMetricsConfiguration.java:69)
26-Jan-2018 22:59:27         at java.util.LinkedHashMap.forEach(LinkedHashMap.java:684)
26-Jan-2018 22:59:27         at org.springframework.boot.actuate.autoconfigure.metrics.amqp.RabbitMetricsConfiguration.bindConnectionFactoriesToRegistry(RabbitMetricsConfiguration.java:64)
26-Jan-2018 22:59:27         at sun.reflect.NativeMethodAccessorImpl.invoke0(Native Method)
26-Jan-2018 22:59:27         at sun.reflect.NativeMethodAccessorImpl.invoke(NativeMethodAccessorImpl.java:62)
26-Jan-2018 22:59:27         at sun.reflect.DelegatingMethodAccessorImpl.invoke(DelegatingMethodAccessorImpl.java:43)
26-Jan-2018 22:59:27         at java.lang.reflect.Method.invoke(Method.java:498)
26-Jan-2018 22:59:27         at org.springframework.beans.factory.annotation.AutowiredAnnotationBeanPostProcessor$AutowiredMethodElement.inject(AutowiredAnnotationBeanPostProcessor.java:703)
26-Jan-2018 22:59:27         at org.springframework.beans.factory.annotation.InjectionMetadata.inject(InjectionMetadata.java:91)
26-Jan-2018 22:59:27         at org.springframework.beans.factory.annotation.AutowiredAnnotationBeanPostProcessor.postProcessPropertyValues(AutowiredAnnotationBeanPostProcessor.java:373)
26-Jan-2018 22:59:27         ... 47 more
26-Jan-2018 22:59:27
26-Jan-2018 22:59:27 testNoRun(org.springframework.cloud.task.launcher.TaskLauncherSinkTests)  Time elapsed: 0.001 sec  <<< ERROR!
26-Jan-2018 22:59:27 java.lang.IllegalStateException: Failed to load ApplicationContext
26-Jan-2018 22:59:27         at org.springframework.test.context.cache.DefaultCacheAwareContextLoaderDelegate.loadContext(DefaultCacheAwareContextLoaderDelegate.java:125)
26-Jan-2018 22:59:27         at org.springframework.test.context.support.DefaultTestContext.getApplicationContext(DefaultTestContext.java:107)
26-Jan-2018 22:59:27         at org.springframework.test.context.web.ServletTestExecutionListener.setUpRequestContextIfNecessary(ServletTestExecutionListener.java:190)
26-Jan-2018 22:59:27         at org.springframework.test.context.web.ServletTestExecutionListener.prepareTestInstance(ServletTestExecutionListener.java:132)
26-Jan-2018 22:59:27         at org.springframework.test.context.TestContextManager.prepareTestInstance(TestContextManager.java:242)
26-Jan-2018 22:59:27         at org.springframework.test.context.junit4.SpringJUnit4ClassRunner.createTest(SpringJUnit4ClassRunner.java:227)
26-Jan-2018 22:59:27         at org.springframework.test.context.junit4.SpringJUnit4ClassRunner$1.runReflectiveCall(SpringJUnit4ClassRunner.java:289)
26-Jan-2018 22:59:27         at org.junit.internal.runners.model.ReflectiveCallable.run(ReflectiveCallable.java:12)
26-Jan-2018 22:59:27         at org.springframework.test.context.junit4.SpringJUnit4ClassRunner.methodBlock(SpringJUnit4ClassRunner.java:291)
26-Jan-2018 22:59:27         at org.springframework.test.context.junit4.SpringJUnit4ClassRunner.runChild(SpringJUnit4ClassRunner.java:246)
26-Jan-2018 22:59:27         at org.springframework.test.context.junit4.SpringJUnit4ClassRunner.runChild(SpringJUnit4ClassRunner.java:97)
26-Jan-2018 22:59:27         at org.junit.runners.ParentRunner$3.run(ParentRunner.java:290)
26-Jan-2018 22:59:27         at org.junit.runners.ParentRunner$1.schedule(ParentRunner.java:71)
26-Jan-2018 22:59:27         at org.junit.runners.ParentRunner.runChildren(ParentRunner.java:288)
26-Jan-2018 22:59:27         at org.junit.runners.ParentRunner.access$000(ParentRunner.java:58)
26-Jan-2018 22:59:27         at org.junit.runners.ParentRunner$2.evaluate(ParentRunner.java:268)
26-Jan-2018 22:59:27         at org.springframework.test.context.junit4.statements.RunBeforeTestClassCallbacks.evaluate(RunBeforeTestClassCallbacks.java:61)
26-Jan-2018 22:59:27         at org.springframework.test.context.junit4.statements.RunAfterTestClassCallbacks.evaluate(RunAfterTestClassCallbacks.java:70)
26-Jan-2018 22:59:27         at org.junit.runners.ParentRunner.run(ParentRunner.java:363)
26-Jan-2018 22:59:27         at org.springframework.test.context.junit4.SpringJUnit4ClassRunner.run(SpringJUnit4ClassRunner.java:190)
26-Jan-2018 22:59:27         at org.apache.maven.surefire.junit4.JUnit4Provider.execute(JUnit4Provider.java:252)
26-Jan-2018 22:59:27         at org.apache.maven.surefire.junit4.JUnit4Provider.executeTestSet(JUnit4Provider.java:141)
26-Jan-2018 22:59:27         at org.apache.maven.surefire.junit4.JUnit4Provider.invoke(JUnit4Provider.java:112)
26-Jan-2018 22:59:27         at sun.reflect.NativeMethodAccessorImpl.invoke0(Native Method)
26-Jan-2018 22:59:27         at sun.reflect.NativeMethodAccessorImpl.invoke(NativeMethodAccessorImpl.java:62)
26-Jan-2018 22:59:27         at sun.reflect.DelegatingMethodAccessorImpl.invoke(DelegatingMethodAccessorImpl.java:43)
26-Jan-2018 22:59:27         at java.lang.reflect.Method.invoke(Method.java:498)
26-Jan-2018 22:59:27         at org.apache.maven.surefire.util.ReflectionUtils.invokeMethodWithArray(ReflectionUtils.java:189)
26-Jan-2018 22:59:27         at org.apache.maven.surefire.booter.ProviderFactory$ProviderProxy.invoke(ProviderFactory.java:165)
26-Jan-2018 22:59:27         at org.apache.maven.surefire.booter.ProviderFactory.invokeProvider(ProviderFactory.java:85)
26-Jan-2018 22:59:27         at org.apache.maven.surefire.booter.ForkedBooter.runSuitesInProcess(ForkedBooter.java:115)
26-Jan-2018 22:59:27         at org.apache.maven.surefire.booter.ForkedBooter.main(ForkedBooter.java:75)
26-Jan-2018 22:59:27 Caused by: org.springframework.beans.factory.BeanCreationException: Error creating bean with name 'org.springframework.boot.actuate.autoconfigure.metrics.amqp.RabbitMetricsConfiguration': Injection of autowired dependencies failed; nested exception is java.lang.NoSuchMethodError: io.micrometer.core.instrument.Tags.zip([Ljava/lang/String;)Lio/micrometer/core/instrument/Tags;
26-Jan-2018 22:59:27         at org.springframework.beans.factory.annotation.AutowiredAnnotationBeanPostProcessor.postProcessPropertyValues(AutowiredAnnotationBeanPostProcessor.java:379)
26-Jan-2018 22:59:27         at org.springframework.beans.factory.support.AbstractAutowireCapableBeanFactory.populateBean(AbstractAutowireCapableBeanFactory.java:1344)
26-Jan-2018 22:59:27         at org.springframework.beans.factory.support.AbstractAutowireCapableBeanFactory.doCreateBean(AbstractAutowireCapableBeanFactory.java:582)
26-Jan-2018 22:59:27         at org.springframework.beans.factory.support.AbstractAutowireCapableBeanFactory.createBean(AbstractAutowireCapableBeanFactory.java:502)
26-Jan-2018 22:59:27         at org.springframework.beans.factory.support.AbstractBeanFactory.lambda$doGetBean$0(AbstractBeanFactory.java:312)
26-Jan-2018 22:59:27         at org.springframework.beans.factory.support.DefaultSingletonBeanRegistry.getSingleton(DefaultSingletonBeanRegistry.java:228)
26-Jan-2018 22:59:27         at org.springframework.beans.factory.support.AbstractBeanFactory.doGetBean(AbstractBeanFactory.java:310)
26-Jan-2018 22:59:27         at org.springframework.beans.factory.support.AbstractBeanFactory.getBean(AbstractBeanFactory.java:200)
26-Jan-2018 22:59:27         at org.springframework.beans.factory.support.DefaultListableBeanFactory.preInstantiateSingletons(DefaultListableBeanFactory.java:761)
26-Jan-2018 22:59:27         at org.springframework.context.support.AbstractApplicationContext.finishBeanFactoryInitialization(AbstractApplicationContext.java:868)
26-Jan-2018 22:59:27         at org.springframework.context.support.AbstractApplicationContext.refresh(AbstractApplicationContext.java:549)
26-Jan-2018 22:59:27         at org.springframework.boot.SpringApplication.refresh(SpringApplication.java:752)
26-Jan-2018 22:59:27         at org.springframework.boot.SpringApplication.refreshContext(SpringApplication.java:388)
26-Jan-2018 22:59:27         at org.springframework.boot.SpringApplication.run(SpringApplication.java:327)
26-Jan-2018 22:59:27         at org.springframework.boot.test.context.SpringBootContextLoader.loadContext(SpringBootContextLoader.java:138)
26-Jan-2018 22:59:27         at org.springframework.test.context.cache.DefaultCacheAwareContextLoaderDelegate.loadContextInternal(DefaultCacheAwareContextLoaderDelegate.java:99)
26-Jan-2018 22:59:27         at org.springframework.test.context.cache.DefaultCacheAwareContextLoaderDelegate.loadContext(DefaultCacheAwareContextLoaderDelegate.java:117)
26-Jan-2018 22:59:27         ... 31 more
26-Jan-2018 22:59:27 Caused by: java.lang.NoSuchMethodError: io.micrometer.core.instrument.Tags.zip([Ljava/lang/String;)Lio/micrometer/core/instrument/Tags;
26-Jan-2018 22:59:27         at org.springframework.boot.actuate.autoconfigure.metrics.amqp.RabbitMetricsConfiguration.bindConnectionFactoryToRegistry(RabbitMetricsConfiguration.java:69)
26-Jan-2018 22:59:27         at java.util.LinkedHashMap.forEach(LinkedHashMap.java:684)
26-Jan-2018 22:59:27         at org.springframework.boot.actuate.autoconfigure.metrics.amqp.RabbitMetricsConfiguration.bindConnectionFactoriesToRegistry(RabbitMetricsConfiguration.java:64)
26-Jan-2018 22:59:27         at sun.reflect.NativeMethodAccessorImpl.invoke0(Native Method)
26-Jan-2018 22:59:27         at sun.reflect.NativeMethodAccessorImpl.invoke(NativeMethodAccessorImpl.java:62)
26-Jan-2018 22:59:27         at sun.reflect.DelegatingMethodAccessorImpl.invoke(DelegatingMethodAccessorImpl.java:43)
26-Jan-2018 22:59:27         at java.lang.reflect.Method.invoke(Method.java:498)
26-Jan-2018 22:59:27         at org.springframework.beans.factory.annotation.AutowiredAnnotationBeanPostProcessor$AutowiredMethodElement.inject(AutowiredAnnotationBeanPostProcessor.java:703)
26-Jan-2018 22:59:27         at org.springframework.beans.factory.annotation.InjectionMetadata.inject(InjectionMetadata.java:91)
26-Jan-2018 22:59:27         at org.springframework.beans.factory.annotation.AutowiredAnnotationBeanPostProcessor.postProcessPropertyValues(AutowiredAnnotationBeanPostProcessor.java:373)
26-Jan-2018 22:59:27         ... 47 more
26-Jan-2018 22:59:27
26-Jan-2018 22:59:27 testSuccessWithAppName(org.springframework.cloud.task.launcher.TaskLauncherSinkTests)  Time elapsed: 0.001 sec  <<< ERROR!
26-Jan-2018 22:59:27 java.lang.IllegalStateException: Failed to load ApplicationContext
26-Jan-2018 22:59:27         at org.springframework.test.context.cache.DefaultCacheAwareContextLoaderDelegate.loadContext(DefaultCacheAwareContextLoaderDelegate.java:125)
26-Jan-2018 22:59:27         at org.springframework.test.context.support.DefaultTestContext.getApplicationContext(DefaultTestContext.java:107)
26-Jan-2018 22:59:27         at org.springframework.test.context.web.ServletTestExecutionListener.setUpRequestContextIfNecessary(ServletTestExecutionListener.java:190)
26-Jan-2018 22:59:27         at org.springframework.test.context.web.ServletTestExecutionListener.prepareTestInstance(ServletTestExecutionListener.java:132)
26-Jan-2018 22:59:27         at org.springframework.test.context.TestContextManager.prepareTestInstance(TestContextManager.java:242)
26-Jan-2018 22:59:27         at org.springframework.test.context.junit4.SpringJUnit4ClassRunner.createTest(SpringJUnit4ClassRunner.java:227)
26-Jan-2018 22:59:27         at org.springframework.test.context.junit4.SpringJUnit4ClassRunner$1.runReflectiveCall(SpringJUnit4ClassRunner.java:289)
26-Jan-2018 22:59:27         at org.junit.internal.runners.model.ReflectiveCallable.run(ReflectiveCallable.java:12)
26-Jan-2018 22:59:27         at org.springframework.test.context.junit4.SpringJUnit4ClassRunner.methodBlock(SpringJUnit4ClassRunner.java:291)
26-Jan-2018 22:59:27         at org.springframework.test.context.junit4.SpringJUnit4ClassRunner.runChild(SpringJUnit4ClassRunner.java:246)
26-Jan-2018 22:59:27         at org.springframework.test.context.junit4.SpringJUnit4ClassRunner.runChild(SpringJUnit4ClassRunner.java:97)
26-Jan-2018 22:59:27         at org.junit.runners.ParentRunner$3.run(ParentRunner.java:290)
26-Jan-2018 22:59:27         at org.junit.runners.ParentRunner$1.schedule(ParentRunner.java:71)
26-Jan-2018 22:59:27         at org.junit.runners.ParentRunner.runChildren(ParentRunner.java:288)
26-Jan-2018 22:59:27         at org.junit.runners.ParentRunner.access$000(ParentRunner.java:58)
26-Jan-2018 22:59:27         at org.junit.runners.ParentRunner$2.evaluate(ParentRunner.java:268)
26-Jan-2018 22:59:27         at org.springframework.test.context.junit4.statements.RunBeforeTestClassCallbacks.evaluate(RunBeforeTestClassCallbacks.java:61)
26-Jan-2018 22:59:27         at org.springframework.test.context.junit4.statements.RunAfterTestClassCallbacks.evaluate(RunAfterTestClassCallbacks.java:70)
26-Jan-2018 22:59:27         at org.junit.runners.ParentRunner.run(ParentRunner.java:363)
26-Jan-2018 22:59:27         at org.springframework.test.context.junit4.SpringJUnit4ClassRunner.run(SpringJUnit4ClassRunner.java:190)
26-Jan-2018 22:59:27         at org.apache.maven.surefire.junit4.JUnit4Provider.execute(JUnit4Provider.java:252)
26-Jan-2018 22:59:27         at org.apache.maven.surefire.junit4.JUnit4Provider.executeTestSet(JUnit4Provider.java:141)
26-Jan-2018 22:59:27         at org.apache.maven.surefire.junit4.JUnit4Provider.invoke(JUnit4Provider.java:112)
26-Jan-2018 22:59:27         at sun.reflect.NativeMethodAccessorImpl.invoke0(Native Method)
26-Jan-2018 22:59:27         at sun.reflect.NativeMethodAccessorImpl.invoke(NativeMethodAccessorImpl.java:62)
26-Jan-2018 22:59:27         at sun.reflect.DelegatingMethodAccessorImpl.invoke(DelegatingMethodAccessorImpl.java:43)
26-Jan-2018 22:59:27         at java.lang.reflect.Method.invoke(Method.java:498)
26-Jan-2018 22:59:27         at org.apache.maven.surefire.util.ReflectionUtils.invokeMethodWithArray(ReflectionUtils.java:189)
26-Jan-2018 22:59:27         at org.apache.maven.surefire.booter.ProviderFactory$ProviderProxy.invoke(ProviderFactory.java:165)
26-Jan-2018 22:59:27         at org.apache.maven.surefire.booter.ProviderFactory.invokeProvider(ProviderFactory.java:85)
26-Jan-2018 22:59:27         at org.apache.maven.surefire.booter.ForkedBooter.runSuitesInProcess(ForkedBooter.java:115)
26-Jan-2018 22:59:27         at org.apache.maven.surefire.booter.ForkedBooter.main(ForkedBooter.java:75)
26-Jan-2018 22:59:27 Caused by: org.springframework.beans.factory.BeanCreationException: Error creating bean with name 'org.springframework.boot.actuate.autoconfigure.metrics.amqp.RabbitMetricsConfiguration': Injection of autowired dependencies failed; nested exception is java.lang.NoSuchMethodError: io.micrometer.core.instrument.Tags.zip([Ljava/lang/String;)Lio/micrometer/core/instrument/Tags;
26-Jan-2018 22:59:27         at org.springframework.beans.factory.annotation.AutowiredAnnotationBeanPostProcessor.postProcessPropertyValues(AutowiredAnnotationBeanPostProcessor.java:379)
26-Jan-2018 22:59:27         at org.springframework.beans.factory.support.AbstractAutowireCapableBeanFactory.populateBean(AbstractAutowireCapableBeanFactory.java:1344)
26-Jan-2018 22:59:27         at org.springframework.beans.factory.support.AbstractAutowireCapableBeanFactory.doCreateBean(AbstractAutowireCapableBeanFactory.java:582)
26-Jan-2018 22:59:27         at org.springframework.beans.factory.support.AbstractAutowireCapableBeanFactory.createBean(AbstractAutowireCapableBeanFactory.java:502)
26-Jan-2018 22:59:27         at org.springframework.beans.factory.support.AbstractBeanFactory.lambda$doGetBean$0(AbstractBeanFactory.java:312)
26-Jan-2018 22:59:27         at org.springframework.beans.factory.support.DefaultSingletonBeanRegistry.getSingleton(DefaultSingletonBeanRegistry.java:228)
26-Jan-2018 22:59:27         at org.springframework.beans.factory.support.AbstractBeanFactory.doGetBean(AbstractBeanFactory.java:310)
26-Jan-2018 22:59:27         at org.springframework.beans.factory.support.AbstractBeanFactory.getBean(AbstractBeanFactory.java:200)
26-Jan-2018 22:59:27         at org.springframework.beans.factory.support.DefaultListableBeanFactory.preInstantiateSingletons(DefaultListableBeanFactory.java:761)
26-Jan-2018 22:59:27         at org.springframework.context.support.AbstractApplicationContext.finishBeanFactoryInitialization(AbstractApplicationContext.java:868)
26-Jan-2018 22:59:27         at org.springframework.context.support.AbstractApplicationContext.refresh(AbstractApplicationContext.java:549)
26-Jan-2018 22:59:27         at org.springframework.boot.SpringApplication.refresh(SpringApplication.java:752)
26-Jan-2018 22:59:27         at org.springframework.boot.SpringApplication.refreshContext(SpringApplication.java:388)
26-Jan-2018 22:59:27         at org.springframework.boot.SpringApplication.run(SpringApplication.java:327)
26-Jan-2018 22:59:27         at org.springframework.boot.test.context.SpringBootContextLoader.loadContext(SpringBootContextLoader.java:138)
26-Jan-2018 22:59:27         at org.springframework.test.context.cache.DefaultCacheAwareContextLoaderDelegate.loadContextInternal(DefaultCacheAwareContextLoaderDelegate.java:99)
26-Jan-2018 22:59:27         at org.springframework.test.context.cache.DefaultCacheAwareContextLoaderDelegate.loadContext(DefaultCacheAwareContextLoaderDelegate.java:117)
26-Jan-2018 22:59:27         ... 31 more
26-Jan-2018 22:59:27 Caused by: java.lang.NoSuchMethodError: io.micrometer.core.instrument.Tags.zip([Ljava/lang/String;)Lio/micrometer/core/instrument/Tags;
26-Jan-2018 22:59:27         at org.springframework.boot.actuate.autoconfigure.metrics.amqp.RabbitMetricsConfiguration.bindConnectionFactoryToRegistry(RabbitMetricsConfiguration.java:69)
26-Jan-2018 22:59:27         at java.util.LinkedHashMap.forEach(LinkedHashMap.java:684)
26-Jan-2018 22:59:27         at org.springframework.boot.actuate.autoconfigure.metrics.amqp.RabbitMetricsConfiguration.bindConnectionFactoriesToRegistry(RabbitMetricsConfiguration.java:64)
26-Jan-2018 22:59:27         at sun.reflect.NativeMethodAccessorImpl.invoke0(Native Method)
26-Jan-2018 22:59:27         at sun.reflect.NativeMethodAccessorImpl.invoke(NativeMethodAccessorImpl.java:62)
26-Jan-2018 22:59:27         at sun.reflect.DelegatingMethodAccessorImpl.invoke(DelegatingMethodAccessorImpl.java:43)
26-Jan-2018 22:59:27         at java.lang.reflect.Method.invoke(Method.java:498)
26-Jan-2018 22:59:27         at org.springframework.beans.factory.annotation.AutowiredAnnotationBeanPostProcessor$AutowiredMethodElement.inject(AutowiredAnnotationBeanPostProcessor.java:703)
26-Jan-2018 22:59:27         at org.springframework.beans.factory.annotation.InjectionMetadata.inject(InjectionMetadata.java:91)
26-Jan-2018 22:59:27         at org.springframework.beans.factory.annotation.AutowiredAnnotationBeanPostProcessor.postProcessPropertyValues(AutowiredAnnotationBeanPostProcessor.java:373)
26-Jan-2018 22:59:27         ... 47 more
26-Jan-2018 22:59:27
26-Jan-2018 22:59:27 testSuccessNoParams(org.springframework.cloud.task.launcher.TaskLauncherSinkTests)  Time elapsed: 0.001 sec  <<< ERROR!
26-Jan-2018 22:59:27 java.lang.IllegalStateException: Failed to load ApplicationContext
26-Jan-2018 22:59:27         at org.springframework.test.context.cache.DefaultCacheAwareContextLoaderDelegate.loadContext(DefaultCacheAwareContextLoaderDelegate.java:125)
26-Jan-2018 22:59:27         at org.springframework.test.context.support.DefaultTestContext.getApplicationContext(DefaultTestContext.java:107)
26-Jan-2018 22:59:27         at org.springframework.test.context.web.ServletTestExecutionListener.setUpRequestContextIfNecessary(ServletTestExecutionListener.java:190)
26-Jan-2018 22:59:27         at org.springframework.test.context.web.ServletTestExecutionListener.prepareTestInstance(ServletTestExecutionListener.java:132)
26-Jan-2018 22:59:27         at org.springframework.test.context.TestContextManager.prepareTestInstance(TestContextManager.java:242)
26-Jan-2018 22:59:27         at org.springframework.test.context.junit4.SpringJUnit4ClassRunner.createTest(SpringJUnit4ClassRunner.java:227)
26-Jan-2018 22:59:27         at org.springframework.test.context.junit4.SpringJUnit4ClassRunner$1.runReflectiveCall(SpringJUnit4ClassRunner.java:289)
26-Jan-2018 22:59:27         at org.junit.internal.runners.model.ReflectiveCallable.run(ReflectiveCallable.java:12)
26-Jan-2018 22:59:27         at org.springframework.test.context.junit4.SpringJUnit4ClassRunner.methodBlock(SpringJUnit4ClassRunner.java:291)
26-Jan-2018 22:59:27         at org.springframework.test.context.junit4.SpringJUnit4ClassRunner.runChild(SpringJUnit4ClassRunner.java:246)
26-Jan-2018 22:59:27         at org.springframework.test.context.junit4.SpringJUnit4ClassRunner.runChild(SpringJUnit4ClassRunner.java:97)
26-Jan-2018 22:59:27         at org.junit.runners.ParentRunner$3.run(ParentRunner.java:290)
26-Jan-2018 22:59:27         at org.junit.runners.ParentRunner$1.schedule(ParentRunner.java:71)
26-Jan-2018 22:59:27         at org.junit.runners.ParentRunner.runChildren(ParentRunner.java:288)
26-Jan-2018 22:59:27         at org.junit.runners.ParentRunner.access$000(ParentRunner.java:58)
26-Jan-2018 22:59:27         at org.junit.runners.ParentRunner$2.evaluate(ParentRunner.java:268)
26-Jan-2018 22:59:27         at org.springframework.test.context.junit4.statements.RunBeforeTestClassCallbacks.evaluate(RunBeforeTestClassCallbacks.java:61)
26-Jan-2018 22:59:27         at org.springframework.test.context.junit4.statements.RunAfterTestClassCallbacks.evaluate(RunAfterTestClassCallbacks.java:70)
26-Jan-2018 22:59:27         at org.junit.runners.ParentRunner.run(ParentRunner.java:363)
26-Jan-2018 22:59:27         at org.springframework.test.context.junit4.SpringJUnit4ClassRunner.run(SpringJUnit4ClassRunner.java:190)
26-Jan-2018 22:59:27         at org.apache.maven.surefire.junit4.JUnit4Provider.execute(JUnit4Provider.java:252)
26-Jan-2018 22:59:27         at org.apache.maven.surefire.junit4.JUnit4Provider.executeTestSet(JUnit4Provider.java:141)
26-Jan-2018 22:59:27         at org.apache.maven.surefire.junit4.JUnit4Provider.invoke(JUnit4Provider.java:112)
26-Jan-2018 22:59:27         at sun.reflect.NativeMethodAccessorImpl.invoke0(Native Method)
26-Jan-2018 22:59:27         at sun.reflect.NativeMethodAccessorImpl.invoke(NativeMethodAccessorImpl.java:62)
26-Jan-2018 22:59:27         at sun.reflect.DelegatingMethodAccessorImpl.invoke(DelegatingMethodAccessorImpl.java:43)
26-Jan-2018 22:59:27         at java.lang.reflect.Method.invoke(Method.java:498)
26-Jan-2018 22:59:27         at org.apache.maven.surefire.util.ReflectionUtils.invokeMethodWithArray(ReflectionUtils.java:189)
26-Jan-2018 22:59:27         at org.apache.maven.surefire.booter.ProviderFactory$ProviderProxy.invoke(ProviderFactory.java:165)
26-Jan-2018 22:59:27         at org.apache.maven.surefire.booter.ProviderFactory.invokeProvider(ProviderFactory.java:85)
26-Jan-2018 22:59:27         at org.apache.maven.surefire.booter.ForkedBooter.runSuitesInProcess(ForkedBooter.java:115)
26-Jan-2018 22:59:27         at org.apache.maven.surefire.booter.ForkedBooter.main(ForkedBooter.java:75)
26-Jan-2018 22:59:27 Caused by: org.springframework.beans.factory.BeanCreationException: Error creating bean with name 'org.springframework.boot.actuate.autoconfigure.metrics.amqp.RabbitMetricsConfiguration': Injection of autowired dependencies failed; nested exception is java.lang.NoSuchMethodError: io.micrometer.core.instrument.Tags.zip([Ljava/lang/String;)Lio/micrometer/core/instrument/Tags;
26-Jan-2018 22:59:27         at org.springframework.beans.factory.annotation.AutowiredAnnotationBeanPostProcessor.postProcessPropertyValues(AutowiredAnnotationBeanPostProcessor.java:379)
26-Jan-2018 22:59:27         at org.springframework.beans.factory.support.AbstractAutowireCapableBeanFactory.populateBean(AbstractAutowireCapableBeanFactory.java:1344)
26-Jan-2018 22:59:27         at org.springframework.beans.factory.support.AbstractAutowireCapableBeanFactory.doCreateBean(AbstractAutowireCapableBeanFactory.java:582)
26-Jan-2018 22:59:27         at org.springframework.beans.factory.support.AbstractAutowireCapableBeanFactory.createBean(AbstractAutowireCapableBeanFactory.java:502)
26-Jan-2018 22:59:27         at org.springframework.beans.factory.support.AbstractBeanFactory.lambda$doGetBean$0(AbstractBeanFactory.java:312)
26-Jan-2018 22:59:27         at org.springframework.beans.factory.support.DefaultSingletonBeanRegistry.getSingleton(DefaultSingletonBeanRegistry.java:228)
26-Jan-2018 22:59:27         at org.springframework.beans.factory.support.AbstractBeanFactory.doGetBean(AbstractBeanFactory.java:310)
26-Jan-2018 22:59:27         at org.springframework.beans.factory.support.AbstractBeanFactory.getBean(AbstractBeanFactory.java:200)
26-Jan-2018 22:59:27         at org.springframework.beans.factory.support.DefaultListableBeanFactory.preInstantiateSingletons(DefaultListableBeanFactory.java:761)
26-Jan-2018 22:59:27         at org.springframework.context.support.AbstractApplicationContext.finishBeanFactoryInitialization(AbstractApplicationContext.java:868)
26-Jan-2018 22:59:27         at org.springframework.context.support.AbstractApplicationContext.refresh(AbstractApplicationContext.java:549)
26-Jan-2018 22:59:27         at org.springframework.boot.SpringApplication.refresh(SpringApplication.java:752)
26-Jan-2018 22:59:27         at org.springframework.boot.SpringApplication.refreshContext(SpringApplication.java:388)
26-Jan-2018 22:59:27         at org.springframework.boot.SpringApplication.run(SpringApplication.java:327)
26-Jan-2018 22:59:27         at org.springframework.boot.test.context.SpringBootContextLoader.loadContext(SpringBootContextLoader.java:138)
26-Jan-2018 22:59:27         at org.springframework.test.context.cache.DefaultCacheAwareContextLoaderDelegate.loadContextInternal(DefaultCacheAwareContextLoaderDelegate.java:99)
26-Jan-2018 22:59:27         at org.springframework.test.context.cache.DefaultCacheAwareContextLoaderDelegate.loadContext(DefaultCacheAwareContextLoaderDelegate.java:117)
26-Jan-2018 22:59:27         ... 31 more
26-Jan-2018 22:59:27 Caused by: java.lang.NoSuchMethodError: io.micrometer.core.instrument.Tags.zip([Ljava/lang/String;)Lio/micrometer/core/instrument/Tags;
26-Jan-2018 22:59:27         at org.springframework.boot.actuate.autoconfigure.metrics.amqp.RabbitMetricsConfiguration.bindConnectionFactoryToRegistry(RabbitMetricsConfiguration.java:69)
26-Jan-2018 22:59:27         at java.util.LinkedHashMap.forEach(LinkedHashMap.java:684)
26-Jan-2018 22:59:27         at org.springframework.boot.actuate.autoconfigure.metrics.amqp.RabbitMetricsConfiguration.bindConnectionFactoriesToRegistry(RabbitMetricsConfiguration.java:64)
26-Jan-2018 22:59:27         at sun.reflect.NativeMethodAccessorImpl.invoke0(Native Method)
26-Jan-2018 22:59:27         at sun.reflect.NativeMethodAccessorImpl.invoke(NativeMethodAccessorImpl.java:62)
26-Jan-2018 22:59:27         at sun.reflect.DelegatingMethodAccessorImpl.invoke(DelegatingMethodAccessorImpl.java:43)
26-Jan-2018 22:59:27         at java.lang.reflect.Method.invoke(Method.java:498)
26-Jan-2018 22:59:27         at org.springframework.beans.factory.annotation.AutowiredAnnotationBeanPostProcessor$AutowiredMethodElement.inject(AutowiredAnnotationBeanPostProcessor.java:703)
26-Jan-2018 22:59:27         at org.springframework.beans.factory.annotation.InjectionMetadata.inject(InjectionMetadata.java:91)
26-Jan-2018 22:59:27         at org.springframework.beans.factory.annotation.AutowiredAnnotationBeanPostProcessor.postProcessPropertyValues(AutowiredAnnotationBeanPostProcessor.java:373)
26-Jan-2018 22:59:27         ... 47 more
26-Jan-2018 22:59:27
26-Jan-2018 22:59:27 testSuccessWithParams(org.springframework.cloud.task.launcher.TaskLauncherSinkTests)  Time elapsed: 0 sec  <<< ERROR!
26-Jan-2018 22:59:27 java.lang.IllegalStateException: Failed to load ApplicationContext
26-Jan-2018 22:59:27         at org.springframework.test.context.cache.DefaultCacheAwareContextLoaderDelegate.loadContext(DefaultCacheAwareContextLoaderDelegate.java:125)
26-Jan-2018 22:59:27         at org.springframework.test.context.support.DefaultTestContext.getApplicationContext(DefaultTestContext.java:107)
26-Jan-2018 22:59:27         at org.springframework.test.context.web.ServletTestExecutionListener.setUpRequestContextIfNecessary(ServletTestExecutionListener.java:190)
26-Jan-2018 22:59:27         at org.springframework.test.context.web.ServletTestExecutionListener.prepareTestInstance(ServletTestExecutionListener.java:132)
26-Jan-2018 22:59:27         at org.springframework.test.context.TestContextManager.prepareTestInstance(TestContextManager.java:242)
26-Jan-2018 22:59:27         at org.springframework.test.context.junit4.SpringJUnit4ClassRunner.createTest(SpringJUnit4ClassRunner.java:227)
26-Jan-2018 22:59:27         at org.springframework.test.context.junit4.SpringJUnit4ClassRunner$1.runReflectiveCall(SpringJUnit4ClassRunner.java:289)
26-Jan-2018 22:59:27         at org.junit.internal.runners.model.ReflectiveCallable.run(ReflectiveCallable.java:12)
26-Jan-2018 22:59:27         at org.springframework.test.context.junit4.SpringJUnit4ClassRunner.methodBlock(SpringJUnit4ClassRunner.java:291)
26-Jan-2018 22:59:27         at org.springframework.test.context.junit4.SpringJUnit4ClassRunner.runChild(SpringJUnit4ClassRunner.java:246)
26-Jan-2018 22:59:27         at org.springframework.test.context.junit4.SpringJUnit4ClassRunner.runChild(SpringJUnit4ClassRunner.java:97)
26-Jan-2018 22:59:27         at org.junit.runners.ParentRunner$3.run(ParentRunner.java:290)
26-Jan-2018 22:59:27         at org.junit.runners.ParentRunner$1.schedule(ParentRunner.java:71)
26-Jan-2018 22:59:27         at org.junit.runners.ParentRunner.runChildren(ParentRunner.java:288)
26-Jan-2018 22:59:27         at org.junit.runners.ParentRunner.access$000(ParentRunner.java:58)
26-Jan-2018 22:59:27         at org.junit.runners.ParentRunner$2.evaluate(ParentRunner.java:268)
26-Jan-2018 22:59:27         at org.springframework.test.context.junit4.statements.RunBeforeTestClassCallbacks.evaluate(RunBeforeTestClassCallbacks.java:61)
26-Jan-2018 22:59:27         at org.springframework.test.context.junit4.statements.RunAfterTestClassCallbacks.evaluate(RunAfterTestClassCallbacks.java:70)
26-Jan-2018 22:59:27         at org.junit.runners.ParentRunner.run(ParentRunner.java:363)
26-Jan-2018 22:59:27         at org.springframework.test.context.junit4.SpringJUnit4ClassRunner.run(SpringJUnit4ClassRunner.java:190)
26-Jan-2018 22:59:27         at org.apache.maven.surefire.junit4.JUnit4Provider.execute(JUnit4Provider.java:252)
26-Jan-2018 22:59:27         at org.apache.maven.surefire.junit4.JUnit4Provider.executeTestSet(JUnit4Provider.java:141)
26-Jan-2018 22:59:27         at org.apache.maven.surefire.junit4.JUnit4Provider.invoke(JUnit4Provider.java:112)
26-Jan-2018 22:59:27         at sun.reflect.NativeMethodAccessorImpl.invoke0(Native Method)
26-Jan-2018 22:59:27         at sun.reflect.NativeMethodAccessorImpl.invoke(NativeMethodAccessorImpl.java:62)
26-Jan-2018 22:59:27         at sun.reflect.DelegatingMethodAccessorImpl.invoke(DelegatingMethodAccessorImpl.java:43)
26-Jan-2018 22:59:27         at java.lang.reflect.Method.invoke(Method.java:498)
26-Jan-2018 22:59:27         at org.apache.maven.surefire.util.ReflectionUtils.invokeMethodWithArray(ReflectionUtils.java:189)
26-Jan-2018 22:59:27         at org.apache.maven.surefire.booter.ProviderFactory$ProviderProxy.invoke(ProviderFactory.java:165)
26-Jan-2018 22:59:27         at org.apache.maven.surefire.booter.ProviderFactory.invokeProvider(ProviderFactory.java:85)
26-Jan-2018 22:59:27         at org.apache.maven.surefire.booter.ForkedBooter.runSuitesInProcess(ForkedBooter.java:115)
26-Jan-2018 22:59:27         at org.apache.maven.surefire.booter.ForkedBooter.main(ForkedBooter.java:75)
26-Jan-2018 22:59:27 Caused by: org.springframework.beans.factory.BeanCreationException: Error creating bean with name 'org.springframework.boot.actuate.autoconfigure.metrics.amqp.RabbitMetricsConfiguration': Injection of autowired dependencies failed; nested exception is java.lang.NoSuchMethodError: io.micrometer.core.instrument.Tags.zip([Ljava/lang/String;)Lio/micrometer/core/instrument/Tags;
26-Jan-2018 22:59:27         at org.springframework.beans.factory.annotation.AutowiredAnnotationBeanPostProcessor.postProcessPropertyValues(AutowiredAnnotationBeanPostProcessor.java:379)
26-Jan-2018 22:59:27         at org.springframework.beans.factory.support.AbstractAutowireCapableBeanFactory.populateBean(AbstractAutowireCapableBeanFactory.java:1344)
26-Jan-2018 22:59:27         at org.springframework.beans.factory.support.AbstractAutowireCapableBeanFactory.doCreateBean(AbstractAutowireCapableBeanFactory.java:582)
26-Jan-2018 22:59:27         at org.springframework.beans.factory.support.AbstractAutowireCapableBeanFactory.createBean(AbstractAutowireCapableBeanFactory.java:502)
26-Jan-2018 22:59:27         at org.springframework.beans.factory.support.AbstractBeanFactory.lambda$doGetBean$0(AbstractBeanFactory.java:312)
26-Jan-2018 22:59:27         at org.springframework.beans.factory.support.DefaultSingletonBeanRegistry.getSingleton(DefaultSingletonBeanRegistry.java:228)
26-Jan-2018 22:59:27         at org.springframework.beans.factory.support.AbstractBeanFactory.doGetBean(AbstractBeanFactory.java:310)
26-Jan-2018 22:59:27         at org.springframework.beans.factory.support.AbstractBeanFactory.getBean(AbstractBeanFactory.java:200)
26-Jan-2018 22:59:27         at org.springframework.beans.factory.support.DefaultListableBeanFactory.preInstantiateSingletons(DefaultListableBeanFactory.java:761)
26-Jan-2018 22:59:27         at org.springframework.context.support.AbstractApplicationContext.finishBeanFactoryInitialization(AbstractApplicationContext.java:868)
26-Jan-2018 22:59:27         at org.springframework.context.support.AbstractApplicationContext.refresh(AbstractApplicationContext.java:549)
26-Jan-2018 22:59:27         at org.springframework.boot.SpringApplication.refresh(SpringApplication.java:752)
26-Jan-2018 22:59:27         at org.springframework.boot.SpringApplication.refreshContext(SpringApplication.java:388)
26-Jan-2018 22:59:27         at org.springframework.boot.SpringApplication.run(SpringApplication.java:327)
26-Jan-2018 22:59:27         at org.springframework.boot.test.context.SpringBootContextLoader.loadContext(SpringBootContextLoader.java:138)
26-Jan-2018 22:59:27         at org.springframework.test.context.cache.DefaultCacheAwareContextLoaderDelegate.loadContextInternal(DefaultCacheAwareContextLoaderDelegate.java:99)
26-Jan-2018 22:59:27         at org.springframework.test.context.cache.DefaultCacheAwareContextLoaderDelegate.loadContext(DefaultCacheAwareContextLoaderDelegate.java:117)
26-Jan-2018 22:59:27         ... 31 more
26-Jan-2018 22:59:27 Caused by: java.lang.NoSuchMethodError: io.micrometer.core.instrument.Tags.zip([Ljava/lang/String;)Lio/micrometer/core/instrument/Tags;
26-Jan-2018 22:59:27         at org.springframework.boot.actuate.autoconfigure.metrics.amqp.RabbitMetricsConfiguration.bindConnectionFactoryToRegistry(RabbitMetricsConfiguration.java:69)
26-Jan-2018 22:59:27         at java.util.LinkedHashMap.forEach(LinkedHashMap.java:684)
26-Jan-2018 22:59:27         at org.springframework.boot.actuate.autoconfigure.metrics.amqp.RabbitMetricsConfiguration.bindConnectionFactoriesToRegistry(RabbitMetricsConfiguration.java:64)
26-Jan-2018 22:59:27         at sun.reflect.NativeMethodAccessorImpl.invoke0(Native Method)
26-Jan-2018 22:59:27         at sun.reflect.NativeMethodAccessorImpl.invoke(NativeMethodAccessorImpl.java:62)
26-Jan-2018 22:59:27         at sun.reflect.DelegatingMethodAccessorImpl.invoke(DelegatingMethodAccessorImpl.java:43)
26-Jan-2018 22:59:27         at java.lang.reflect.Method.invoke(Method.java:498)
26-Jan-2018 22:59:27         at org.springframework.beans.factory.annotation.AutowiredAnnotationBeanPostProcessor$AutowiredMethodElement.inject(AutowiredAnnotationBeanPostProcessor.java:703)
26-Jan-2018 22:59:27         at org.springframework.beans.factory.annotation.InjectionMetadata.inject(InjectionMetadata.java:91)
26-Jan-2018 22:59:27         at org.springframework.beans.factory.annotation.AutowiredAnnotationBeanPostProcessor.postProcessPropertyValues(AutowiredAnnotationBeanPostProcessor.java:373)
26-Jan-2018 22:59:27         ... 47 more
26-Jan-2018 22:59:27
26-Jan-2018 22:59:27 testInvalidJar(org.springframework.cloud.task.launcher.TaskLauncherSinkTests)  Time elapsed: 0 sec  <<< ERROR!
26-Jan-2018 22:59:27 java.lang.IllegalStateException: Failed to load ApplicationContext
26-Jan-2018 22:59:27         at org.springframework.test.context.cache.DefaultCacheAwareContextLoaderDelegate.loadContext(DefaultCacheAwareContextLoaderDelegate.java:125)
26-Jan-2018 22:59:27         at org.springframework.test.context.support.DefaultTestContext.getApplicationContext(DefaultTestContext.java:107)
26-Jan-2018 22:59:27         at org.springframework.test.context.web.ServletTestExecutionListener.setUpRequestContextIfNecessary(ServletTestExecutionListener.java:190)
26-Jan-2018 22:59:27         at org.springframework.test.context.web.ServletTestExecutionListener.prepareTestInstance(ServletTestExecutionListener.java:132)
26-Jan-2018 22:59:27         at org.springframework.test.context.TestContextManager.prepareTestInstance(TestContextManager.java:242)
26-Jan-2018 22:59:27         at org.springframework.test.context.junit4.SpringJUnit4ClassRunner.createTest(SpringJUnit4ClassRunner.java:227)
26-Jan-2018 22:59:27         at org.springframework.test.context.junit4.SpringJUnit4ClassRunner$1.runReflectiveCall(SpringJUnit4ClassRunner.java:289)
26-Jan-2018 22:59:27         at org.junit.internal.runners.model.ReflectiveCallable.run(ReflectiveCallable.java:12)
26-Jan-2018 22:59:27         at org.springframework.test.context.junit4.SpringJUnit4ClassRunner.methodBlock(SpringJUnit4ClassRunner.java:291)
26-Jan-2018 22:59:27         at org.springframework.test.context.junit4.SpringJUnit4ClassRunner.runChild(SpringJUnit4ClassRunner.java:246)
26-Jan-2018 22:59:27         at org.springframework.test.context.junit4.SpringJUnit4ClassRunner.runChild(SpringJUnit4ClassRunner.java:97)
26-Jan-2018 22:59:27         at org.junit.runners.ParentRunner$3.run(ParentRunner.java:290)
26-Jan-2018 22:59:27         at org.junit.runners.ParentRunner$1.schedule(ParentRunner.java:71)
26-Jan-2018 22:59:27         at org.junit.runners.ParentRunner.runChildren(ParentRunner.java:288)
26-Jan-2018 22:59:27         at org.junit.runners.ParentRunner.access$000(ParentRunner.java:58)
26-Jan-2018 22:59:27         at org.junit.runners.ParentRunner$2.evaluate(ParentRunner.java:268)
26-Jan-2018 22:59:27         at org.springframework.test.context.junit4.statements.RunBeforeTestClassCallbacks.evaluate(RunBeforeTestClassCallbacks.java:61)
26-Jan-2018 22:59:27         at org.springframework.test.context.junit4.statements.RunAfterTestClassCallbacks.evaluate(RunAfterTestClassCallbacks.java:70)
26-Jan-2018 22:59:27         at org.junit.runners.ParentRunner.run(ParentRunner.java:363)
26-Jan-2018 22:59:27         at org.springframework.test.context.junit4.SpringJUnit4ClassRunner.run(SpringJUnit4ClassRunner.java:190)
26-Jan-2018 22:59:27         at org.apache.maven.surefire.junit4.JUnit4Provider.execute(JUnit4Provider.java:252)
26-Jan-2018 22:59:27         at org.apache.maven.surefire.junit4.JUnit4Provider.executeTestSet(JUnit4Provider.java:141)
26-Jan-2018 22:59:27         at org.apache.maven.surefire.junit4.JUnit4Provider.invoke(JUnit4Provider.java:112)
26-Jan-2018 22:59:27         at sun.reflect.NativeMethodAccessorImpl.invoke0(Native Method)
26-Jan-2018 22:59:27         at sun.reflect.NativeMethodAccessorImpl.invoke(NativeMethodAccessorImpl.java:62)
26-Jan-2018 22:59:27         at sun.reflect.DelegatingMethodAccessorImpl.invoke(DelegatingMethodAccessorImpl.java:43)
26-Jan-2018 22:59:27         at java.lang.reflect.Method.invoke(Method.java:498)
26-Jan-2018 22:59:27         at org.apache.maven.surefire.util.ReflectionUtils.invokeMethodWithArray(ReflectionUtils.java:189)
26-Jan-2018 22:59:27         at org.apache.maven.surefire.booter.ProviderFactory$ProviderProxy.invoke(ProviderFactory.java:165)
26-Jan-2018 22:59:27         at org.apache.maven.surefire.booter.ProviderFactory.invokeProvider(ProviderFactory.java:85)
26-Jan-2018 22:59:27         at org.apache.maven.surefire.booter.ForkedBooter.runSuitesInProcess(ForkedBooter.java:115)
26-Jan-2018 22:59:27         at org.apache.maven.surefire.booter.ForkedBooter.main(ForkedBooter.java:75)
26-Jan-2018 22:59:27 Caused by: org.springframework.beans.factory.BeanCreationException: Error creating bean with name 'org.springframework.boot.actuate.autoconfigure.metrics.amqp.RabbitMetricsConfiguration': Injection of autowired dependencies failed; nested exception is java.lang.NoSuchMethodError: io.micrometer.core.instrument.Tags.zip([Ljava/lang/String;)Lio/micrometer/core/instrument/Tags;
26-Jan-2018 22:59:27         at org.springframework.beans.factory.annotation.AutowiredAnnotationBeanPostProcessor.postProcessPropertyValues(AutowiredAnnotationBeanPostProcessor.java:379)
26-Jan-2018 22:59:27         at org.springframework.beans.factory.support.AbstractAutowireCapableBeanFactory.populateBean(AbstractAutowireCapableBeanFactory.java:1344)
26-Jan-2018 22:59:27         at org.springframework.beans.factory.support.AbstractAutowireCapableBeanFactory.doCreateBean(AbstractAutowireCapableBeanFactory.java:582)
26-Jan-2018 22:59:27         at org.springframework.beans.factory.support.AbstractAutowireCapableBeanFactory.createBean(AbstractAutowireCapableBeanFactory.java:502)
26-Jan-2018 22:59:27         at org.springframework.beans.factory.support.AbstractBeanFactory.lambda$doGetBean$0(AbstractBeanFactory.java:312)
26-Jan-2018 22:59:27         at org.springframework.beans.factory.support.DefaultSingletonBeanRegistry.getSingleton(DefaultSingletonBeanRegistry.java:228)
26-Jan-2018 22:59:27         at org.springframework.beans.factory.support.AbstractBeanFactory.doGetBean(AbstractBeanFactory.java:310)
26-Jan-2018 22:59:27         at org.springframework.beans.factory.support.AbstractBeanFactory.getBean(AbstractBeanFactory.java:200)
26-Jan-2018 22:59:27         at org.springframework.beans.factory.support.DefaultListableBeanFactory.preInstantiateSingletons(DefaultListableBeanFactory.java:761)
26-Jan-2018 22:59:27         at org.springframework.context.support.AbstractApplicationContext.finishBeanFactoryInitialization(AbstractApplicationContext.java:868)
26-Jan-2018 22:59:27         at org.springframework.context.support.AbstractApplicationContext.refresh(AbstractApplicationContext.java:549)
26-Jan-2018 22:59:27         at org.springframework.boot.SpringApplication.refresh(SpringApplication.java:752)
26-Jan-2018 22:59:27         at org.springframework.boot.SpringApplication.refreshContext(SpringApplication.java:388)
26-Jan-2018 22:59:27         at org.springframework.boot.SpringApplication.run(SpringApplication.java:327)
26-Jan-2018 22:59:27         at org.springframework.boot.test.context.SpringBootContextLoader.loadContext(SpringBootContextLoader.java:138)
26-Jan-2018 22:59:27         at org.springframework.test.context.cache.DefaultCacheAwareContextLoaderDelegate.loadContextInternal(DefaultCacheAwareContextLoaderDelegate.java:99)
26-Jan-2018 22:59:27         at org.springframework.test.context.cache.DefaultCacheAwareContextLoaderDelegate.loadContext(DefaultCacheAwareContextLoaderDelegate.java:117)
26-Jan-2018 22:59:27         ... 31 more
26-Jan-2018 22:59:27 Caused by: java.lang.NoSuchMethodError: io.micrometer.core.instrument.Tags.zip([Ljava/lang/String;)Lio/micrometer/core/instrument/Tags;
26-Jan-2018 22:59:27         at org.springframework.boot.actuate.autoconfigure.metrics.amqp.RabbitMetricsConfiguration.bindConnectionFactoryToRegistry(RabbitMetricsConfiguration.java:69)
26-Jan-2018 22:59:27         at java.util.LinkedHashMap.forEach(LinkedHashMap.java:684)
26-Jan-2018 22:59:27         at org.springframework.boot.actuate.autoconfigure.metrics.amqp.RabbitMetricsConfiguration.bindConnectionFactoriesToRegistry(RabbitMetricsConfiguration.java:64)
26-Jan-2018 22:59:27         at sun.reflect.NativeMethodAccessorImpl.invoke0(Native Method)
26-Jan-2018 22:59:27         at sun.reflect.NativeMethodAccessorImpl.invoke(NativeMethodAccessorImpl.java:62)
26-Jan-2018 22:59:27         at sun.reflect.DelegatingMethodAccessorImpl.invoke(DelegatingMethodAccessorImpl.java:43)
26-Jan-2018 22:59:27         at java.lang.reflect.Method.invoke(Method.java:498)
26-Jan-2018 22:59:27         at org.springframework.beans.factory.annotation.AutowiredAnnotationBeanPostProcessor$AutowiredMethodElement.inject(AutowiredAnnotationBeanPostProcessor.java:703)
26-Jan-2018 22:59:27         at org.springframework.beans.factory.annotation.InjectionMetadata.inject(InjectionMetadata.java:91)
26-Jan-2018 22:59:27         at org.springframework.beans.factory.annotation.AutowiredAnnotationBeanPostProcessor.postProcessPropertyValues(AutowiredAnnotationBeanPostProcessor.java:373)
26-Jan-2018 22:59:27         ... 47 more
26-Jan-2018 22:59:27
26-Jan-2018 22:59:27 2018-01-26 22:59:27.570  INFO 15800 --- [      Thread-10] s.c.a.AnnotationConfigApplicationContext : Closing org.springframework.context.annotation.AnnotationConfigApplicationContext@5c1b4a72: startup date [Fri Jan 26 22:59:11 UTC 2018]; root of context hierarchy
26-Jan-2018 22:59:27 2018-01-26 22:59:27.570  INFO 15800 --- [      Thread-15] o.s.w.c.s.GenericWebApplicationContext   : Closing org.springframework.web.context.support.GenericWebApplicationContext@1d11ab4e: startup date [Fri Jan 26 22:59:15 UTC 2018]; root of context hierarchy
26-Jan-2018 22:59:27 2018-01-26 22:59:27.573  INFO 15800 --- [      Thread-13] s.c.a.AnnotationConfigApplicationContext : Closing org.springframework.context.annotation.AnnotationConfigApplicationContext@12ae1f7d: startup date [Fri Jan 26 22:59:14 UTC 2018]; root of context hierarchy
26-Jan-2018 22:59:27 2018-01-26 22:59:27.573  INFO 15800 --- [      Thread-11] s.c.a.AnnotationConfigApplicationContext : Closing org.springframework.context.annotation.AnnotationConfigApplicationContext@24900d4b: startup date [Fri Jan 26 22:59:12 UTC 2018]; root of context hierarchy
26-Jan-2018 22:59:27 2018-01-26 22:59:27.573  INFO 15800 --- [      Thread-12] s.c.a.AnnotationConfigApplicationContext : Closing org.springframework.context.annotation.AnnotationConfigApplicationContext@5e4ddafe: startup date [Fri Jan 26 22:59:13 UTC 2018]; root of context hierarchy
26-Jan-2018 22:59:27 2018-01-26 22:59:27.572  INFO 15800 --- [      Thread-14] s.c.a.AnnotationConfigApplicationContext : Closing org.springframework.context.annotation.AnnotationConfigApplicationContext@1c7f11ae: startup date [Fri Jan 26 22:59:14 UTC 2018]; root of context hierarchy
26-Jan-2018 22:59:27 2018-01-26 22:59:27.572  INFO 15800 --- [       Thread-8] s.c.a.AnnotationConfigApplicationContext : Closing org.springframework.context.annotation.AnnotationConfigApplicationContext@5775f993: startup date [Fri Jan 26 22:59:10 UTC 2018]; root of context hierarchy
26-Jan-2018 22:59:27 2018-01-26 22:59:27.572  INFO 15800 --- [       Thread-2] s.c.a.AnnotationConfigApplicationContext : Closing org.springframework.context.annotation.AnnotationConfigApplicationContext@46320c9a: startup date [Fri Jan 26 22:59:00 UTC 2018]; root of context hierarchy
26-Jan-2018 22:59:27 2018-01-26 22:59:27.572  INFO 15800 --- [       Thread-9] s.c.a.AnnotationConfigApplicationContext : Closing org.springframework.context.annotation.AnnotationConfigApplicationContext@6e182c75: startup date [Fri Jan 26 22:59:11 UTC 2018]; root of context hierarchy
26-Jan-2018 22:59:27 2018-01-26 22:59:27.573  INFO 15800 --- [       Thread-5] s.c.a.AnnotationConfigApplicationContext : Closing org.springframework.context.annotation.AnnotationConfigApplicationContext@459d199b: startup date [Fri Jan 26 22:59:09 UTC 2018]; root of context hierarchy
26-Jan-2018 22:59:27 2018-01-26 22:59:27.571  INFO 15800 --- [       Thread-4] s.c.a.AnnotationConfigApplicationContext : Closing org.springframework.context.annotation.AnnotationConfigApplicationContext@3a332d08: startup date [Fri Jan 26 22:59:08 UTC 2018]; root of context hierarchy
26-Jan-2018 22:59:27 2018-01-26 22:59:27.580  INFO 15800 --- [       Thread-2] o.s.c.support.DefaultLifecycleProcessor  : Stopping beans in phase 2147482647
26-Jan-2018 22:59:27 2018-01-26 22:59:27.581  INFO 15800 --- [      Thread-13] o.s.c.support.DefaultLifecycleProcessor  : Stopping beans in phase 2147482647
26-Jan-2018 22:59:27 2018-01-26 22:59:27.581  INFO 15800 --- [      Thread-11] o.s.c.support.DefaultLifecycleProcessor  : Stopping beans in phase 2147482647
26-Jan-2018 22:59:27 2018-01-26 22:59:27.582  INFO 15800 --- [      Thread-13] o.s.c.support.DefaultLifecycleProcessor  : Stopping beans in phase 0
26-Jan-2018 22:59:27 2018-01-26 22:59:27.582  INFO 15800 --- [      Thread-11] o.s.c.support.DefaultLifecycleProcessor  : Stopping beans in phase 0
26-Jan-2018 22:59:27 2018-01-26 22:59:27.582  INFO 15800 --- [      Thread-13] o.s.i.endpoint.EventDrivenConsumer       : Removing {logging-channel-adapter:_org.springframework.integration.errorLogger} as a subscriber to the 'errorChannel' channel
26-Jan-2018 22:59:27 2018-01-26 22:59:27.582  INFO 15800 --- [      Thread-11] o.s.i.endpoint.EventDrivenConsumer       : Removing {logging-channel-adapter:_org.springframework.integration.errorLogger} as a subscriber to the 'errorChannel' channel
26-Jan-2018 22:59:27 2018-01-26 22:59:27.583  INFO 15800 --- [      Thread-12] o.s.c.support.DefaultLifecycleProcessor  : Stopping beans in phase 2147482647
26-Jan-2018 22:59:27 2018-01-26 22:59:27.583  INFO 15800 --- [       Thread-9] o.s.c.support.DefaultLifecycleProcessor  : Stopping beans in phase 2147482647
26-Jan-2018 22:59:27 2018-01-26 22:59:27.583  INFO 15800 --- [      Thread-12] o.s.c.support.DefaultLifecycleProcessor  : Stopping beans in phase 0
26-Jan-2018 22:59:27 2018-01-26 22:59:27.583  INFO 15800 --- [       Thread-9] o.s.c.support.DefaultLifecycleProcessor  : Stopping beans in phase 0
26-Jan-2018 22:59:27 2018-01-26 22:59:27.583  INFO 15800 --- [      Thread-12] o.s.i.endpoint.EventDrivenConsumer       : Removing {logging-channel-adapter:_org.springframework.integration.errorLogger} as a subscriber to the 'errorChannel' channel
26-Jan-2018 22:59:27 2018-01-26 22:59:27.583  INFO 15800 --- [       Thread-9] o.s.i.endpoint.EventDrivenConsumer       : Removing {logging-channel-adapter:_org.springframework.integration.errorLogger} as a subscriber to the 'errorChannel' channel
26-Jan-2018 22:59:27 2018-01-26 22:59:27.583  INFO 15800 --- [       Thread-2] o.s.c.support.DefaultLifecycleProcessor  : Stopping beans in phase 0
26-Jan-2018 22:59:27 2018-01-26 22:59:27.583  INFO 15800 --- [       Thread-2] ProxyFactoryBean$MethodInvocationGateway : stopped taskEventListener
26-Jan-2018 22:59:27 2018-01-26 22:59:27.583  INFO 15800 --- [       Thread-2] ProxyFactoryBean$MethodInvocationGateway : stopped taskEventListener
26-Jan-2018 22:59:27 2018-01-26 22:59:27.583  INFO 15800 --- [       Thread-2] ProxyFactoryBean$MethodInvocationGateway : stopped taskEventListener
26-Jan-2018 22:59:27 2018-01-26 22:59:27.583  INFO 15800 --- [       Thread-2] o.s.i.gateway.GatewayProxyFactoryBean    : stopped taskEventListener
26-Jan-2018 22:59:27 2018-01-26 22:59:27.583  INFO 15800 --- [      Thread-14] o.s.c.support.DefaultLifecycleProcessor  : Stopping beans in phase 2147482647
26-Jan-2018 22:59:27 2018-01-26 22:59:27.583  INFO 15800 --- [       Thread-2] o.s.i.endpoint.EventDrivenConsumer       : Removing {logging-channel-adapter:_org.springframework.integration.errorLogger} as a subscriber to the 'errorChannel' channel
26-Jan-2018 22:59:27 2018-01-26 22:59:27.584  INFO 15800 --- [      Thread-14] o.s.c.support.DefaultLifecycleProcessor  : Stopping beans in phase 0
26-Jan-2018 22:59:27 2018-01-26 22:59:27.584  INFO 15800 --- [      Thread-10] o.s.c.support.DefaultLifecycleProcessor  : Stopping beans in phase 2147482647
26-Jan-2018 22:59:27 2018-01-26 22:59:27.584  INFO 15800 --- [      Thread-14] o.s.i.endpoint.EventDrivenConsumer       : Removing {logging-channel-adapter:_org.springframework.integration.errorLogger} as a subscriber to the 'errorChannel' channel
26-Jan-2018 22:59:27 2018-01-26 22:59:27.584  INFO 15800 --- [      Thread-10] o.s.c.support.DefaultLifecycleProcessor  : Stopping beans in phase 0
26-Jan-2018 22:59:27 2018-01-26 22:59:27.584  INFO 15800 --- [      Thread-10] o.s.i.endpoint.EventDrivenConsumer       : Removing {logging-channel-adapter:_org.springframework.integration.errorLogger} as a subscriber to the 'errorChannel' channel
26-Jan-2018 22:59:27 2018-01-26 22:59:27.584  INFO 15800 --- [       Thread-8] o.s.c.support.DefaultLifecycleProcessor  : Stopping beans in phase 2147482647
26-Jan-2018 22:59:27 2018-01-26 22:59:27.584  INFO 15800 --- [       Thread-8] o.s.c.support.DefaultLifecycleProcessor  : Stopping beans in phase 0
26-Jan-2018 22:59:27 2018-01-26 22:59:27.584  INFO 15800 --- [       Thread-8] o.s.i.endpoint.EventDrivenConsumer       : Removing {logging-channel-adapter:_org.springframework.integration.errorLogger} as a subscriber to the 'errorChannel' channel
26-Jan-2018 22:59:27 2018-01-26 22:59:27.586  INFO 15800 --- [       Thread-4] o.s.c.support.DefaultLifecycleProcessor  : Stopping beans in phase 2147482647
26-Jan-2018 22:59:27 2018-01-26 22:59:27.586  INFO 15800 --- [       Thread-4] o.s.c.support.DefaultLifecycleProcessor  : Stopping beans in phase 0
26-Jan-2018 22:59:27 2018-01-26 22:59:27.586  INFO 15800 --- [       Thread-4] o.s.i.endpoint.EventDrivenConsumer       : Removing {logging-channel-adapter:_org.springframework.integration.errorLogger} as a subscriber to the 'errorChannel' channel
26-Jan-2018 22:59:27 2018-01-26 22:59:27.584  INFO 15800 --- [       Thread-5] o.s.c.support.DefaultLifecycleProcessor  : Stopping beans in phase 2147482647
26-Jan-2018 22:59:27 2018-01-26 22:59:27.586  INFO 15800 --- [       Thread-5] o.s.c.support.DefaultLifecycleProcessor  : Stopping beans in phase 0
26-Jan-2018 22:59:27 2018-01-26 22:59:27.586  INFO 15800 --- [       Thread-5] o.s.i.endpoint.EventDrivenConsumer       : Removing {logging-channel-adapter:_org.springframework.integration.errorLogger} as a subscriber to the 'errorChannel' channel
26-Jan-2018 22:59:27 2018-01-26 22:59:27.586  INFO 15800 --- [      Thread-13] o.s.i.channel.PublishSubscribeChannel    : Channel 'application.errorChannel' has 0 subscriber(s).
26-Jan-2018 22:59:27 2018-01-26 22:59:27.586  INFO 15800 --- [      Thread-11] o.s.i.channel.PublishSubscribeChannel    : Channel 'application.errorChannel' has 0 subscriber(s).
26-Jan-2018 22:59:27 2018-01-26 22:59:27.586  INFO 15800 --- [      Thread-13] o.s.i.endpoint.EventDrivenConsumer       : stopped _org.springframework.integration.errorLogger
26-Jan-2018 22:59:27 2018-01-26 22:59:27.586  INFO 15800 --- [      Thread-11] o.s.i.endpoint.EventDrivenConsumer       : stopped _org.springframework.integration.errorLogger
26-Jan-2018 22:59:27 2018-01-26 22:59:27.586  INFO 15800 --- [      Thread-13] o.s.c.support.DefaultLifecycleProcessor  : Stopping beans in phase -2147482648
26-Jan-2018 22:59:27 2018-01-26 22:59:27.586  INFO 15800 --- [      Thread-11] o.s.c.support.DefaultLifecycleProcessor  : Stopping beans in phase -2147482648
26-Jan-2018 22:59:27 2018-01-26 22:59:27.587  INFO 15800 --- [      Thread-12] o.s.i.channel.PublishSubscribeChannel    : Channel 'application.errorChannel' has 0 subscriber(s).
26-Jan-2018 22:59:27 2018-01-26 22:59:27.587  INFO 15800 --- [       Thread-9] o.s.i.channel.PublishSubscribeChannel    : Channel 'application.errorChannel' has 0 subscriber(s).
26-Jan-2018 22:59:27 2018-01-26 22:59:27.587  INFO 15800 --- [      Thread-12] o.s.i.endpoint.EventDrivenConsumer       : stopped _org.springframework.integration.errorLogger
26-Jan-2018 22:59:27 2018-01-26 22:59:27.587  INFO 15800 --- [       Thread-9] o.s.i.endpoint.EventDrivenConsumer       : stopped _org.springframework.integration.errorLogger
26-Jan-2018 22:59:27 2018-01-26 22:59:27.587  INFO 15800 --- [      Thread-12] o.s.c.support.DefaultLifecycleProcessor  : Stopping beans in phase -2147482648
26-Jan-2018 22:59:27 2018-01-26 22:59:27.587  INFO 15800 --- [       Thread-9] o.s.c.support.DefaultLifecycleProcessor  : Stopping beans in phase -2147482648
26-Jan-2018 22:59:27 2018-01-26 22:59:27.587  INFO 15800 --- [       Thread-2] o.s.i.channel.PublishSubscribeChannel    : Channel 'application.errorChannel' has 0 subscriber(s).
26-Jan-2018 22:59:27 2018-01-26 22:59:27.587  INFO 15800 --- [      Thread-14] o.s.i.channel.PublishSubscribeChannel    : Channel 'application.errorChannel' has 0 subscriber(s).
26-Jan-2018 22:59:27 2018-01-26 22:59:27.587  INFO 15800 --- [       Thread-2] o.s.i.endpoint.EventDrivenConsumer       : stopped _org.springframework.integration.errorLogger
26-Jan-2018 22:59:27 2018-01-26 22:59:27.587  INFO 15800 --- [      Thread-14] o.s.i.endpoint.EventDrivenConsumer       : stopped _org.springframework.integration.errorLogger
26-Jan-2018 22:59:27 2018-01-26 22:59:27.587  INFO 15800 --- [       Thread-2] o.s.c.support.DefaultLifecycleProcessor  : Stopping beans in phase -2147482648
26-Jan-2018 22:59:27 2018-01-26 22:59:27.587  INFO 15800 --- [      Thread-14] o.s.c.support.DefaultLifecycleProcessor  : Stopping beans in phase -2147482648
26-Jan-2018 22:59:27 2018-01-26 22:59:27.587  INFO 15800 --- [       Thread-2] o.s.s.c.ThreadPoolTaskScheduler          : Shutting down ExecutorService 'taskScheduler'
26-Jan-2018 22:59:27 2018-01-26 22:59:27.588  INFO 15800 --- [       Thread-2] o.s.j.d.e.EmbeddedDatabaseFactory        : Shutting down embedded database: url='jdbc:h2:mem:testdb;DB_CLOSE_DELAY=-1;DB_CLOSE_ON_EXIT=false'
26-Jan-2018 22:59:27 2018-01-26 22:59:27.588  INFO 15800 --- [      Thread-10] o.s.i.channel.PublishSubscribeChannel    : Channel 'application.errorChannel' has 0 subscriber(s).
26-Jan-2018 22:59:27 2018-01-26 22:59:27.588  INFO 15800 --- [      Thread-10] o.s.i.endpoint.EventDrivenConsumer       : stopped _org.springframework.integration.errorLogger
26-Jan-2018 22:59:27 2018-01-26 22:59:27.588  INFO 15800 --- [      Thread-10] o.s.c.support.DefaultLifecycleProcessor  : Stopping beans in phase -2147482648
26-Jan-2018 22:59:27 2018-01-26 22:59:27.589  INFO 15800 --- [       Thread-8] o.s.i.channel.PublishSubscribeChannel    : Channel 'application.errorChannel' has 0 subscriber(s).
26-Jan-2018 22:59:27 2018-01-26 22:59:27.590  INFO 15800 --- [       Thread-8] o.s.i.endpoint.EventDrivenConsumer       : stopped _org.springframework.integration.errorLogger
26-Jan-2018 22:59:27 2018-01-26 22:59:27.590  INFO 15800 --- [       Thread-8] o.s.c.support.DefaultLifecycleProcessor  : Stopping beans in phase -2147482648
26-Jan-2018 22:59:27 2018-01-26 22:59:27.603  INFO 15800 --- [       Thread-9] o.s.s.c.ThreadPoolTaskScheduler          : Shutting down ExecutorService 'taskScheduler'
26-Jan-2018 22:59:27 2018-01-26 22:59:27.603  INFO 15800 --- [      Thread-14] o.s.s.c.ThreadPoolTaskScheduler          : Shutting down ExecutorService 'taskScheduler'
26-Jan-2018 22:59:27 2018-01-26 22:59:27.603  INFO 15800 --- [      Thread-10] o.s.s.c.ThreadPoolTaskScheduler          : Shutting down ExecutorService 'taskScheduler'
26-Jan-2018 22:59:27 2018-01-26 22:59:27.603  INFO 15800 --- [       Thread-8] o.s.s.c.ThreadPoolTaskScheduler          : Shutting down ExecutorService 'taskScheduler'
26-Jan-2018 22:59:27 2018-01-26 22:59:27.603  INFO 15800 --- [      Thread-13] o.s.s.c.ThreadPoolTaskScheduler          : Shutting down ExecutorService 'taskScheduler'
26-Jan-2018 22:59:27 2018-01-26 22:59:27.603  INFO 15800 --- [      Thread-11] o.s.s.c.ThreadPoolTaskScheduler          : Shutting down ExecutorService 'taskScheduler'
26-Jan-2018 22:59:27 2018-01-26 22:59:27.603  INFO 15800 --- [      Thread-12] o.s.s.c.ThreadPoolTaskScheduler          : Shutting down ExecutorService 'taskScheduler'
26-Jan-2018 22:59:27 2018-01-26 22:59:27.602  INFO 15800 --- [       Thread-5] o.s.i.channel.PublishSubscribeChannel    : Channel 'application.errorChannel' has 0 subscriber(s).
26-Jan-2018 22:59:27 2018-01-26 22:59:27.604  INFO 15800 --- [       Thread-5] o.s.i.endpoint.EventDrivenConsumer       : stopped _org.springframework.integration.errorLogger
26-Jan-2018 22:59:27 2018-01-26 22:59:27.604  INFO 15800 --- [       Thread-5] o.s.c.support.DefaultLifecycleProcessor  : Stopping beans in phase -2147482648
26-Jan-2018 22:59:27 2018-01-26 22:59:27.602  INFO 15800 --- [       Thread-4] o.s.i.channel.PublishSubscribeChannel    : Channel 'application.errorChannel' has 0 subscriber(s).
26-Jan-2018 22:59:27 2018-01-26 22:59:27.605  INFO 15800 --- [       Thread-5] o.s.s.c.ThreadPoolTaskScheduler          : Shutting down ExecutorService 'taskScheduler'
26-Jan-2018 22:59:27 2018-01-26 22:59:27.605  INFO 15800 --- [       Thread-4] o.s.i.endpoint.EventDrivenConsumer       : stopped _org.springframework.integration.errorLogger
26-Jan-2018 22:59:27 2018-01-26 22:59:27.605  INFO 15800 --- [       Thread-4] o.s.c.support.DefaultLifecycleProcessor  : Stopping beans in phase -2147482648
26-Jan-2018 22:59:27 2018-01-26 22:59:27.606  INFO 15800 --- [       Thread-4] o.s.s.c.ThreadPoolTaskScheduler          : Shutting down ExecutorService 'taskScheduler'
26-Jan-2018 22:59:27
26-Jan-2018 22:59:27 Results :
26-Jan-2018 22:59:27
26-Jan-2018 22:59:27 Tests in error:
26-Jan-2018 22:59:27   testPostProcessor(org.springframework.cloud.task.batch.listener.TaskBatchEventListenerBeanPostProcessorTests): Failed to load ApplicationContext
26-Jan-2018 22:59:27   testNoTaskLauncher(org.springframework.cloud.task.launcher.TaskLauncherSinkTests): Failed to load ApplicationContext
26-Jan-2018 22:59:27   testNoRun(org.springframework.cloud.task.launcher.TaskLauncherSinkTests): Failed to load ApplicationContext
26-Jan-2018 22:59:27   testSuccessWithAppName(org.springframework.cloud.task.launcher.TaskLauncherSinkTests): Failed to load ApplicationContext
26-Jan-2018 22:59:27   testSuccessNoParams(org.springframework.cloud.task.launcher.TaskLauncherSinkTests): Failed to load ApplicationContext
26-Jan-2018 22:59:27   testSuccessWithParams(org.springframework.cloud.task.launcher.TaskLauncherSinkTests): Failed to load ApplicationContext
26-Jan-2018 22:59:27   testInvalidJar(org.springframework.cloud.task.launcher.TaskLauncherSinkTests): Failed to load ApplicationContext
26-Jan-2018 22:59:27
26-Jan-2018 22:59:27 Tests run: 79, Failures: 0, Errors: 7, Skipped: 0
26-Jan-2018 22:59:27
26-Jan-2018 22:59:27 [INFO] ------------------------------------------------------------------------
26-Jan-2018 22:59:27 [INFO] Reactor Summary:
26-Jan-2018 22:59:27 [INFO]
26-Jan-2018 22:59:27 [INFO] Spring Cloud Task Dependencies ..................... SUCCESS [  0.317 s]
26-Jan-2018 22:59:27 [INFO] Spring Cloud Task Build ............................ SUCCESS [  2.347 s]
26-Jan-2018 22:59:27 [INFO] Spring Cloud Task Core ............................. SUCCESS [ 37.164 s]
26-Jan-2018 22:59:27 [INFO] Spring Cloud Task Batch ............................ SUCCESS [ 54.529 s]
26-Jan-2018 22:59:27 [INFO] Spring Cloud Task Stream ........................... FAILURE [ 38.768 s]
26-Jan-2018 22:59:27 [INFO] Spring Cloud Task Starter .......................... SKIPPED
26-Jan-2018 22:59:27 [INFO] Timestamp Task ..................................... SKIPPED
26-Jan-2018 22:59:27 [INFO] Batch Job Sample Application ....................... SKIPPED
26-Jan-2018 22:59:27 [INFO] Task Sink Sample Application ....................... SKIPPED
26-Jan-2018 22:59:27 [INFO] Task Processor Sample Application .................. SKIPPED
26-Jan-2018 22:59:27 [INFO] Partitioned Batch Job .............................. SKIPPED
26-Jan-2018 22:59:27 [INFO] Task Events ........................................ SKIPPED
26-Jan-2018 22:59:27 [INFO] Batch Events Sample Application .................... SKIPPED
26-Jan-2018 22:59:27 [INFO] Spring Cloud Task JPA Sample Application ........... SKIPPED
26-Jan-2018 22:59:27 [INFO] Spring Cloud Task Samples .......................... SKIPPED
26-Jan-2018 22:59:27 [INFO] Spring Cloud Task Integration Tests ................ SKIPPED
26-Jan-2018 22:59:27 [INFO] Spring Cloud Task Docs ............................. SKIPPED
26-Jan-2018 22:59:27 [INFO] ------------------------------------------------------------------------
26-Jan-2018 22:59:27 [INFO] BUILD FAILURE
26-Jan-2018 22:59:27 [INFO] ------------------------------------------------------------------------
26-Jan-2018 22:59:27 [INFO] Total time: 02:18 min
26-Jan-2018 22:59:27 [INFO] Finished at: 2018-01-26T22:59:27Z
26-Jan-2018 22:59:28 [INFO] Final Memory: 94M/556M
26-Jan-2018 22:59:28 [INFO] ------------------------------------------------------------------------
26-Jan-2018 22:59:28 [ERROR] Failed to execute goal org.apache.maven.plugins:maven-surefire-plugin:2.12.4:test (default-test) on project spring-cloud-task-stream: There are test failures.
26-Jan-2018 22:59:28 [ERROR]
26-Jan-2018 22:59:28 [ERROR] Please refer to /opt/bamboo-home/xml-data/build-dir/SCT-STASK-JOB1/spring-cloud-task-stream/target/surefire-reports for the individual test results.
26-Jan-2018 22:59:28 [ERROR] -> [Help 1]
26-Jan-2018 22:59:28 [ERROR]
26-Jan-2018 22:59:28 [ERROR] To see the full stack trace of the errors, re-run Maven with the -e switch.
26-Jan-2018 22:59:28 [ERROR] Re-run Maven using the -X switch to enable full debug logging.
26-Jan-2018 22:59:28 [ERROR]
26-Jan-2018 22:59:28 [ERROR] For more information about the errors and possible solutions, please read the following articles:
26-Jan-2018 22:59:28 [ERROR] [Help 1] http://cwiki.apache.org/confluence/display/MAVEN/MojoFailureException
26-Jan-2018 22:59:28 [ERROR]
26-Jan-2018 22:59:28 [ERROR] After correcting the problems, you can resume the build with the command
26-Jan-2018 22:59:28 [ERROR]   mvn <goals> -rf :spring-cloud-task-stream
26-Jan-2018 22:59:28
26-Jan-2018 22:59:28 Finished task 'Build and publish Spring Cloud Task Modules' with result: Failed
26-Jan-2018 22:59:28 Running post build plugin 'Docker Container Cleanup'
26-Jan-2018 22:59:28 Running post build plugin 'NCover Results Collector'
26-Jan-2018 22:59:28 Running post build plugin 'Artifactory Release Management Staging'
26-Jan-2018 22:59:28 Running post build plugin 'Artifactory Build Info Copier'
26-Jan-2018 22:59:28 Running post build plugin 'Artifactory Gradle Properties Info Copier'
26-Jan-2018 22:59:28 Running post build plugin 'Clover Results Collector'
26-Jan-2018 22:59:28 Running post build plugin 'npm Cache Cleanup'
26-Jan-2018 22:59:28 Running post build plugin 'Artifact Copier'
26-Jan-2018 22:59:28 Publishing an artifact: Test Results
26-Jan-2018 22:59:28 Finished publishing of artifact Shared artifact: [Test Results], pattern: [**/target/surefire-reports/**/*.*] in 127.1 ms
26-Jan-2018 22:59:28 Finalising the build...
26-Jan-2018 22:59:28 Stopping timer.
26-Jan-2018 22:59:28 Build SCT-STASK-JOB1-365 completed.
26-Jan-2018 22:59:28 Running on server: post build plugin 'NCover Results Collector'
26-Jan-2018 22:59:28 Running on server: post build plugin 'Build Hanging Detection Configuration'
26-Jan-2018 22:59:28 Running on server: post build plugin 'Clover Delta Calculator'
26-Jan-2018 22:59:28 Running on server: post build plugin 'Maven Dependencies Postprocessor'
26-Jan-2018 22:59:28 All post build plugins have finished
26-Jan-2018 22:59:28 Generating build results summary...
26-Jan-2018 22:59:28 Saving build results to disk...
26-Jan-2018 22:59:28 Logging substituted variables...
26-Jan-2018 22:59:28 Indexing build results...
26-Jan-2018 22:59:28 Finished building SCT-STASK-JOB1-365.