Build #403

Builds the Spring Cloud Task project

Build: #403 failed

Job: Build Spring Cloud Task Project failed

Stages & jobs

  1. Default Stage

Build log

The build generated 18,074 lines of output.The output is too long and has been truncated to the last 1,000 lines. Download or view full build log

06-May-2018 14:57:13 Progress (1): 19/20 MB
06-May-2018 14:57:13 Progress (1): 19/20 MB
06-May-2018 14:57:13 Progress (1): 19/20 MB
06-May-2018 14:57:13 Progress (1): 19/20 MB
06-May-2018 14:57:13 Progress (1): 19/20 MB
06-May-2018 14:57:13 Progress (1): 19/20 MB
06-May-2018 14:57:13 Progress (1): 19/20 MB
06-May-2018 14:57:13 Progress (1): 19/20 MB
06-May-2018 14:57:13 Progress (1): 19/20 MB
06-May-2018 14:57:13 Progress (1): 19/20 MB
06-May-2018 14:57:13 Progress (1): 19/20 MB
06-May-2018 14:57:13 Progress (1): 19/20 MB
06-May-2018 14:57:13 Progress (1): 19/20 MB
06-May-2018 14:57:13 Progress (1): 19/20 MB
06-May-2018 14:57:13 Progress (1): 19/20 MB
06-May-2018 14:57:13 Progress (1): 19/20 MB
06-May-2018 14:57:13 Progress (1): 19/20 MB
06-May-2018 14:57:13 Progress (1): 19/20 MB
06-May-2018 14:57:13 Progress (1): 19/20 MB
06-May-2018 14:57:13 Progress (1): 19/20 MB
06-May-2018 14:57:13 Progress (1): 19/20 MB
06-May-2018 14:57:13 Progress (1): 19/20 MB
06-May-2018 14:57:13 Progress (1): 19/20 MB
06-May-2018 14:57:13 Progress (1): 19/20 MB
06-May-2018 14:57:13 Progress (1): 19/20 MB
06-May-2018 14:57:13 Progress (1): 19/20 MB
06-May-2018 14:57:13 Progress (1): 19/20 MB
06-May-2018 14:57:13 Progress (1): 19/20 MB
06-May-2018 14:57:13 Progress (1): 19/20 MB
06-May-2018 14:57:13 Progress (1): 19/20 MB
06-May-2018 14:57:13 Progress (1): 19/20 MB
06-May-2018 14:57:13 Progress (1): 19/20 MB
06-May-2018 14:57:13 Progress (1): 19/20 MB
06-May-2018 14:57:13 Progress (1): 19/20 MB
06-May-2018 14:57:13 Progress (1): 19/20 MB
06-May-2018 14:57:13 Progress (1): 19/20 MB
06-May-2018 14:57:13 Progress (1): 19/20 MB
06-May-2018 14:57:13 Progress (1): 19/20 MB
06-May-2018 14:57:13 Progress (1): 19/20 MB
06-May-2018 14:57:13 Progress (1): 19/20 MB
06-May-2018 14:57:13 Progress (1): 19/20 MB
06-May-2018 14:57:13 Progress (1): 19/20 MB
06-May-2018 14:57:13 Progress (1): 19/20 MB
06-May-2018 14:57:13 Progress (1): 19/20 MB
06-May-2018 14:57:13 Progress (1): 19/20 MB
06-May-2018 14:57:13 Progress (1): 19/20 MB
06-May-2018 14:57:13 Progress (1): 19/20 MB
06-May-2018 14:57:13 Progress (1): 19/20 MB
06-May-2018 14:57:13 Progress (1): 19/20 MB
06-May-2018 14:57:13 Progress (1): 19/20 MB
06-May-2018 14:57:13 Progress (1): 19/20 MB
06-May-2018 14:57:13 Progress (1): 19/20 MB
06-May-2018 14:57:13 Progress (1): 19/20 MB
06-May-2018 14:57:13 Progress (1): 19/20 MB
06-May-2018 14:57:13 Progress (1): 19/20 MB
06-May-2018 14:57:13 Progress (1): 19/20 MB
06-May-2018 14:57:13 Progress (1): 19/20 MB
06-May-2018 14:57:13 Progress (1): 19/20 MB
06-May-2018 14:57:13 Progress (1): 19/20 MB
06-May-2018 14:57:13 Progress (1): 19/20 MB
06-May-2018 14:57:13 Progress (1): 19/20 MB
06-May-2018 14:57:13 Progress (1): 19/20 MB
06-May-2018 14:57:13 Progress (1): 19/20 MB
06-May-2018 14:57:13 Progress (1): 19/20 MB
06-May-2018 14:57:13 Progress (1): 19/20 MB
06-May-2018 14:57:13 Progress (1): 19/20 MB
06-May-2018 14:57:13 Progress (1): 19/20 MB
06-May-2018 14:57:13 Progress (1): 19/20 MB
06-May-2018 14:57:13 Progress (1): 19/20 MB
06-May-2018 14:57:13 Progress (1): 19/20 MB
06-May-2018 14:57:13 Progress (1): 19/20 MB
06-May-2018 14:57:13 Progress (1): 19/20 MB
06-May-2018 14:57:13 Progress (1): 19/20 MB
06-May-2018 14:57:13 Progress (1): 19/20 MB
06-May-2018 14:57:13 Progress (1): 19/20 MB
06-May-2018 14:57:13 Progress (1): 19/20 MB
06-May-2018 14:57:13 Progress (1): 19/20 MB
06-May-2018 14:57:13 Progress (1): 19/20 MB
06-May-2018 14:57:13 Progress (1): 19/20 MB
06-May-2018 14:57:13 Progress (1): 19/20 MB
06-May-2018 14:57:13 Progress (1): 19/20 MB
06-May-2018 14:57:13 Progress (1): 19/20 MB
06-May-2018 14:57:13 Progress (1): 19/20 MB
06-May-2018 14:57:13 Progress (1): 19/20 MB
06-May-2018 14:57:13 Progress (1): 19/20 MB
06-May-2018 14:57:13 Progress (1): 19/20 MB
06-May-2018 14:57:13 Progress (1): 19/20 MB
06-May-2018 14:57:13 Progress (1): 19/20 MB
06-May-2018 14:57:13 Progress (1): 19/20 MB
06-May-2018 14:57:13 Progress (1): 19/20 MB
06-May-2018 14:57:13 Progress (1): 19/20 MB
06-May-2018 14:57:13 Progress (1): 19/20 MB
06-May-2018 14:57:13 Progress (1): 19/20 MB
06-May-2018 14:57:13 Progress (1): 19/20 MB
06-May-2018 14:57:13 Progress (1): 19/20 MB
06-May-2018 14:57:13 Progress (1): 19/20 MB
06-May-2018 14:57:13 Progress (1): 19/20 MB
06-May-2018 14:57:13 Progress (1): 19/20 MB
06-May-2018 14:57:13 Progress (1): 19/20 MB
06-May-2018 14:57:13 Progress (1): 19/20 MB
06-May-2018 14:57:13 Progress (1): 19/20 MB
06-May-2018 14:57:13 Progress (1): 19/20 MB
06-May-2018 14:57:13 Progress (1): 19/20 MB
06-May-2018 14:57:13 Progress (1): 19/20 MB
06-May-2018 14:57:13 Progress (1): 19/20 MB
06-May-2018 14:57:13 Progress (1): 19/20 MB
06-May-2018 14:57:13 Progress (1): 19/20 MB
06-May-2018 14:57:13 Progress (1): 19/20 MB
06-May-2018 14:57:13 Progress (1): 19/20 MB
06-May-2018 14:57:13 Progress (1): 19/20 MB
06-May-2018 14:57:13 Progress (1): 19/20 MB
06-May-2018 14:57:13 Progress (1): 19/20 MB
06-May-2018 14:57:13 Progress (1): 19/20 MB
06-May-2018 14:57:13 Progress (1): 19/20 MB
06-May-2018 14:57:13 Progress (1): 19/20 MB
06-May-2018 14:57:13 Progress (1): 19/20 MB
06-May-2018 14:57:13 Progress (1): 19/20 MB
06-May-2018 14:57:13 Progress (1): 19/20 MB
06-May-2018 14:57:13 Progress (1): 19/20 MB
06-May-2018 14:57:13 Progress (1): 19/20 MB
06-May-2018 14:57:13 Progress (1): 19/20 MB
06-May-2018 14:57:13 Progress (1): 19/20 MB
06-May-2018 14:57:13 Progress (1): 19/20 MB
06-May-2018 14:57:13 Progress (1): 19/20 MB
06-May-2018 14:57:13 Progress (1): 19/20 MB
06-May-2018 14:57:13 Progress (1): 19/20 MB
06-May-2018 14:57:13 Progress (1): 19/20 MB
06-May-2018 14:57:13 Progress (1): 19/20 MB
06-May-2018 14:57:13 Progress (1): 19/20 MB
06-May-2018 14:57:13 Progress (1): 19/20 MB
06-May-2018 14:57:13 Progress (1): 19/20 MB
06-May-2018 14:57:13 Progress (1): 19/20 MB
06-May-2018 14:57:13 Progress (1): 19/20 MB
06-May-2018 14:57:13 Progress (1): 19/20 MB
06-May-2018 14:57:13 Progress (1): 19/20 MB
06-May-2018 14:57:13 Progress (1): 19/20 MB
06-May-2018 14:57:13 Progress (1): 19/20 MB
06-May-2018 14:57:13 Progress (1): 19/20 MB
06-May-2018 14:57:13 Progress (1): 19/20 MB
06-May-2018 14:57:13 Progress (1): 19/20 MB
06-May-2018 14:57:13 Progress (1): 19/20 MB
06-May-2018 14:57:13 Progress (1): 19/20 MB
06-May-2018 14:57:13 Progress (1): 19/20 MB
06-May-2018 14:57:13 Progress (1): 19/20 MB
06-May-2018 14:57:13 Progress (1): 19/20 MB
06-May-2018 14:57:13 Progress (1): 19/20 MB
06-May-2018 14:57:13 Progress (1): 19/20 MB
06-May-2018 14:57:13 Progress (1): 19/20 MB
06-May-2018 14:57:13 Progress (1): 19/20 MB
06-May-2018 14:57:13 Progress (1): 19/20 MB
06-May-2018 14:57:13 Progress (1): 19/20 MB
06-May-2018 14:57:13 Progress (1): 19/20 MB
06-May-2018 14:57:13 Progress (1): 19/20 MB
06-May-2018 14:57:13 Progress (1): 19/20 MB
06-May-2018 14:57:13 Progress (1): 19/20 MB
06-May-2018 14:57:13 Progress (1): 19/20 MB
06-May-2018 14:57:13 Progress (1): 19/20 MB
06-May-2018 14:57:13 Progress (1): 19/20 MB
06-May-2018 14:57:13 Progress (1): 19/20 MB
06-May-2018 14:57:13 Progress (1): 19/20 MB
06-May-2018 14:57:13 Progress (1): 19/20 MB
06-May-2018 14:57:13 Progress (1): 19/20 MB
06-May-2018 14:57:13 Progress (1): 19/20 MB
06-May-2018 14:57:13 Progress (1): 19/20 MB
06-May-2018 14:57:13 Progress (1): 19/20 MB
06-May-2018 14:57:13 Progress (1): 19/20 MB
06-May-2018 14:57:13 Progress (1): 19/20 MB
06-May-2018 14:57:13 Progress (1): 19/20 MB
06-May-2018 14:57:13 Progress (1): 19/20 MB
06-May-2018 14:57:13 Progress (1): 19/20 MB
06-May-2018 14:57:13 Progress (1): 19/20 MB
06-May-2018 14:57:13 Progress (1): 19/20 MB
06-May-2018 14:57:13 Progress (1): 19/20 MB
06-May-2018 14:57:13 Progress (1): 19/20 MB
06-May-2018 14:57:13 Progress (1): 19/20 MB
06-May-2018 14:57:13 Progress (1): 19/20 MB
06-May-2018 14:57:13 Progress (1): 19/20 MB
06-May-2018 14:57:13 Progress (1): 19/20 MB
06-May-2018 14:57:13 Progress (1): 19/20 MB
06-May-2018 14:57:13 Progress (1): 19/20 MB
06-May-2018 14:57:13 Progress (1): 19/20 MB
06-May-2018 14:57:13 Progress (1): 19/20 MB
06-May-2018 14:57:13 Progress (1): 19/20 MB
06-May-2018 14:57:13 Progress (1): 19/20 MB
06-May-2018 14:57:13 Progress (1): 19/20 MB
06-May-2018 14:57:13 Progress (1): 19/20 MB
06-May-2018 14:57:13 Progress (1): 19/20 MB
06-May-2018 14:57:13 Progress (1): 19/20 MB
06-May-2018 14:57:13 Progress (1): 19/20 MB
06-May-2018 14:57:13 Progress (1): 19/20 MB
06-May-2018 14:57:13 Progress (1): 19/20 MB
06-May-2018 14:57:13 Progress (1): 19/20 MB
06-May-2018 14:57:13 Progress (1): 19/20 MB
06-May-2018 14:57:13 Progress (1): 19/20 MB
06-May-2018 14:57:13 Progress (1): 19/20 MB
06-May-2018 14:57:13 Progress (1): 19/20 MB
06-May-2018 14:57:13 Progress (1): 19/20 MB
06-May-2018 14:57:13 Progress (1): 19/20 MB
06-May-2018 14:57:13 Progress (1): 19/20 MB
06-May-2018 14:57:13 Progress (1): 19/20 MB
06-May-2018 14:57:13 Progress (1): 19/20 MB
06-May-2018 14:57:13 Progress (1): 19/20 MB
06-May-2018 14:57:13 Progress (1): 19/20 MB
06-May-2018 14:57:13 Progress (1): 19/20 MB
06-May-2018 14:57:13 Progress (1): 19/20 MB
06-May-2018 14:57:13 Progress (1): 19/20 MB
06-May-2018 14:57:13 Progress (1): 19/20 MB
06-May-2018 14:57:13 Progress (1): 19/20 MB
06-May-2018 14:57:13 Progress (1): 19/20 MB
06-May-2018 14:57:13 Progress (1): 19/20 MB
06-May-2018 14:57:13 Progress (1): 19/20 MB
06-May-2018 14:57:13 Progress (1): 19/20 MB
06-May-2018 14:57:13 Progress (1): 19/20 MB
06-May-2018 14:57:13 Progress (1): 19/20 MB
06-May-2018 14:57:13 Progress (1): 19/20 MB
06-May-2018 14:57:13 Progress (1): 19/20 MB
06-May-2018 14:57:13 Progress (1): 19/20 MB
06-May-2018 14:57:13 Progress (1): 19/20 MB
06-May-2018 14:57:13 Progress (1): 19/20 MB
06-May-2018 14:57:13 Progress (1): 20/20 MB
06-May-2018 14:57:13 Progress (1): 20/20 MB
06-May-2018 14:57:14 Progress (1): 20/20 MB
06-May-2018 14:57:14 Progress (1): 20/20 MB
06-May-2018 14:57:14 Progress (1): 20/20 MB
06-May-2018 14:57:14 Progress (1): 20/20 MB
06-May-2018 14:57:14 Progress (1): 20/20 MB
06-May-2018 14:57:14 Progress (1): 20/20 MB
06-May-2018 14:57:14 Progress (1): 20/20 MB
06-May-2018 14:57:14 Progress (1): 20/20 MB
06-May-2018 14:57:14 Progress (1): 20/20 MB
06-May-2018 14:57:14 Progress (1): 20/20 MB
06-May-2018 14:57:14 Progress (1): 20/20 MB
06-May-2018 14:57:14 Progress (1): 20/20 MB
06-May-2018 14:57:14 Progress (1): 20/20 MB
06-May-2018 14:57:14 Progress (1): 20/20 MB
06-May-2018 14:57:14 Progress (1): 20/20 MB
06-May-2018 14:57:14 Progress (1): 20/20 MB
06-May-2018 14:57:14 Progress (1): 20/20 MB
06-May-2018 14:57:14 Progress (1): 20/20 MB
06-May-2018 14:57:14 Progress (1): 20/20 MB
06-May-2018 14:57:14 Progress (1): 20/20 MB
06-May-2018 14:57:14 Progress (1): 20/20 MB
06-May-2018 14:57:14 Progress (1): 20/20 MB
06-May-2018 14:57:14 Progress (1): 20/20 MB
06-May-2018 14:57:14 Progress (1): 20/20 MB
06-May-2018 14:57:14 Progress (1): 20/20 MB
06-May-2018 14:57:14 Progress (1): 20/20 MB
06-May-2018 14:57:14 Progress (1): 20/20 MB
06-May-2018 14:57:14 Progress (1): 20/20 MB
06-May-2018 14:57:14 Progress (1): 20/20 MB
06-May-2018 14:57:14 Progress (1): 20/20 MB
06-May-2018 14:57:14 Progress (1): 20/20 MB
06-May-2018 14:57:14 Progress (1): 20/20 MB
06-May-2018 14:57:14 Progress (1): 20/20 MB
06-May-2018 14:57:14 Progress (1): 20/20 MB
06-May-2018 14:57:14 Progress (1): 20/20 MB
06-May-2018 14:57:14 Progress (1): 20/20 MB
06-May-2018 14:57:14 Progress (1): 20/20 MB
06-May-2018 14:57:14 Progress (1): 20/20 MB
06-May-2018 14:57:14 Progress (1): 20/20 MB
06-May-2018 14:57:14 Progress (1): 20/20 MB
06-May-2018 14:57:14 Progress (1): 20/20 MB
06-May-2018 14:57:14 Progress (1): 20/20 MB
06-May-2018 14:57:14 Progress (1): 20/20 MB
06-May-2018 14:57:14 Progress (1): 20/20 MB
06-May-2018 14:57:14 Progress (1): 20/20 MB
06-May-2018 14:57:14 Progress (1): 20/20 MB
06-May-2018 14:57:14 Progress (1): 20/20 MB
06-May-2018 14:57:14 Progress (1): 20/20 MB
06-May-2018 14:57:14 Progress (1): 20/20 MB
06-May-2018 14:57:14 Progress (1): 20/20 MB
06-May-2018 14:57:14 Progress (1): 20/20 MB
06-May-2018 14:57:14 Progress (1): 20/20 MB
06-May-2018 14:57:14 Progress (1): 20/20 MB
06-May-2018 14:57:14 Progress (1): 20/20 MB
06-May-2018 14:57:14 Progress (1): 20/20 MB
06-May-2018 14:57:14 Progress (1): 20/20 MB
06-May-2018 14:57:14 Progress (1): 20/20 MB
06-May-2018 14:57:14 Progress (1): 20/20 MB
06-May-2018 14:57:14 Progress (1): 20/20 MB
06-May-2018 14:57:14 Progress (1): 20/20 MB
06-May-2018 14:57:14 Progress (1): 20/20 MB
06-May-2018 14:57:14 Progress (1): 20/20 MB
06-May-2018 14:57:14 Progress (1): 20/20 MB
06-May-2018 14:57:14 Progress (1): 20/20 MB
06-May-2018 14:57:14 Progress (1): 20/20 MB
06-May-2018 14:57:14 Progress (1): 20/20 MB
06-May-2018 14:57:14 Progress (1): 20/20 MB
06-May-2018 14:57:14 Progress (1): 20/20 MB
06-May-2018 14:57:14 Progress (1): 20/20 MB
06-May-2018 14:57:14 Progress (1): 20/20 MB
06-May-2018 14:57:14 Progress (1): 20/20 MB
06-May-2018 14:57:14 Progress (1): 20/20 MB
06-May-2018 14:57:14 Progress (1): 20/20 MB
06-May-2018 14:57:14 Progress (1): 20/20 MB
06-May-2018 14:57:14 Progress (1): 20/20 MB
06-May-2018 14:57:14 Progress (1): 20/20 MB
06-May-2018 14:57:14 Progress (1): 20/20 MB
06-May-2018 14:57:14 Progress (1): 20/20 MB
06-May-2018 14:57:14 Progress (1): 20/20 MB
06-May-2018 14:57:14 Progress (1): 20/20 MB
06-May-2018 14:57:14 Progress (1): 20/20 MB
06-May-2018 14:57:14 Progress (1): 20/20 MB
06-May-2018 14:57:14 Progress (1): 20/20 MB
06-May-2018 14:57:14 Progress (1): 20/20 MB
06-May-2018 14:57:14 Progress (1): 20/20 MB
06-May-2018 14:57:14 Progress (1): 20/20 MB
06-May-2018 14:57:14 Progress (1): 20/20 MB
06-May-2018 14:57:14 Progress (1): 20/20 MB
06-May-2018 14:57:14 Progress (1): 20/20 MB
06-May-2018 14:57:14 Progress (1): 20/20 MB
06-May-2018 14:57:14 Progress (1): 20/20 MB
06-May-2018 14:57:14 Progress (1): 20/20 MB
06-May-2018 14:57:14 Progress (1): 20/20 MB
06-May-2018 14:57:14 Progress (1): 20/20 MB
06-May-2018 14:57:14 Progress (1): 20/20 MB
06-May-2018 14:57:14 Progress (1): 20/20 MB
06-May-2018 14:57:14 Progress (1): 20/20 MB
06-May-2018 14:57:14 Progress (1): 20/20 MB
06-May-2018 14:57:14 Progress (1): 20/20 MB
06-May-2018 14:57:14 Progress (1): 20/20 MB
06-May-2018 14:57:14 Progress (1): 20/20 MB
06-May-2018 14:57:14 Progress (1): 20/20 MB
06-May-2018 14:57:14 Progress (1): 20/20 MB
06-May-2018 14:57:14 Progress (1): 20/20 MB
06-May-2018 14:57:14 Progress (1): 20/20 MB
06-May-2018 14:57:14 Progress (1): 20/20 MB
06-May-2018 14:57:14 Progress (1): 20/20 MB
06-May-2018 14:57:14 Progress (1): 20/20 MB
06-May-2018 14:57:14 Progress (1): 20/20 MB
06-May-2018 14:57:14 Progress (1): 20/20 MB
06-May-2018 14:57:14 Progress (1): 20/20 MB
06-May-2018 14:57:14 Progress (1): 20/20 MB
06-May-2018 14:57:14 Progress (1): 20/20 MB
06-May-2018 14:57:14 Progress (1): 20/20 MB
06-May-2018 14:57:14 Progress (1): 20/20 MB
06-May-2018 14:57:14 Progress (1): 20/20 MB
06-May-2018 14:57:14 Progress (1): 20/20 MB
06-May-2018 14:57:14 Progress (1): 20/20 MB
06-May-2018 14:57:14 Progress (1): 20/20 MB
06-May-2018 14:57:14 Progress (1): 20/20 MB
06-May-2018 14:57:14 Progress (1): 20/20 MB
06-May-2018 14:57:14 Progress (1): 20/20 MB
06-May-2018 14:57:14 Progress (1): 20/20 MB
06-May-2018 14:57:14 Progress (1): 20/20 MB
06-May-2018 14:57:14 Progress (1): 20/20 MB
06-May-2018 14:57:14 Progress (1): 20/20 MB
06-May-2018 14:57:14 Progress (1): 20/20 MB
06-May-2018 14:57:14 Progress (1): 20/20 MB
06-May-2018 14:57:14 Progress (1): 20/20 MB
06-May-2018 14:57:14 Progress (1): 20/20 MB
06-May-2018 14:57:14 Progress (1): 20/20 MB
06-May-2018 14:57:14 Progress (1): 20/20 MB
06-May-2018 14:57:14 Progress (1): 20/20 MB
06-May-2018 14:57:14 Progress (1): 20/20 MB
06-May-2018 14:57:14 Progress (1): 20/20 MB
06-May-2018 14:57:14 Progress (1): 20/20 MB
06-May-2018 14:57:14 Progress (1): 20/20 MB
06-May-2018 14:57:14 Progress (1): 20/20 MB
06-May-2018 14:57:14 Progress (1): 20/20 MB
06-May-2018 14:57:14 Progress (1): 20/20 MB
06-May-2018 14:57:14 Progress (1): 20/20 MB
06-May-2018 14:57:14 Progress (1): 20/20 MB
06-May-2018 14:57:14 Progress (1): 20/20 MB
06-May-2018 14:57:14 Progress (1): 20/20 MB
06-May-2018 14:57:14 Progress (1): 20/20 MB
06-May-2018 14:57:14 Progress (1): 20/20 MB
06-May-2018 14:57:14 Progress (1): 20/20 MB
06-May-2018 14:57:14 Progress (1): 20/20 MB
06-May-2018 14:57:14 Progress (1): 20/20 MB
06-May-2018 14:57:14 Progress (1): 20/20 MB
06-May-2018 14:57:14 Progress (1): 20/20 MB
06-May-2018 14:57:14 Progress (1): 20/20 MB
06-May-2018 14:57:14 Progress (1): 20/20 MB
06-May-2018 14:57:14 Progress (1): 20/20 MB
06-May-2018 14:57:14 Progress (1): 20/20 MB
06-May-2018 14:57:14 Progress (1): 20/20 MB
06-May-2018 14:57:14 Progress (1): 20/20 MB
06-May-2018 14:57:14 Progress (1): 20/20 MB
06-May-2018 14:57:14 Progress (1): 20/20 MB
06-May-2018 14:57:14 Progress (1): 20/20 MB
06-May-2018 14:57:14 Progress (1): 20/20 MB
06-May-2018 14:57:14 Progress (1): 20/20 MB
06-May-2018 14:57:14 Progress (1): 20/20 MB
06-May-2018 14:57:14 Progress (1): 20/20 MB
06-May-2018 14:57:14 Progress (1): 20/20 MB
06-May-2018 14:57:14 Progress (1): 20/20 MB
06-May-2018 14:57:14 Progress (1): 20/20 MB
06-May-2018 14:57:14 Progress (1): 20/20 MB
06-May-2018 14:57:14 Progress (1): 20/20 MB
06-May-2018 14:57:14 Progress (1): 20/20 MB
06-May-2018 14:57:14 Progress (1): 20/20 MB
06-May-2018 14:57:14 Progress (1): 20/20 MB
06-May-2018 14:57:14 Progress (1): 20/20 MB
06-May-2018 14:57:14 Progress (1): 20/20 MB
06-May-2018 14:57:14 Progress (1): 20/20 MB
06-May-2018 14:57:14 Progress (1): 20/20 MB
06-May-2018 14:57:14 Progress (1): 20/20 MB
06-May-2018 14:57:14 Progress (1): 20/20 MB
06-May-2018 14:57:14 Progress (1): 20/20 MB
06-May-2018 14:57:14 Progress (1): 20/20 MB
06-May-2018 14:57:14 Progress (1): 20/20 MB
06-May-2018 14:57:14 Progress (1): 20/20 MB
06-May-2018 14:57:14 Progress (1): 20/20 MB
06-May-2018 14:57:14 Progress (1): 20/20 MB
06-May-2018 14:57:14 Progress (1): 20/20 MB
06-May-2018 14:57:14 Progress (1): 20/20 MB
06-May-2018 14:57:14 Progress (1): 20/20 MB
06-May-2018 14:57:14 Progress (1): 20/20 MB
06-May-2018 14:57:14 Progress (1): 20/20 MB
06-May-2018 14:57:14 Progress (1): 20/20 MB
06-May-2018 14:57:14 Progress (1): 20/20 MB
06-May-2018 14:57:14 Progress (1): 20/20 MB
06-May-2018 14:57:14 Progress (1): 20/20 MB
06-May-2018 14:57:14 Progress (1): 20/20 MB
06-May-2018 14:57:14 Progress (1): 20/20 MB
06-May-2018 14:57:14 Progress (1): 20/20 MB
06-May-2018 14:57:14 Progress (1): 20/20 MB
06-May-2018 14:57:14 Progress (1): 20/20 MB
06-May-2018 14:57:14 Progress (1): 20/20 MB
06-May-2018 14:57:14 Progress (1): 20/20 MB
06-May-2018 14:57:14 Progress (1): 20/20 MB
06-May-2018 14:57:14 Progress (1): 20/20 MB
06-May-2018 14:57:14 Progress (1): 20/20 MB
06-May-2018 14:57:14 Progress (1): 20/20 MB
06-May-2018 14:57:14 Progress (1): 20/20 MB
06-May-2018 14:57:14 Progress (1): 20/20 MB
06-May-2018 14:57:14 Progress (1): 20/20 MB
06-May-2018 14:57:14 Progress (1): 20/20 MB
06-May-2018 14:57:14 Progress (1): 20/20 MB
06-May-2018 14:57:14 Progress (1): 20/20 MB
06-May-2018 14:57:14 Progress (1): 20/20 MB
06-May-2018 14:57:14 Progress (1): 20/20 MB
06-May-2018 14:57:14 Progress (1): 20/20 MB
06-May-2018 14:57:14 Progress (1): 20/20 MB
06-May-2018 14:57:14 Progress (1): 20/20 MB
06-May-2018 14:57:14 Progress (1): 20 MB   
06-May-2018 14:57:14                    
06-May-2018 14:57:14 Downloaded: https://repo.maven.apache.org/maven2/org/jruby/jruby-complete/9.0.0.0/jruby-complete-9.0.0.0.jar (20 MB at 16 MB/s)
06-May-2018 14:57:17 asciidoctor: WARNING: getting-started.adoc: line 81: invalid style for listing block: code
06-May-2018 14:57:18 [INFO] Rendered /opt/bamboo-home/xml-data/build-dir/SCT-STASK-JOB1/spring-cloud-task-docs/src/main/asciidoc/index.adoc
06-May-2018 14:57:18 [INFO]
06-May-2018 14:57:18 [INFO] --- maven-resources-plugin:2.6:resources (default-resources) @ spring-cloud-task-docs ---
06-May-2018 14:57:18 [INFO] Using 'UTF-8' encoding to copy filtered resources.
06-May-2018 14:57:18 [INFO] skip non existing resourceDirectory /opt/bamboo-home/xml-data/build-dir/SCT-STASK-JOB1/spring-cloud-task-docs/src/main/resources
06-May-2018 14:57:18 [INFO] skip non existing resourceDirectory /opt/bamboo-home/xml-data/build-dir/SCT-STASK-JOB1/spring-cloud-task-docs/src/main/resources
06-May-2018 14:57:18 [INFO]
06-May-2018 14:57:18 [INFO] --- maven-compiler-plugin:3.5.1:compile (default-compile) @ spring-cloud-task-docs ---
06-May-2018 14:57:18 [INFO] No sources to compile
06-May-2018 14:57:18 [INFO]
06-May-2018 14:57:18 [INFO] --- maven-resources-plugin:2.6:testResources (default-testResources) @ spring-cloud-task-docs ---
06-May-2018 14:57:18 [INFO] Using 'UTF-8' encoding to copy filtered resources.
06-May-2018 14:57:18 [INFO] skip non existing resourceDirectory /opt/bamboo-home/xml-data/build-dir/SCT-STASK-JOB1/spring-cloud-task-docs/src/test/resources
06-May-2018 14:57:18 [INFO]
06-May-2018 14:57:18 [INFO] --- maven-compiler-plugin:3.5.1:testCompile (default-testCompile) @ spring-cloud-task-docs ---
06-May-2018 14:57:18 [INFO] No sources to compile
06-May-2018 14:57:18 [INFO]
06-May-2018 14:57:18 [INFO] --- maven-surefire-plugin:2.12.4:test (default-test) @ spring-cloud-task-docs ---
06-May-2018 14:57:18 [INFO] No tests to run.
06-May-2018 14:57:18 [INFO]
06-May-2018 14:57:18 [INFO] --- jacoco-maven-plugin:0.7.5.201505241946:report (post-unit-test) @ spring-cloud-task-docs ---
06-May-2018 14:57:18 [INFO] Skipping JaCoCo execution due to missing execution data file:/opt/bamboo-home/xml-data/build-dir/SCT-STASK-JOB1/spring-cloud-task-docs/target/coverage-reports/jacoco-ut.exec
06-May-2018 14:57:18 [INFO]
06-May-2018 14:57:18 [INFO] --- docbkx-maven-plugin:2.0.15:generate-html (html-single) @ spring-cloud-task-docs ---
06-May-2018 14:57:19 [INFO] Processing input file: index.xml
06-May-2018 14:57:20 [INFO] Applying customization parameters after docbkx parameters
06-May-2018 14:57:21 Failed to load image: images/task_schema.png
06-May-2018 14:57:21 Failed to load image: images/task_schema.png
06-May-2018 14:57:21 Failed to load image: images/task_schema.png
06-May-2018 14:57:21 Failed to load image: images/task_schema.png
06-May-2018 14:57:21 [INFO] /opt/bamboo-home/xml-data/build-dir/SCT-STASK-JOB1/spring-cloud-task-docs/target/docbook/htmlsingle/index.html has been generated.
06-May-2018 14:57:21 [INFO] Executing tasks
06-May-2018 14:57:21      [copy] Copying 1 file to /opt/bamboo-home/xml-data/build-dir/SCT-STASK-JOB1/spring-cloud-task-docs/target/contents/reference/htmlsingle
06-May-2018 14:57:21      [copy] Copying 12 files to /opt/bamboo-home/xml-data/build-dir/SCT-STASK-JOB1/spring-cloud-task-docs/target/contents/reference/htmlsingle
06-May-2018 14:57:21 [INFO] Executed tasks
06-May-2018 14:57:21 [INFO]
06-May-2018 14:57:21 [INFO] --- docbkx-maven-plugin:2.0.15:generate-html (html) @ spring-cloud-task-docs ---
06-May-2018 14:57:21 [INFO] Processing input file: index.xml
06-May-2018 14:57:22 [INFO] Applying customization parameters after docbkx parameters
06-May-2018 14:57:22 [INFO] Chunking output.
06-May-2018 14:57:22 Failed to load image: images/task_schema.png
06-May-2018 14:57:22 Failed to load image: images/task_schema.png
06-May-2018 14:57:22 Failed to load image: images/task_schema.png
06-May-2018 14:57:22 Failed to load image: images/task_schema.png
06-May-2018 14:57:22 [INFO] See /opt/bamboo-home/xml-data/build-dir/SCT-STASK-JOB1/spring-cloud-task-docs/target/docbook/html for generated file(s)
06-May-2018 14:57:22 [INFO] Executing tasks
06-May-2018 14:57:22      [copy] Copying 24 files to /opt/bamboo-home/xml-data/build-dir/SCT-STASK-JOB1/spring-cloud-task-docs/target/contents/reference/html
06-May-2018 14:57:22      [copy] Copying 12 files to /opt/bamboo-home/xml-data/build-dir/SCT-STASK-JOB1/spring-cloud-task-docs/target/contents/reference/html
06-May-2018 14:57:22 [INFO] Executed tasks
06-May-2018 14:57:22 [INFO]
06-May-2018 14:57:22 [INFO] --- docbkx-maven-plugin:2.0.15:generate-pdf (pdf) @ spring-cloud-task-docs ---
06-May-2018 14:57:22 [INFO] Processing input file: index.xml
06-May-2018 14:57:23 [INFO] Applying customization parameters after docbkx parameters
06-May-2018 14:57:24 [INFO] targetFileExtension pdf
06-May-2018 14:57:24 [INFO] type fo
06-May-2018 14:57:25 May 06, 2018 2:57:25 PM org.apache.fop.events.LoggingEventListener processEvent
06-May-2018 14:57:25 INFO: An fo:table  (See position 1:42001) is wider than the available room in inline-progression-dimension. Adjusting end-indent based on overconstrained geometry rules (XSL 1.1, ch. 5.3.4)
06-May-2018 14:57:26 May 06, 2018 2:57:26 PM org.apache.fop.events.LoggingEventListener processEvent
06-May-2018 14:57:26 INFO: Rendered page #1.
06-May-2018 14:57:26 May 06, 2018 2:57:26 PM org.apache.fop.events.LoggingEventListener processEvent
06-May-2018 14:57:26 INFO: Rendered page #2.
06-May-2018 14:57:26 May 06, 2018 2:57:26 PM org.apache.fop.events.LoggingEventListener processEvent
06-May-2018 14:57:26 WARNING: Font "Symbol,normal,700" not found. Substituting with "Symbol,normal,400".
06-May-2018 14:57:26 May 06, 2018 2:57:26 PM org.apache.fop.events.LoggingEventListener processEvent
06-May-2018 14:57:26 WARNING: Font "ZapfDingbats,normal,700" not found. Substituting with "ZapfDingbats,normal,400".
06-May-2018 14:57:26 May 06, 2018 2:57:26 PM org.apache.fop.events.LoggingEventListener processEvent
06-May-2018 14:57:26 INFO: Rendered page #3.
06-May-2018 14:57:26 May 06, 2018 2:57:26 PM org.apache.fop.events.LoggingEventListener processEvent
06-May-2018 14:57:26 INFO: Rendered page #4.
06-May-2018 14:57:26 May 06, 2018 2:57:26 PM org.apache.fop.events.LoggingEventListener processEvent
06-May-2018 14:57:26 INFO: Rendered page #5.
06-May-2018 14:57:26 May 06, 2018 2:57:26 PM org.apache.fop.events.LoggingEventListener processEvent
06-May-2018 14:57:26 INFO: Rendered page #6.
06-May-2018 14:57:26 May 06, 2018 2:57:26 PM org.apache.fop.events.LoggingEventListener processEvent
06-May-2018 14:57:26 INFO: Rendered page #7.
06-May-2018 14:57:26 May 06, 2018 2:57:26 PM org.apache.fop.events.LoggingEventListener processEvent
06-May-2018 14:57:26 INFO: Rendered page #8.
06-May-2018 14:57:26 May 06, 2018 2:57:26 PM org.apache.fop.events.LoggingEventListener processEvent
06-May-2018 14:57:26 INFO: Rendered page #9.
06-May-2018 14:57:26 May 06, 2018 2:57:26 PM org.apache.fop.events.LoggingEventListener processEvent
06-May-2018 14:57:26 INFO: Rendered page #10.
06-May-2018 14:57:26 May 06, 2018 2:57:26 PM org.apache.fop.events.LoggingEventListener processEvent
06-May-2018 14:57:26 INFO: Rendered page #11.
06-May-2018 14:57:26 May 06, 2018 2:57:26 PM org.apache.fop.events.LoggingEventListener processEvent
06-May-2018 14:57:26 INFO: Rendered page #12.
06-May-2018 14:57:26 May 06, 2018 2:57:26 PM org.apache.fop.events.LoggingEventListener processEvent
06-May-2018 14:57:26 INFO: Rendered page #13.
06-May-2018 14:57:26 May 06, 2018 2:57:26 PM org.apache.fop.events.LoggingEventListener processEvent
06-May-2018 14:57:26 INFO: Rendered page #14.
06-May-2018 14:57:27 May 06, 2018 2:57:27 PM org.apache.fop.events.LoggingEventListener processEvent
06-May-2018 14:57:27 INFO: Rendered page #15.
06-May-2018 14:57:27 May 06, 2018 2:57:27 PM org.apache.fop.events.LoggingEventListener processEvent
06-May-2018 14:57:27 INFO: Rendered page #16.
06-May-2018 14:57:27 May 06, 2018 2:57:27 PM org.apache.fop.events.LoggingEventListener processEvent
06-May-2018 14:57:27 WARNING: Line 1 of a paragraph overflows the available area by 13686 millipoints. (See position 268:907)
06-May-2018 14:57:27 May 06, 2018 2:57:27 PM org.apache.fop.events.LoggingEventListener processEvent
06-May-2018 14:57:27 WARNING: Line 3 of a paragraph overflows the available area by 37686 millipoints. (See position 268:1749)
06-May-2018 14:57:27 May 06, 2018 2:57:27 PM org.apache.fop.events.LoggingEventListener processEvent
06-May-2018 14:57:27 WARNING: Line 1 of a paragraph overflows the available area by 25686 millipoints. (See position 268:1749)
06-May-2018 14:57:27 May 06, 2018 2:57:27 PM org.apache.fop.events.LoggingEventListener processEvent
06-May-2018 14:57:27 INFO: Rendered page #17.
06-May-2018 14:57:27 May 06, 2018 2:57:27 PM org.apache.fop.events.LoggingEventListener processEvent
06-May-2018 14:57:27 INFO: Rendered page #18.
06-May-2018 14:57:27 May 06, 2018 2:57:27 PM org.apache.fop.events.LoggingEventListener processEvent
06-May-2018 14:57:27 INFO: Rendered page #19.
06-May-2018 14:57:27 May 06, 2018 2:57:27 PM org.apache.fop.events.LoggingEventListener processEvent
06-May-2018 14:57:27 INFO: Rendered page #20.
06-May-2018 14:57:27 May 06, 2018 2:57:27 PM org.apache.fop.events.LoggingEventListener processEvent
06-May-2018 14:57:27 INFO: Rendered page #21.
06-May-2018 14:57:27 May 06, 2018 2:57:27 PM org.apache.fop.events.LoggingEventListener processEvent
06-May-2018 14:57:27 INFO: Rendered page #22.
06-May-2018 14:57:27 May 06, 2018 2:57:27 PM org.apache.fop.events.LoggingEventListener processEvent
06-May-2018 14:57:27 INFO: Rendered page #23.
06-May-2018 14:57:27 May 06, 2018 2:57:27 PM org.apache.fop.events.LoggingEventListener processEvent
06-May-2018 14:57:27 INFO: Rendered page #24.
06-May-2018 14:57:27 May 06, 2018 2:57:27 PM org.apache.fop.events.LoggingEventListener processEvent
06-May-2018 14:57:27 INFO: Rendered page #25.
06-May-2018 14:57:27 May 06, 2018 2:57:27 PM org.apache.fop.events.LoggingEventListener processEvent
06-May-2018 14:57:27 INFO: Rendered page #26.
06-May-2018 14:57:27 May 06, 2018 2:57:27 PM org.apache.fop.events.LoggingEventListener processEvent
06-May-2018 14:57:27 INFO: Rendered page #27.
06-May-2018 14:57:27 May 06, 2018 2:57:27 PM org.apache.fop.events.LoggingEventListener processEvent
06-May-2018 14:57:27 INFO: Rendered page #28.
06-May-2018 14:57:27 May 06, 2018 2:57:27 PM org.apache.fop.events.LoggingEventListener processEvent
06-May-2018 14:57:27 INFO: Rendered page #29.
06-May-2018 14:57:27 May 06, 2018 2:57:27 PM org.apache.fop.events.LoggingEventListener processEvent
06-May-2018 14:57:27 INFO: Rendered page #30.
06-May-2018 14:57:27 May 06, 2018 2:57:27 PM org.apache.fop.events.LoggingEventListener processEvent
06-May-2018 14:57:27 INFO: Rendered page #31.
06-May-2018 14:57:27 May 06, 2018 2:57:27 PM org.apache.fop.events.LoggingEventListener processEvent
06-May-2018 14:57:27 INFO: Rendered page #32.
06-May-2018 14:57:27 May 06, 2018 2:57:27 PM org.apache.fop.events.LoggingEventListener processEvent
06-May-2018 14:57:27 INFO: Rendered page #33.
06-May-2018 14:57:27 May 06, 2018 2:57:27 PM org.apache.fop.events.LoggingEventListener processEvent
06-May-2018 14:57:27 INFO: Rendered page #34.
06-May-2018 14:57:27 May 06, 2018 2:57:27 PM org.apache.fop.events.LoggingEventListener processEvent
06-May-2018 14:57:27 INFO: Rendered page #35.
06-May-2018 14:57:27 May 06, 2018 2:57:27 PM org.apache.fop.events.LoggingEventListener processEvent
06-May-2018 14:57:27 INFO: Rendered page #36.
06-May-2018 14:57:27 May 06, 2018 2:57:27 PM org.apache.fop.events.LoggingEventListener processEvent
06-May-2018 14:57:27 INFO: Rendered page #37.
06-May-2018 14:57:27 May 06, 2018 2:57:27 PM org.apache.fop.events.LoggingEventListener processEvent
06-May-2018 14:57:27 SEVERE: Image not found. URI: images/task_schema.png. (See position 555:16552)
06-May-2018 14:57:27 May 06, 2018 2:57:27 PM org.apache.fop.events.LoggingEventListener processEvent
06-May-2018 14:57:27 INFO: Rendered page #38.
06-May-2018 14:57:27 May 06, 2018 2:57:27 PM org.apache.fop.events.LoggingEventListener processEvent
06-May-2018 14:57:27 INFO: Rendered page #39.
06-May-2018 14:57:27 May 06, 2018 2:57:27 PM org.apache.fop.events.LoggingEventListener processEvent
06-May-2018 14:57:27 INFO: Rendered page #40.
06-May-2018 14:57:27 [INFO] /opt/bamboo-home/xml-data/build-dir/SCT-STASK-JOB1/spring-cloud-task-docs/target/docbook/pdf/index.pdf has been generated.
06-May-2018 14:57:27 [INFO] /opt/bamboo-home/xml-data/build-dir/SCT-STASK-JOB1/spring-cloud-task-docs/target/docbook/pdf/index.fo has been generated.
06-May-2018 14:57:27 [INFO] Executing tasks
06-May-2018 14:57:27      [copy] Copying 1 file to /opt/bamboo-home/xml-data/build-dir/SCT-STASK-JOB1/spring-cloud-task-docs/target/contents/reference
06-May-2018 14:57:27      [move] Moving 1 file to /opt/bamboo-home/xml-data/build-dir/SCT-STASK-JOB1/spring-cloud-task-docs/target/contents/reference/pdf
06-May-2018 14:57:27 [INFO] Executed tasks
06-May-2018 14:57:27 [INFO]
06-May-2018 14:57:27 [INFO] --- docbkx-maven-plugin:2.0.15:generate-epub3 (epub) @ spring-cloud-task-docs ---
06-May-2018 14:57:27 [INFO] Processing input file: index.xml
06-May-2018 14:57:28 [INFO] Applying customization parameters after docbkx parameters
06-May-2018 14:57:28 Failed to load image: images/task_schema.png
06-May-2018 14:57:28 Failed to load image: images/task_schema.png
06-May-2018 14:57:28 Failed to load image: images/task_schema.png
06-May-2018 14:57:28 Failed to load image: images/task_schema.png
06-May-2018 14:57:29 [INFO] Building zip: /opt/bamboo-home/xml-data/build-dir/SCT-STASK-JOB1/spring-cloud-task-docs/target/docbook/index.epub
06-May-2018 14:57:29 [INFO] See /opt/bamboo-home/xml-data/build-dir/SCT-STASK-JOB1/spring-cloud-task-docs/target/docbook/epub for generated file(s)
06-May-2018 14:57:29 [INFO] Executing tasks
06-May-2018 14:57:29      [copy] Copying 1 file to /opt/bamboo-home/xml-data/build-dir/SCT-STASK-JOB1/spring-cloud-task-docs/target/contents/reference/epub
06-May-2018 14:57:29      [move] Moving 1 file to /opt/bamboo-home/xml-data/build-dir/SCT-STASK-JOB1/spring-cloud-task-docs/target/contents/reference/epub
06-May-2018 14:57:29 [INFO] Executed tasks
06-May-2018 14:57:29 [INFO]
06-May-2018 14:57:29 [INFO] --- maven-jar-plugin:3.0.0:jar (default-jar) @ spring-cloud-task-docs ---
06-May-2018 14:57:29 [WARNING] JAR will be empty - no content was marked for inclusion!
06-May-2018 14:57:29 [INFO] Building jar: /opt/bamboo-home/xml-data/build-dir/SCT-STASK-JOB1/spring-cloud-task-docs/target/spring-cloud-task-docs-2.0.0.RELEASE.jar
06-May-2018 14:57:29 [INFO]
06-May-2018 14:57:29 [INFO] --- maven-javadoc-plugin:2.10.3:jar (javadoc) @ spring-cloud-task-docs ---
06-May-2018 14:57:29 [INFO]
06-May-2018 14:57:29 [INFO] --- maven-javadoc-plugin:2.10.3:jar (attach-javadocs) @ spring-cloud-task-docs ---
06-May-2018 14:57:29 [INFO]
06-May-2018 14:57:29 [INFO] >>> maven-source-plugin:3.0.1:jar (attach-sources) > generate-sources @ spring-cloud-task-docs >>>
06-May-2018 14:57:29 [INFO]
06-May-2018 14:57:29 [INFO] --- maven-antrun-plugin:1.7:run (setup-maven-properties) @ spring-cloud-task-docs ---
06-May-2018 14:57:29 [INFO] Executing tasks
06-May-2018 14:57:29
06-May-2018 14:57:29 main:
06-May-2018 14:57:29 [INFO] Executed tasks
06-May-2018 14:57:29 [INFO]
06-May-2018 14:57:29 [INFO] --- jacoco-maven-plugin:0.7.5.201505241946:prepare-agent (pre-unit-test) @ spring-cloud-task-docs ---
06-May-2018 14:57:29 [INFO] surefireArgLine set to -javaagent:/home/bamboo/.m2/repository/org/jacoco/org.jacoco.agent/0.7.5.201505241946/org.jacoco.agent-0.7.5.201505241946-runtime.jar=destfile=/opt/bamboo-home/xml-data/build-dir/SCT-STASK-JOB1/spring-cloud-task-docs/target/coverage-reports/jacoco-ut.exec
06-May-2018 14:57:29 [INFO]
06-May-2018 14:57:29 [INFO] <<< maven-source-plugin:3.0.1:jar (attach-sources) < generate-sources @ spring-cloud-task-docs <<<
06-May-2018 14:57:29 [INFO]
06-May-2018 14:57:29 [INFO]
06-May-2018 14:57:29 [INFO] --- maven-source-plugin:3.0.1:jar (attach-sources) @ spring-cloud-task-docs ---
06-May-2018 14:57:29 [INFO] No sources in project. Archive not created.
06-May-2018 14:57:29 [INFO]
06-May-2018 14:57:29 [INFO] --- maven-antrun-plugin:1.7:run (package-and-attach-docs-zip) @ spring-cloud-task-docs ---
06-May-2018 14:57:29 [INFO] Executing tasks
06-May-2018 14:57:29
06-May-2018 14:57:29 main:
06-May-2018 14:57:29       [zip] Building zip: /opt/bamboo-home/xml-data/build-dir/SCT-STASK-JOB1/spring-cloud-task-docs/target/spring-cloud-task-docs-2.0.0.RELEASE.zip
06-May-2018 14:57:29 [INFO] Executed tasks
06-May-2018 14:57:29 [INFO]
06-May-2018 14:57:29 [INFO] --- maven-assembly-plugin:2.2-beta-5:single (docs-assembly) @ spring-cloud-task-docs ---
06-May-2018 14:57:29 Downloading: https://repo.spring.io/libs-snapshot-local/org/apache/maven/shared/maven-common-artifact-filters/1.1/maven-common-artifact-filters-1.1.pom
06-May-2018 14:57:29 Downloading: https://repo.spring.io/libs-milestone-local/org/apache/maven/shared/maven-common-artifact-filters/1.1/maven-common-artifact-filters-1.1.pom
06-May-2018 14:57:29 Downloading: https://repo.maven.apache.org/maven2/org/apache/maven/shared/maven-common-artifact-filters/1.1/maven-common-artifact-filters-1.1.pom
06-May-2018 14:57:29 Downloaded: https://repo.maven.apache.org/maven2/org/apache/maven/shared/maven-common-artifact-filters/1.1/maven-common-artifact-filters-1.1.pom (0 B at 0 B/s)
06-May-2018 14:57:29 Downloading: https://repo.spring.io/libs-snapshot-local/org/apache/maven/shared/maven-plugin-testing-harness/1.1/maven-plugin-testing-harness-1.1.pom
06-May-2018 14:57:29 Downloading: https://repo.spring.io/libs-milestone-local/org/apache/maven/shared/maven-plugin-testing-harness/1.1/maven-plugin-testing-harness-1.1.pom
06-May-2018 14:57:29 Downloading: https://repo.maven.apache.org/maven2/org/apache/maven/shared/maven-plugin-testing-harness/1.1/maven-plugin-testing-harness-1.1.pom
06-May-2018 14:57:29 Downloaded: https://repo.maven.apache.org/maven2/org/apache/maven/shared/maven-plugin-testing-harness/1.1/maven-plugin-testing-harness-1.1.pom (0 B at 0 B/s)
06-May-2018 14:57:29 Downloading: https://repo.spring.io/libs-snapshot-local/org/apache/maven/shared/maven-shared-components/7/maven-shared-components-7.pom
06-May-2018 14:57:29 Downloading: https://repo.spring.io/libs-milestone-local/org/apache/maven/shared/maven-shared-components/7/maven-shared-components-7.pom
06-May-2018 14:57:29 Downloading: https://repo.maven.apache.org/maven2/org/apache/maven/shared/maven-shared-components/7/maven-shared-components-7.pom
06-May-2018 14:57:29 Downloaded: https://repo.maven.apache.org/maven2/org/apache/maven/shared/maven-shared-components/7/maven-shared-components-7.pom (0 B at 0 B/s)
06-May-2018 14:57:29 Downloading: https://repo.spring.io/libs-snapshot-local/org/apache/maven/maven-core/2.0/maven-core-2.0.pom
06-May-2018 14:57:29 Downloading: https://repo.spring.io/libs-milestone-local/org/apache/maven/maven-core/2.0/maven-core-2.0.pom
06-May-2018 14:57:30 Downloading: https://repo.maven.apache.org/maven2/org/apache/maven/maven-core/2.0/maven-core-2.0.pom
06-May-2018 14:57:30 Downloaded: https://repo.maven.apache.org/maven2/org/apache/maven/maven-core/2.0/maven-core-2.0.pom (0 B at 0 B/s)
06-May-2018 14:57:30 Downloading: https://repo.spring.io/libs-snapshot-local/org/apache/maven/maven-settings/2.0/maven-settings-2.0.pom
06-May-2018 14:57:30 Downloading: https://repo.spring.io/libs-milestone-local/org/apache/maven/maven-settings/2.0/maven-settings-2.0.pom
06-May-2018 14:57:30 Downloading: https://repo.maven.apache.org/maven2/org/apache/maven/maven-settings/2.0/maven-settings-2.0.pom
06-May-2018 14:57:30 Downloaded: https://repo.maven.apache.org/maven2/org/apache/maven/maven-settings/2.0/maven-settings-2.0.pom (0 B at 0 B/s)
06-May-2018 14:57:30 Downloading: https://repo.spring.io/libs-snapshot-local/org/apache/maven/maven-plugin-parameter-documenter/2.0/maven-plugin-parameter-documenter-2.0.pom
06-May-2018 14:57:30 Downloading: https://repo.spring.io/libs-milestone-local/org/apache/maven/maven-plugin-parameter-documenter/2.0/maven-plugin-parameter-documenter-2.0.pom
06-May-2018 14:57:30 Downloading: https://repo.maven.apache.org/maven2/org/apache/maven/maven-plugin-parameter-documenter/2.0/maven-plugin-parameter-documenter-2.0.pom
06-May-2018 14:57:30 Downloaded: https://repo.maven.apache.org/maven2/org/apache/maven/maven-plugin-parameter-documenter/2.0/maven-plugin-parameter-documenter-2.0.pom (0 B at 0 B/s)
06-May-2018 14:57:30 Downloading: https://repo.spring.io/libs-snapshot-local/org/apache/maven/reporting/maven-reporting-api/2.0/maven-reporting-api-2.0.pom
06-May-2018 14:57:30 Downloading: https://repo.spring.io/libs-milestone-local/org/apache/maven/reporting/maven-reporting-api/2.0/maven-reporting-api-2.0.pom
06-May-2018 14:57:30 Downloading: https://repo.maven.apache.org/maven2/org/apache/maven/reporting/maven-reporting-api/2.0/maven-reporting-api-2.0.pom
06-May-2018 14:57:30 Downloaded: https://repo.maven.apache.org/maven2/org/apache/maven/reporting/maven-reporting-api/2.0/maven-reporting-api-2.0.pom (0 B at 0 B/s)
06-May-2018 14:57:30 Downloading: https://repo.spring.io/libs-snapshot-local/org/apache/maven/reporting/maven-reporting/2.0/maven-reporting-2.0.pom
06-May-2018 14:57:30 Downloading: https://repo.spring.io/libs-milestone-local/org/apache/maven/reporting/maven-reporting/2.0/maven-reporting-2.0.pom
06-May-2018 14:57:30 Downloading: https://repo.maven.apache.org/maven2/org/apache/maven/reporting/maven-reporting/2.0/maven-reporting-2.0.pom
06-May-2018 14:57:30 Downloaded: https://repo.maven.apache.org/maven2/org/apache/maven/reporting/maven-reporting/2.0/maven-reporting-2.0.pom (0 B at 0 B/s)
06-May-2018 14:57:30 Downloading: https://repo.spring.io/libs-snapshot-local/doxia/doxia-sink-api/1.0-alpha-4/doxia-sink-api-1.0-alpha-4.pom
06-May-2018 14:57:30 Downloading: https://repo.spring.io/libs-milestone-local/doxia/doxia-sink-api/1.0-alpha-4/doxia-sink-api-1.0-alpha-4.pom
06-May-2018 14:57:30 Downloading: https://repo.maven.apache.org/maven2/doxia/doxia-sink-api/1.0-alpha-4/doxia-sink-api-1.0-alpha-4.pom
06-May-2018 14:57:30 Downloaded: https://repo.maven.apache.org/maven2/doxia/doxia-sink-api/1.0-alpha-4/doxia-sink-api-1.0-alpha-4.pom (0 B at 0 B/s)
06-May-2018 14:57:30 Downloading: https://repo.spring.io/libs-snapshot-local/org/apache/maven/maven-error-diagnostics/2.0/maven-error-diagnostics-2.0.pom
06-May-2018 14:57:30 Downloading: https://repo.spring.io/libs-milestone-local/org/apache/maven/maven-error-diagnostics/2.0/maven-error-diagnostics-2.0.pom
06-May-2018 14:57:31 Downloading: https://repo.maven.apache.org/maven2/org/apache/maven/maven-error-diagnostics/2.0/maven-error-diagnostics-2.0.pom
06-May-2018 14:57:31 Downloaded: https://repo.maven.apache.org/maven2/org/apache/maven/maven-error-diagnostics/2.0/maven-error-diagnostics-2.0.pom (0 B at 0 B/s)
06-May-2018 14:57:31 Downloading: https://repo.spring.io/libs-snapshot-local/org/apache/maven/maven-plugin-registry/2.0/maven-plugin-registry-2.0.pom
06-May-2018 14:57:31 Downloading: https://repo.spring.io/libs-milestone-local/org/apache/maven/maven-plugin-registry/2.0/maven-plugin-registry-2.0.pom
06-May-2018 14:57:31 Downloading: https://repo.maven.apache.org/maven2/org/apache/maven/maven-plugin-registry/2.0/maven-plugin-registry-2.0.pom
06-May-2018 14:57:31 Downloaded: https://repo.maven.apache.org/maven2/org/apache/maven/maven-plugin-registry/2.0/maven-plugin-registry-2.0.pom (0 B at 0 B/s)
06-May-2018 14:57:31 Downloading: https://repo.spring.io/libs-snapshot-local/org/apache/maven/maven-plugin-descriptor/2.0/maven-plugin-descriptor-2.0.pom
06-May-2018 14:57:31 Downloading: https://repo.spring.io/libs-milestone-local/org/apache/maven/maven-plugin-descriptor/2.0/maven-plugin-descriptor-2.0.pom
06-May-2018 14:57:31 Downloading: https://repo.maven.apache.org/maven2/org/apache/maven/maven-plugin-descriptor/2.0/maven-plugin-descriptor-2.0.pom
06-May-2018 14:57:31 Downloaded: https://repo.maven.apache.org/maven2/org/apache/maven/maven-plugin-descriptor/2.0/maven-plugin-descriptor-2.0.pom (0 B at 0 B/s)
06-May-2018 14:57:31 Downloading: https://repo.spring.io/libs-snapshot-local/org/apache/maven/maven-monitor/2.0/maven-monitor-2.0.pom
06-May-2018 14:57:31 Downloading: https://repo.spring.io/libs-milestone-local/org/apache/maven/maven-monitor/2.0/maven-monitor-2.0.pom
06-May-2018 14:57:31 Downloading: https://repo.maven.apache.org/maven2/org/apache/maven/maven-monitor/2.0/maven-monitor-2.0.pom
06-May-2018 14:57:31 Downloaded: https://repo.maven.apache.org/maven2/org/apache/maven/maven-monitor/2.0/maven-monitor-2.0.pom (0 B at 0 B/s)
06-May-2018 14:57:31 Downloading: https://repo.spring.io/libs-snapshot-local/org/codehaus/plexus/plexus-interpolation/1.7/plexus-interpolation-1.7.pom
06-May-2018 14:57:31 Downloading: https://repo.spring.io/libs-milestone-local/org/codehaus/plexus/plexus-interpolation/1.7/plexus-interpolation-1.7.pom
06-May-2018 14:57:31 Downloading: https://repo.maven.apache.org/maven2/org/codehaus/plexus/plexus-interpolation/1.7/plexus-interpolation-1.7.pom
06-May-2018 14:57:31 Downloaded: https://repo.maven.apache.org/maven2/org/codehaus/plexus/plexus-interpolation/1.7/plexus-interpolation-1.7.pom (0 B at 0 B/s)
06-May-2018 14:57:31 Downloading: https://repo.spring.io/libs-snapshot-local/org/codehaus/plexus/plexus-archiver/1.0-alpha-12/plexus-archiver-1.0-alpha-12.pom
06-May-2018 14:57:31 Downloading: https://repo.spring.io/libs-milestone-local/org/codehaus/plexus/plexus-archiver/1.0-alpha-12/plexus-archiver-1.0-alpha-12.pom
06-May-2018 14:57:31 Downloading: https://repo.maven.apache.org/maven2/org/codehaus/plexus/plexus-archiver/1.0-alpha-12/plexus-archiver-1.0-alpha-12.pom
06-May-2018 14:57:31 Downloaded: https://repo.maven.apache.org/maven2/org/codehaus/plexus/plexus-archiver/1.0-alpha-12/plexus-archiver-1.0-alpha-12.pom (0 B at 0 B/s)
06-May-2018 14:57:31 Downloading: https://repo.spring.io/libs-snapshot-local/org/codehaus/plexus/plexus-io/1.0-alpha-4/plexus-io-1.0-alpha-4.pom
06-May-2018 14:57:31 Downloading: https://repo.spring.io/libs-milestone-local/org/codehaus/plexus/plexus-io/1.0-alpha-4/plexus-io-1.0-alpha-4.pom
06-May-2018 14:57:32 Downloading: https://repo.maven.apache.org/maven2/org/codehaus/plexus/plexus-io/1.0-alpha-4/plexus-io-1.0-alpha-4.pom
06-May-2018 14:57:32 Downloaded: https://repo.maven.apache.org/maven2/org/codehaus/plexus/plexus-io/1.0-alpha-4/plexus-io-1.0-alpha-4.pom (0 B at 0 B/s)
06-May-2018 14:57:32 Downloading: https://repo.spring.io/libs-snapshot-local/org/apache/maven/shared/maven-filtering/1.0-beta-2/maven-filtering-1.0-beta-2.pom
06-May-2018 14:57:32 Downloading: https://repo.spring.io/libs-milestone-local/org/apache/maven/shared/maven-filtering/1.0-beta-2/maven-filtering-1.0-beta-2.pom
06-May-2018 14:57:32 Downloading: https://repo.maven.apache.org/maven2/org/apache/maven/shared/maven-filtering/1.0-beta-2/maven-filtering-1.0-beta-2.pom
06-May-2018 14:57:32 Downloaded: https://repo.maven.apache.org/maven2/org/apache/maven/shared/maven-filtering/1.0-beta-2/maven-filtering-1.0-beta-2.pom (0 B at 0 B/s)
06-May-2018 14:57:32 Downloading: https://repo.spring.io/libs-snapshot-local/org/codehaus/plexus/plexus-interpolation/1.6/plexus-interpolation-1.6.pom
06-May-2018 14:57:32 Downloading: https://repo.spring.io/libs-milestone-local/org/codehaus/plexus/plexus-interpolation/1.6/plexus-interpolation-1.6.pom
06-May-2018 14:57:32 Downloading: https://repo.maven.apache.org/maven2/org/codehaus/plexus/plexus-interpolation/1.6/plexus-interpolation-1.6.pom
06-May-2018 14:57:32 Downloaded: https://repo.maven.apache.org/maven2/org/codehaus/plexus/plexus-interpolation/1.6/plexus-interpolation-1.6.pom (0 B at 0 B/s)
06-May-2018 14:57:32 Downloading: https://repo.spring.io/libs-snapshot-local/org/codehaus/plexus/plexus-active-collections/1.0-beta-2/plexus-active-collections-1.0-beta-2.pom
06-May-2018 14:57:32 Downloading: https://repo.spring.io/libs-milestone-local/org/codehaus/plexus/plexus-active-collections/1.0-beta-2/plexus-active-collections-1.0-beta-2.pom
06-May-2018 14:57:32 Downloading: https://repo.maven.apache.org/maven2/org/codehaus/plexus/plexus-active-collections/1.0-beta-2/plexus-active-collections-1.0-beta-2.pom
06-May-2018 14:57:32 Downloaded: https://repo.maven.apache.org/maven2/org/codehaus/plexus/plexus-active-collections/1.0-beta-2/plexus-active-collections-1.0-beta-2.pom (0 B at 0 B/s)
06-May-2018 14:57:32 Downloading: https://repo.spring.io/libs-snapshot-local/org/codehaus/plexus/plexus-container-default/1.0-alpha-22/plexus-container-default-1.0-alpha-22.pom
06-May-2018 14:57:32 Downloading: https://repo.spring.io/libs-milestone-local/org/codehaus/plexus/plexus-container-default/1.0-alpha-22/plexus-container-default-1.0-alpha-22.pom
06-May-2018 14:57:32 Downloading: https://repo.maven.apache.org/maven2/org/codehaus/plexus/plexus-container-default/1.0-alpha-22/plexus-container-default-1.0-alpha-22.pom
06-May-2018 14:57:32 Downloaded: https://repo.maven.apache.org/maven2/org/codehaus/plexus/plexus-container-default/1.0-alpha-22/plexus-container-default-1.0-alpha-22.pom (0 B at 0 B/s)
06-May-2018 14:57:32 Downloading: https://repo.spring.io/libs-snapshot-local/org/codehaus/plexus/plexus-containers/1.0-alpha-22/plexus-containers-1.0-alpha-22.pom
06-May-2018 14:57:32 Downloading: https://repo.spring.io/libs-milestone-local/org/codehaus/plexus/plexus-containers/1.0-alpha-22/plexus-containers-1.0-alpha-22.pom
06-May-2018 14:57:32 Downloading: https://repo.maven.apache.org/maven2/org/codehaus/plexus/plexus-containers/1.0-alpha-22/plexus-containers-1.0-alpha-22.pom
06-May-2018 14:57:32 Downloaded: https://repo.maven.apache.org/maven2/org/codehaus/plexus/plexus-containers/1.0-alpha-22/plexus-containers-1.0-alpha-22.pom (0 B at 0 B/s)
06-May-2018 14:57:32 Downloading: https://repo.spring.io/libs-snapshot-local/org/apache/maven/maven-plugin-api/2.0.4/maven-plugin-api-2.0.4.pom
06-May-2018 14:57:32 Downloading: https://repo.spring.io/libs-milestone-local/org/apache/maven/maven-plugin-api/2.0.4/maven-plugin-api-2.0.4.pom
06-May-2018 14:57:33 Downloading: https://repo.maven.apache.org/maven2/org/apache/maven/maven-plugin-api/2.0.4/maven-plugin-api-2.0.4.pom
06-May-2018 14:57:33 Downloaded: https://repo.maven.apache.org/maven2/org/apache/maven/maven-plugin-api/2.0.4/maven-plugin-api-2.0.4.pom (0 B at 0 B/s)
06-May-2018 14:57:33 Downloading: https://repo.spring.io/libs-snapshot-local/org/apache/maven/maven-archiver/2.4/maven-archiver-2.4.pom
06-May-2018 14:57:33 Downloading: https://repo.spring.io/libs-milestone-local/org/apache/maven/maven-archiver/2.4/maven-archiver-2.4.pom
06-May-2018 14:57:33 Downloading: https://repo.maven.apache.org/maven2/org/apache/maven/maven-archiver/2.4/maven-archiver-2.4.pom
06-May-2018 14:57:33 Downloaded: https://repo.maven.apache.org/maven2/org/apache/maven/maven-archiver/2.4/maven-archiver-2.4.pom (0 B at 0 B/s)
06-May-2018 14:57:33 Downloading: https://repo.spring.io/libs-snapshot-local/org/codehaus/plexus/plexus-archiver/1.0-alpha-11/plexus-archiver-1.0-alpha-11.pom
06-May-2018 14:57:33 Downloading: https://repo.spring.io/libs-milestone-local/org/codehaus/plexus/plexus-archiver/1.0-alpha-11/plexus-archiver-1.0-alpha-11.pom
06-May-2018 14:57:33 Downloading: https://repo.maven.apache.org/maven2/org/codehaus/plexus/plexus-archiver/1.0-alpha-11/plexus-archiver-1.0-alpha-11.pom
06-May-2018 14:57:33 Downloaded: https://repo.maven.apache.org/maven2/org/codehaus/plexus/plexus-archiver/1.0-alpha-11/plexus-archiver-1.0-alpha-11.pom (0 B at 0 B/s)
06-May-2018 14:57:33 Downloading: https://repo.spring.io/libs-snapshot-local/org/codehaus/plexus/plexus-container-default/1.0-alpha-15/plexus-container-default-1.0-alpha-15.pom
06-May-2018 14:57:33 Downloading: https://repo.spring.io/libs-milestone-local/org/codehaus/plexus/plexus-container-default/1.0-alpha-15/plexus-container-default-1.0-alpha-15.pom
06-May-2018 14:57:33 Downloading: https://repo.maven.apache.org/maven2/org/codehaus/plexus/plexus-container-default/1.0-alpha-15/plexus-container-default-1.0-alpha-15.pom
06-May-2018 14:57:33 Downloaded: https://repo.maven.apache.org/maven2/org/codehaus/plexus/plexus-container-default/1.0-alpha-15/plexus-container-default-1.0-alpha-15.pom (0 B at 0 B/s)
06-May-2018 14:57:33 Downloading: https://repo.spring.io/libs-snapshot-local/org/codehaus/plexus/plexus-containers/1.0-alpha-15/plexus-containers-1.0-alpha-15.pom
06-May-2018 14:57:33 Downloading: https://repo.spring.io/libs-milestone-local/org/codehaus/plexus/plexus-containers/1.0-alpha-15/plexus-containers-1.0-alpha-15.pom
06-May-2018 14:57:33 Downloading: https://repo.maven.apache.org/maven2/org/codehaus/plexus/plexus-containers/1.0-alpha-15/plexus-containers-1.0-alpha-15.pom
06-May-2018 14:57:33 Downloaded: https://repo.maven.apache.org/maven2/org/codehaus/plexus/plexus-containers/1.0-alpha-15/plexus-containers-1.0-alpha-15.pom (0 B at 0 B/s)
06-May-2018 14:57:33 Downloading: https://repo.spring.io/libs-snapshot-local/org/codehaus/plexus/plexus-component-api/1.0-alpha-15/plexus-component-api-1.0-alpha-15.pom
06-May-2018 14:57:33 Downloading: https://repo.spring.io/libs-milestone-local/org/codehaus/plexus/plexus-component-api/1.0-alpha-15/plexus-component-api-1.0-alpha-15.pom
06-May-2018 14:57:33 Downloading: https://repo.maven.apache.org/maven2/org/codehaus/plexus/plexus-component-api/1.0-alpha-15/plexus-component-api-1.0-alpha-15.pom
06-May-2018 14:57:33 Downloaded: https://repo.maven.apache.org/maven2/org/codehaus/plexus/plexus-component-api/1.0-alpha-15/plexus-component-api-1.0-alpha-15.pom (0 B at 0 B/s)
06-May-2018 14:57:33 Downloading: https://repo.spring.io/libs-snapshot-local/org/codehaus/plexus/plexus-classworlds/1.2-alpha-6/plexus-classworlds-1.2-alpha-6.pom
06-May-2018 14:57:33 Downloading: https://repo.spring.io/libs-milestone-local/org/codehaus/plexus/plexus-classworlds/1.2-alpha-6/plexus-classworlds-1.2-alpha-6.pom
06-May-2018 14:57:33 Downloading: https://repo.maven.apache.org/maven2/org/codehaus/plexus/plexus-classworlds/1.2-alpha-6/plexus-classworlds-1.2-alpha-6.pom
06-May-2018 14:57:33 Downloaded: https://repo.maven.apache.org/maven2/org/codehaus/plexus/plexus-classworlds/1.2-alpha-6/plexus-classworlds-1.2-alpha-6.pom (0 B at 0 B/s)
06-May-2018 14:57:33 Downloading: https://repo.spring.io/libs-snapshot-local/org/codehaus/plexus/plexus-io/1.0-alpha-3/plexus-io-1.0-alpha-3.pom
06-May-2018 14:57:34 Downloading: https://repo.spring.io/libs-milestone-local/org/codehaus/plexus/plexus-io/1.0-alpha-3/plexus-io-1.0-alpha-3.pom
06-May-2018 14:57:34 Downloading: https://repo.maven.apache.org/maven2/org/codehaus/plexus/plexus-io/1.0-alpha-3/plexus-io-1.0-alpha-3.pom
06-May-2018 14:57:34 Downloaded: https://repo.maven.apache.org/maven2/org/codehaus/plexus/plexus-io/1.0-alpha-3/plexus-io-1.0-alpha-3.pom (0 B at 0 B/s)
06-May-2018 14:57:34 Downloading: https://repo.spring.io/libs-snapshot-local/org/codehaus/plexus/plexus-component-api/1.0-alpha-16/plexus-component-api-1.0-alpha-16.pom
06-May-2018 14:57:34 Downloading: https://repo.spring.io/libs-milestone-local/org/codehaus/plexus/plexus-component-api/1.0-alpha-16/plexus-component-api-1.0-alpha-16.pom
06-May-2018 14:57:34 Downloading: https://repo.maven.apache.org/maven2/org/codehaus/plexus/plexus-component-api/1.0-alpha-16/plexus-component-api-1.0-alpha-16.pom
06-May-2018 14:57:34 Downloaded: https://repo.maven.apache.org/maven2/org/codehaus/plexus/plexus-component-api/1.0-alpha-16/plexus-component-api-1.0-alpha-16.pom (0 B at 0 B/s)
06-May-2018 14:57:34 Downloading: https://repo.spring.io/libs-snapshot-local/org/codehaus/plexus/plexus-containers/1.0-alpha-16/plexus-containers-1.0-alpha-16.pom
06-May-2018 14:57:34 Downloading: https://repo.spring.io/libs-milestone-local/org/codehaus/plexus/plexus-containers/1.0-alpha-16/plexus-containers-1.0-alpha-16.pom
06-May-2018 14:57:34 Downloading: https://repo.maven.apache.org/maven2/org/codehaus/plexus/plexus-containers/1.0-alpha-16/plexus-containers-1.0-alpha-16.pom
06-May-2018 14:57:34 Downloaded: https://repo.maven.apache.org/maven2/org/codehaus/plexus/plexus-containers/1.0-alpha-16/plexus-containers-1.0-alpha-16.pom (0 B at 0 B/s)
06-May-2018 14:57:34 Downloading: https://repo.spring.io/libs-snapshot-local/org/codehaus/plexus/plexus-utils/2.0.1/plexus-utils-2.0.1.pom
06-May-2018 14:57:34 Downloading: https://repo.spring.io/libs-milestone-local/org/codehaus/plexus/plexus-utils/2.0.1/plexus-utils-2.0.1.pom
06-May-2018 14:57:34 Downloading: https://repo.maven.apache.org/maven2/org/codehaus/plexus/plexus-utils/2.0.1/plexus-utils-2.0.1.pom
06-May-2018 14:57:34 Downloaded: https://repo.maven.apache.org/maven2/org/codehaus/plexus/plexus-utils/2.0.1/plexus-utils-2.0.1.pom (0 B at 0 B/s)
06-May-2018 14:57:34 Downloading: https://repo.spring.io/libs-snapshot-local/org/apache/maven/shared/maven-repository-builder/1.0-alpha-2/maven-repository-builder-1.0-alpha-2.pom
06-May-2018 14:57:34 Downloading: https://repo.spring.io/libs-milestone-local/org/apache/maven/shared/maven-repository-builder/1.0-alpha-2/maven-repository-builder-1.0-alpha-2.pom
06-May-2018 14:57:34 Downloading: https://repo.maven.apache.org/maven2/org/apache/maven/shared/maven-repository-builder/1.0-alpha-2/maven-repository-builder-1.0-alpha-2.pom
06-May-2018 14:57:34 Downloaded: https://repo.maven.apache.org/maven2/org/apache/maven/shared/maven-repository-builder/1.0-alpha-2/maven-repository-builder-1.0-alpha-2.pom (0 B at 0 B/s)
06-May-2018 14:57:34 Downloading: https://repo.spring.io/libs-snapshot-local/org/apache/maven/shared/maven-common-artifact-filters/1.0-alpha-1/maven-common-artifact-filters-1.0-alpha-1.pom
06-May-2018 14:57:34 Downloading: https://repo.spring.io/libs-milestone-local/org/apache/maven/shared/maven-common-artifact-filters/1.0-alpha-1/maven-common-artifact-filters-1.0-alpha-1.pom
06-May-2018 14:57:34 Downloading: https://repo.maven.apache.org/maven2/org/apache/maven/shared/maven-common-artifact-filters/1.0-alpha-1/maven-common-artifact-filters-1.0-alpha-1.pom
06-May-2018 14:57:34 Downloaded: https://repo.maven.apache.org/maven2/org/apache/maven/shared/maven-common-artifact-filters/1.0-alpha-1/maven-common-artifact-filters-1.0-alpha-1.pom (0 B at 0 B/s)
06-May-2018 14:57:34 Downloading: https://repo.spring.io/libs-snapshot-local/org/apache/maven/shared/maven-shared-components/6/maven-shared-components-6.pom
06-May-2018 14:57:35 Downloading: https://repo.spring.io/libs-milestone-local/org/apache/maven/shared/maven-shared-components/6/maven-shared-components-6.pom
06-May-2018 14:57:35 Downloading: https://repo.maven.apache.org/maven2/org/apache/maven/shared/maven-shared-components/6/maven-shared-components-6.pom
06-May-2018 14:57:35 Downloaded: https://repo.maven.apache.org/maven2/org/apache/maven/shared/maven-shared-components/6/maven-shared-components-6.pom (0 B at 0 B/s)
06-May-2018 14:57:35 Downloading: https://repo.spring.io/libs-snapshot-local/org/apache/maven/shared/maven-common-artifact-filters/1.1/maven-common-artifact-filters-1.1.jar
06-May-2018 14:57:35 Downloading: https://repo.spring.io/libs-snapshot-local/org/apache/maven/shared/maven-plugin-testing-harness/1.1/maven-plugin-testing-harness-1.1.jar
06-May-2018 14:57:35 Downloading: https://repo.spring.io/libs-snapshot-local/org/codehaus/plexus/plexus-interpolation/1.7/plexus-interpolation-1.7.jar
06-May-2018 14:57:35 Downloading: https://repo.spring.io/libs-snapshot-local/org/apache/maven/maven-artifact-manager/2.0.2/maven-artifact-manager-2.0.2.jar
06-May-2018 14:57:35 Downloading: https://repo.spring.io/libs-snapshot-local/org/codehaus/plexus/plexus-archiver/1.0-alpha-12/plexus-archiver-1.0-alpha-12.jar
06-May-2018 14:57:35 Downloading: https://repo.spring.io/libs-snapshot-local/org/apache/maven/maven-repository-metadata/2.0.2/maven-repository-metadata-2.0.2.jar
06-May-2018 14:57:35 Downloading: https://repo.spring.io/libs-snapshot-local/org/apache/maven/shared/maven-filtering/1.0-beta-2/maven-filtering-1.0-beta-2.jar
06-May-2018 14:57:35 Downloading: https://repo.spring.io/libs-snapshot-local/org/codehaus/plexus/plexus-active-collections/1.0-beta-2/plexus-active-collections-1.0-beta-2.jar
06-May-2018 14:57:35 Downloading: https://repo.spring.io/libs-snapshot-local/org/codehaus/plexus/plexus-io/1.0-alpha-4/plexus-io-1.0-alpha-4.jar
06-May-2018 14:57:35 Downloading: https://repo.spring.io/libs-snapshot-local/org/apache/maven/maven-plugin-api/2.0.4/maven-plugin-api-2.0.4.jar
06-May-2018 14:57:35 Downloading: https://repo.spring.io/libs-snapshot-local/org/apache/maven/maven-archiver/2.4/maven-archiver-2.4.jar
06-May-2018 14:57:35 Downloading: https://repo.spring.io/libs-snapshot-local/org/codehaus/plexus/plexus-utils/2.0.1/plexus-utils-2.0.1.jar
06-May-2018 14:57:35 Downloading: https://repo.spring.io/libs-snapshot-local/org/apache/maven/shared/maven-repository-builder/1.0-alpha-2/maven-repository-builder-1.0-alpha-2.jar
06-May-2018 14:57:35 Downloading: https://repo.spring.io/libs-milestone-local/org/apache/maven/shared/maven-common-artifact-filters/1.1/maven-common-artifact-filters-1.1.jar
06-May-2018 14:57:35 Downloading: https://repo.spring.io/libs-milestone-local/org/apache/maven/shared/maven-plugin-testing-harness/1.1/maven-plugin-testing-harness-1.1.jar
06-May-2018 14:57:35 Downloading: https://repo.spring.io/libs-milestone-local/org/codehaus/plexus/plexus-interpolation/1.7/plexus-interpolation-1.7.jar
06-May-2018 14:57:35 Downloading: https://repo.spring.io/libs-milestone-local/org/codehaus/plexus/plexus-archiver/1.0-alpha-12/plexus-archiver-1.0-alpha-12.jar
06-May-2018 14:57:35 Downloading: https://repo.spring.io/libs-milestone-local/org/apache/maven/maven-artifact-manager/2.0.2/maven-artifact-manager-2.0.2.jar
06-May-2018 14:57:35 Downloading: https://repo.spring.io/libs-milestone-local/org/apache/maven/maven-repository-metadata/2.0.2/maven-repository-metadata-2.0.2.jar
06-May-2018 14:57:35 Downloading: https://repo.spring.io/libs-milestone-local/org/apache/maven/shared/maven-filtering/1.0-beta-2/maven-filtering-1.0-beta-2.jar
06-May-2018 14:57:35 Downloading: https://repo.spring.io/libs-milestone-local/org/codehaus/plexus/plexus-active-collections/1.0-beta-2/plexus-active-collections-1.0-beta-2.jar
06-May-2018 14:57:35 Downloading: https://repo.spring.io/libs-milestone-local/org/codehaus/plexus/plexus-io/1.0-alpha-4/plexus-io-1.0-alpha-4.jar
06-May-2018 14:57:35 Downloading: https://repo.spring.io/libs-milestone-local/org/apache/maven/maven-plugin-api/2.0.4/maven-plugin-api-2.0.4.jar
06-May-2018 14:57:35 Downloading: https://repo.spring.io/libs-milestone-local/org/apache/maven/maven-archiver/2.4/maven-archiver-2.4.jar
06-May-2018 14:57:35 Downloading: https://repo.spring.io/libs-milestone-local/org/codehaus/plexus/plexus-utils/2.0.1/plexus-utils-2.0.1.jar
06-May-2018 14:57:35 Downloading: https://repo.spring.io/libs-milestone-local/org/apache/maven/shared/maven-repository-builder/1.0-alpha-2/maven-repository-builder-1.0-alpha-2.jar
06-May-2018 14:57:35 Downloading: https://repo.maven.apache.org/maven2/org/apache/maven/shared/maven-common-artifact-filters/1.1/maven-common-artifact-filters-1.1.jar
06-May-2018 14:57:35 Downloading: https://repo.maven.apache.org/maven2/org/apache/maven/shared/maven-plugin-testing-harness/1.1/maven-plugin-testing-harness-1.1.jar
06-May-2018 14:57:35 Downloading: https://repo.maven.apache.org/maven2/org/codehaus/plexus/plexus-interpolation/1.7/plexus-interpolation-1.7.jar
06-May-2018 14:57:35 Downloading: https://repo.maven.apache.org/maven2/org/apache/maven/maven-artifact-manager/2.0.2/maven-artifact-manager-2.0.2.jar
06-May-2018 14:57:35 Downloading: https://repo.maven.apache.org/maven2/org/codehaus/plexus/plexus-archiver/1.0-alpha-12/plexus-archiver-1.0-alpha-12.jar
06-May-2018 14:57:35 Downloaded: https://repo.maven.apache.org/maven2/org/apache/maven/shared/maven-common-artifact-filters/1.1/maven-common-artifact-filters-1.1.jar (0 B at 0 B/s)
06-May-2018 14:57:35 Downloading: https://repo.maven.apache.org/maven2/org/apache/maven/maven-repository-metadata/2.0.2/maven-repository-metadata-2.0.2.jar
06-May-2018 14:57:35 Downloaded: https://repo.maven.apache.org/maven2/org/apache/maven/maven-repository-metadata/2.0.2/maven-repository-metadata-2.0.2.jar (0 B at 0 B/s)
06-May-2018 14:57:35 Downloading: https://repo.maven.apache.org/maven2/org/apache/maven/shared/maven-filtering/1.0-beta-2/maven-filtering-1.0-beta-2.jar
06-May-2018 14:57:35 Downloaded: https://repo.maven.apache.org/maven2/org/apache/maven/shared/maven-filtering/1.0-beta-2/maven-filtering-1.0-beta-2.jar (0 B at 0 B/s)
06-May-2018 14:57:35 Downloading: https://repo.maven.apache.org/maven2/org/codehaus/plexus/plexus-active-collections/1.0-beta-2/plexus-active-collections-1.0-beta-2.jar
06-May-2018 14:57:35 Downloaded: https://repo.maven.apache.org/maven2/org/codehaus/plexus/plexus-interpolation/1.7/plexus-interpolation-1.7.jar (0 B at 0 B/s)
06-May-2018 14:57:35 Downloading: https://repo.maven.apache.org/maven2/org/codehaus/plexus/plexus-io/1.0-alpha-4/plexus-io-1.0-alpha-4.jar
06-May-2018 14:57:35 Downloaded: https://repo.maven.apache.org/maven2/org/codehaus/plexus/plexus-active-collections/1.0-beta-2/plexus-active-collections-1.0-beta-2.jar (0 B at 0 B/s)
06-May-2018 14:57:35 Downloading: https://repo.maven.apache.org/maven2/org/apache/maven/maven-plugin-api/2.0.4/maven-plugin-api-2.0.4.jar
06-May-2018 14:57:35 Downloaded: https://repo.maven.apache.org/maven2/org/codehaus/plexus/plexus-io/1.0-alpha-4/plexus-io-1.0-alpha-4.jar (0 B at 0 B/s)
06-May-2018 14:57:35 Downloading: https://repo.maven.apache.org/maven2/org/apache/maven/maven-archiver/2.4/maven-archiver-2.4.jar
06-May-2018 14:57:35 Downloaded: https://repo.maven.apache.org/maven2/org/apache/maven/shared/maven-plugin-testing-harness/1.1/maven-plugin-testing-harness-1.1.jar (0 B at 0 B/s)
06-May-2018 14:57:35 Downloading: https://repo.maven.apache.org/maven2/org/codehaus/plexus/plexus-utils/2.0.1/plexus-utils-2.0.1.jar
06-May-2018 14:57:35 Downloaded: https://repo.maven.apache.org/maven2/org/apache/maven/maven-artifact-manager/2.0.2/maven-artifact-manager-2.0.2.jar (0 B at 0 B/s)
06-May-2018 14:57:35 Downloading: https://repo.maven.apache.org/maven2/org/apache/maven/shared/maven-repository-builder/1.0-alpha-2/maven-repository-builder-1.0-alpha-2.jar
06-May-2018 14:57:35 Downloaded: https://repo.maven.apache.org/maven2/org/apache/maven/maven-plugin-api/2.0.4/maven-plugin-api-2.0.4.jar (0 B at 0 B/s)
06-May-2018 14:57:35 Downloaded: https://repo.maven.apache.org/maven2/org/apache/maven/maven-archiver/2.4/maven-archiver-2.4.jar (0 B at 0 B/s)
06-May-2018 14:57:35 Downloaded: https://repo.maven.apache.org/maven2/org/codehaus/plexus/plexus-utils/2.0.1/plexus-utils-2.0.1.jar (0 B at 0 B/s)
06-May-2018 14:57:35 Downloaded: https://repo.maven.apache.org/maven2/org/codehaus/plexus/plexus-archiver/1.0-alpha-12/plexus-archiver-1.0-alpha-12.jar (0 B at 0 B/s)
06-May-2018 14:57:35 Downloaded: https://repo.maven.apache.org/maven2/org/apache/maven/shared/maven-repository-builder/1.0-alpha-2/maven-repository-builder-1.0-alpha-2.jar (0 B at 0 B/s)
06-May-2018 14:57:35 [INFO] Reading assembly descriptor: src/main/assembly/assemble.xml
06-May-2018 14:57:36 [INFO] Building zip: /opt/bamboo-home/xml-data/build-dir/SCT-STASK-JOB1/spring-cloud-task-docs/target/spring-cloud-task-docs-2.0.0.RELEASE.zip
06-May-2018 14:57:36 [WARNING] Assembly file: /opt/bamboo-home/xml-data/build-dir/SCT-STASK-JOB1/spring-cloud-task-docs/target/spring-cloud-task-docs-2.0.0.RELEASE.zip is not a regular file (it may be a directory). It cannot be attached to the project build for installation or deployment.
06-May-2018 14:57:36 [INFO]
06-May-2018 14:57:36 [INFO] --- build-helper-maven-plugin:3.0.0:attach-artifact (attach-zip) @ spring-cloud-task-docs ---
06-May-2018 14:57:36 Downloading: https://repo.spring.io/libs-snapshot-local/org/apache/maven/shared/file-management/3.0.0/file-management-3.0.0.pom
06-May-2018 14:57:36 Downloading: https://repo.spring.io/libs-milestone-local/org/apache/maven/shared/file-management/3.0.0/file-management-3.0.0.pom
06-May-2018 14:57:36 Downloading: https://repo.maven.apache.org/maven2/org/apache/maven/shared/file-management/3.0.0/file-management-3.0.0.pom
06-May-2018 14:57:36 Progress (1): 2.8/4.7 kB
06-May-2018 14:57:36 Progress (1): 4.7 kB   
06-May-2018 14:57:36                    
06-May-2018 14:57:36 Downloaded: https://repo.maven.apache.org/maven2/org/apache/maven/shared/file-management/3.0.0/file-management-3.0.0.pom (4.7 kB at 586 kB/s)
06-May-2018 14:57:36 Downloading: https://repo.spring.io/libs-snapshot-local/org/apache/maven/shared/maven-shared-io/3.0.0/maven-shared-io-3.0.0.pom
06-May-2018 14:57:36 Downloading: https://repo.spring.io/libs-milestone-local/org/apache/maven/shared/maven-shared-io/3.0.0/maven-shared-io-3.0.0.pom
06-May-2018 14:57:36 Downloading: https://repo.maven.apache.org/maven2/org/apache/maven/shared/maven-shared-io/3.0.0/maven-shared-io-3.0.0.pom
06-May-2018 14:57:36 Progress (1): 2.8/4.2 kB
06-May-2018 14:57:36 Progress (1): 4.2 kB   
06-May-2018 14:57:36                    
06-May-2018 14:57:36 Downloaded: https://repo.maven.apache.org/maven2/org/apache/maven/shared/maven-shared-io/3.0.0/maven-shared-io-3.0.0.pom (4.2 kB at 594 kB/s)
06-May-2018 14:57:36 Downloading: https://repo.spring.io/libs-snapshot-local/org/apache/maven/shared/file-management/3.0.0/file-management-3.0.0.jar
06-May-2018 14:57:36 Downloading: https://repo.spring.io/libs-snapshot-local/org/apache/maven/shared/maven-shared-io/3.0.0/maven-shared-io-3.0.0.jar
06-May-2018 14:57:36 Downloading: https://repo.spring.io/libs-milestone-local/org/apache/maven/shared/file-management/3.0.0/file-management-3.0.0.jar
06-May-2018 14:57:36 Downloading: https://repo.spring.io/libs-milestone-local/org/apache/maven/shared/maven-shared-io/3.0.0/maven-shared-io-3.0.0.jar
06-May-2018 14:57:36 Downloading: https://repo.maven.apache.org/maven2/org/apache/maven/shared/file-management/3.0.0/file-management-3.0.0.jar
06-May-2018 14:57:36 Downloading: https://repo.maven.apache.org/maven2/org/apache/maven/shared/maven-shared-io/3.0.0/maven-shared-io-3.0.0.jar
06-May-2018 14:57:36 Progress (1): 2.2/35 kB
06-May-2018 14:57:36 Progress (1): 5.0/35 kB
06-May-2018 14:57:36 Progress (1): 7.7/35 kB
06-May-2018 14:57:36 Progress (2): 7.7/35 kB | 2.8/41 kB
06-May-2018 14:57:36 Progress (2): 7.7/35 kB | 5.5/41 kB
06-May-2018 14:57:36 Progress (2): 10/35 kB | 5.5/41 kB
06-May-2018 14:57:36 Progress (2): 10/35 kB | 8.3/41 kB
06-May-2018 14:57:36 Progress (2): 10/35 kB | 11/41 kB
06-May-2018 14:57:36 Progress (2): 10/35 kB | 14/41 kB
06-May-2018 14:57:36 Progress (2): 13/35 kB | 14/41 kB
06-May-2018 14:57:36 Progress (2): 16/35 kB | 14/41 kB
06-May-2018 14:57:36 Progress (2): 16/35 kB | 16/41 kB
06-May-2018 14:57:36 Progress (2): 19/35 kB | 16/41 kB
06-May-2018 14:57:36 Progress (2): 19/35 kB | 19/41 kB
06-May-2018 14:57:36 Progress (2): 21/35 kB | 19/41 kB
06-May-2018 14:57:36 Progress (2): 21/35 kB | 22/41 kB
06-May-2018 14:57:36 Progress (2): 24/35 kB | 22/41 kB
06-May-2018 14:57:36 Progress (2): 24/35 kB | 25/41 kB
06-May-2018 14:57:36 Progress (2): 27/35 kB | 25/41 kB
06-May-2018 14:57:36 Progress (2): 27/35 kB | 27/41 kB
06-May-2018 14:57:36 Progress (2): 30/35 kB | 27/41 kB
06-May-2018 14:57:36 Progress (2): 30/35 kB | 30/41 kB
06-May-2018 14:57:36 Progress (2): 32/35 kB | 30/41 kB
06-May-2018 14:57:36 Progress (2): 32/35 kB | 33/41 kB
06-May-2018 14:57:36 Progress (2): 35/35 kB | 33/41 kB
06-May-2018 14:57:36 Progress (2): 35 kB | 33/41 kB   
06-May-2018 14:57:36 Progress (2): 35 kB | 37/41 kB
06-May-2018 14:57:36 Progress (2): 35 kB | 41/41 kB
06-May-2018 14:57:36 Progress (2): 35 kB | 41 kB   
06-May-2018 14:57:36                            
06-May-2018 14:57:36 Downloaded: https://repo.maven.apache.org/maven2/org/apache/maven/shared/file-management/3.0.0/file-management-3.0.0.jar (35 kB at 2.4 MB/s)
06-May-2018 14:57:36 Downloaded: https://repo.maven.apache.org/maven2/org/apache/maven/shared/maven-shared-io/3.0.0/maven-shared-io-3.0.0.jar (41 kB at 2.2 MB/s)
06-May-2018 14:57:36 [INFO]
06-May-2018 14:57:36 [INFO] --- maven-install-plugin:2.4:install (default-install) @ spring-cloud-task-docs ---
06-May-2018 14:57:36 [INFO] Installing /opt/bamboo-home/xml-data/build-dir/SCT-STASK-JOB1/spring-cloud-task-docs/target/spring-cloud-task-docs-2.0.0.RELEASE.jar to /home/bamboo/.m2/repository/org/springframework/cloud/spring-cloud-task-docs/2.0.0.RELEASE/spring-cloud-task-docs-2.0.0.RELEASE.jar
06-May-2018 14:57:36 [INFO] Installing /opt/bamboo-home/xml-data/build-dir/SCT-STASK-JOB1/spring-cloud-task-docs/pom.xml to /home/bamboo/.m2/repository/org/springframework/cloud/spring-cloud-task-docs/2.0.0.RELEASE/spring-cloud-task-docs-2.0.0.RELEASE.pom
06-May-2018 14:57:36 [INFO] Installing /opt/bamboo-home/xml-data/build-dir/SCT-STASK-JOB1/spring-cloud-task-docs/target/spring-cloud-task-docs-2.0.0.RELEASE.zip to /home/bamboo/.m2/repository/org/springframework/cloud/spring-cloud-task-docs/2.0.0.RELEASE/spring-cloud-task-docs-2.0.0.RELEASE.zip;zip.type=docs;zip.deployed=false
06-May-2018 14:57:36 [INFO] Artifactory Build Info Recorder: Saving Build Info to '/opt/bamboo-home/xml-data/build-dir/SCT-STASK-JOB1/target/build-info.json'
06-May-2018 14:57:37 [INFO] Deploying artifact: https://repo.spring.io/libs-snapshot-local/org/springframework/cloud/spring-cloud-task-stream/2.0.0.RELEASE/spring-cloud-task-stream-2.0.0.RELEASE.jar
06-May-2018 14:57:37 [ERROR] org.jfrog.build.extractor.maven.BuildInfoRecorder.sessionEnded() listener has failed:
06-May-2018 14:57:37 java.lang.RuntimeException: Error occurred while publishing artifact to Artifactory: /opt/bamboo-home/xml-data/build-dir/SCT-STASK-JOB1/spring-cloud-task-stream/target/spring-cloud-task-stream-2.0.0.RELEASE.jar.
06-May-2018 14:57:37 Skipping deployment of remaining artifacts (if any) and build info.
06-May-2018 14:57:37         at org.jfrog.build.extractor.maven.BuildDeploymentHelper.deployArtifacts(BuildDeploymentHelper.java:296)
06-May-2018 14:57:37         at org.jfrog.build.extractor.maven.BuildDeploymentHelper.deploy(BuildDeploymentHelper.java:117)
06-May-2018 14:57:37         at org.jfrog.build.extractor.maven.BuildInfoRecorder.sessionEnded(BuildInfoRecorder.java:173)
06-May-2018 14:57:37         at org.apache.maven.lifecycle.internal.DefaultExecutionEventCatapult.fire(DefaultExecutionEventCatapult.java:64)
06-May-2018 14:57:37         at org.apache.maven.lifecycle.internal.DefaultExecutionEventCatapult.fire(DefaultExecutionEventCatapult.java:42)
06-May-2018 14:57:37         at org.apache.maven.lifecycle.internal.LifecycleStarter.execute(LifecycleStarter.java:137)
06-May-2018 14:57:37         at org.apache.maven.DefaultMaven.doExecute(DefaultMaven.java:309)
06-May-2018 14:57:37         at org.apache.maven.DefaultMaven.doExecute(DefaultMaven.java:194)
06-May-2018 14:57:37         at org.apache.maven.DefaultMaven.execute(DefaultMaven.java:107)
06-May-2018 14:57:37         at org.apache.maven.cli.MavenCli.execute(MavenCli.java:993)
06-May-2018 14:57:37         at org.apache.maven.cli.MavenCli.doMain(MavenCli.java:345)
06-May-2018 14:57:37         at org.apache.maven.cli.MavenCli.main(MavenCli.java:191)
06-May-2018 14:57:37         at sun.reflect.NativeMethodAccessorImpl.invoke0(Native Method)
06-May-2018 14:57:37         at sun.reflect.NativeMethodAccessorImpl.invoke(NativeMethodAccessorImpl.java:62)
06-May-2018 14:57:37         at sun.reflect.DelegatingMethodAccessorImpl.invoke(DelegatingMethodAccessorImpl.java:43)
06-May-2018 14:57:37         at java.lang.reflect.Method.invoke(Method.java:498)
06-May-2018 14:57:37         at org.codehaus.plexus.classworlds.launcher.Launcher.launchEnhanced(Launcher.java:289)
06-May-2018 14:57:37         at org.codehaus.plexus.classworlds.launcher.Launcher.launch(Launcher.java:229)
06-May-2018 14:57:37         at org.codehaus.plexus.classworlds.launcher.Launcher.mainWithExitCode(Launcher.java:415)
06-May-2018 14:57:37         at org.codehaus.plexus.classworlds.launcher.Launcher.main(Launcher.java:356)
06-May-2018 14:57:37 Caused by: java.io.IOException: Failed to deploy file. Status code: 409 Response message: Artifactory returned the following errors:
06-May-2018 14:57:37 The repository 'libs-snapshot-local' rejected the resolution of an artifact 'libs-snapshot-local:org/springframework/cloud/spring-cloud-task-stream/2.0.0.RELEASE/spring-cloud-task-stream-2.0.0.RELEASE.jar' due to conflict in the snapshot release handling policy. Status code: 409
06-May-2018 14:57:37         at org.jfrog.build.extractor.clientConfiguration.client.ArtifactoryBuildInfoClient.uploadFile(ArtifactoryBuildInfoClient.java:656)
06-May-2018 14:57:37         at org.jfrog.build.extractor.clientConfiguration.client.ArtifactoryBuildInfoClient.deployArtifact(ArtifactoryBuildInfoClient.java:343)
06-May-2018 14:57:37         at org.jfrog.build.extractor.maven.BuildDeploymentHelper.deployArtifacts(BuildDeploymentHelper.java:294)
06-May-2018 14:57:37         ... 19 more
06-May-2018 14:57:37 [ERROR] Internal error: java.lang.RuntimeException: org.jfrog.build.extractor.maven.BuildInfoRecorder.sessionEnded() listener has failed: Error occurred while publishing artifact to Artifactory: /opt/bamboo-home/xml-data/build-dir/SCT-STASK-JOB1/spring-cloud-task-stream/target/spring-cloud-task-stream-2.0.0.RELEASE.jar.
06-May-2018 14:57:37 [ERROR]  Skipping deployment of remaining artifacts (if any) and build info. Failed to deploy file. Status code: 409 Response message: Artifactory returned the following errors:
06-May-2018 14:57:37 [ERROR] The repository 'libs-snapshot-local' rejected the resolution of an artifact 'libs-snapshot-local:org/springframework/cloud/spring-cloud-task-stream/2.0.0.RELEASE/spring-cloud-task-stream-2.0.0.RELEASE.jar' due to conflict in the snapshot release handling policy. Status code: 409
06-May-2018 14:57:37 [ERROR] -> [Help 1]
06-May-2018 14:57:37 org.apache.maven.InternalErrorException: Internal error: java.lang.RuntimeException: org.jfrog.build.extractor.maven.BuildInfoRecorder.sessionEnded() listener has failed:
06-May-2018 14:57:37         at org.apache.maven.DefaultMaven.execute(DefaultMaven.java:122)
06-May-2018 14:57:37         at org.apache.maven.cli.MavenCli.execute(MavenCli.java:993)
06-May-2018 14:57:37         at org.apache.maven.cli.MavenCli.doMain(MavenCli.java:345)
06-May-2018 14:57:37         at org.apache.maven.cli.MavenCli.main(MavenCli.java:191)
06-May-2018 14:57:37         at sun.reflect.NativeMethodAccessorImpl.invoke0(Native Method)
06-May-2018 14:57:37         at sun.reflect.NativeMethodAccessorImpl.invoke(NativeMethodAccessorImpl.java:62)
06-May-2018 14:57:37         at sun.reflect.DelegatingMethodAccessorImpl.invoke(DelegatingMethodAccessorImpl.java:43)
06-May-2018 14:57:37         at java.lang.reflect.Method.invoke(Method.java:498)
06-May-2018 14:57:37         at org.codehaus.plexus.classworlds.launcher.Launcher.launchEnhanced(Launcher.java:289)
06-May-2018 14:57:37         at org.codehaus.plexus.classworlds.launcher.Launcher.launch(Launcher.java:229)
06-May-2018 14:57:37         at org.codehaus.plexus.classworlds.launcher.Launcher.mainWithExitCode(Launcher.java:415)
06-May-2018 14:57:37         at org.codehaus.plexus.classworlds.launcher.Launcher.main(Launcher.java:356)
06-May-2018 14:57:37 Caused by: java.lang.RuntimeException: org.jfrog.build.extractor.maven.BuildInfoRecorder.sessionEnded() listener has failed:
06-May-2018 14:57:37         at org.jfrog.build.extractor.maven.BuildInfoRecorder.sessionEnded(BuildInfoRecorder.java:182)
06-May-2018 14:57:37         at org.apache.maven.lifecycle.internal.DefaultExecutionEventCatapult.fire(DefaultExecutionEventCatapult.java:64)
06-May-2018 14:57:37         at org.apache.maven.lifecycle.internal.DefaultExecutionEventCatapult.fire(DefaultExecutionEventCatapult.java:42)
06-May-2018 14:57:37         at org.apache.maven.lifecycle.internal.LifecycleStarter.execute(LifecycleStarter.java:137)
06-May-2018 14:57:37         at org.apache.maven.DefaultMaven.doExecute(DefaultMaven.java:309)
06-May-2018 14:57:37         at org.apache.maven.DefaultMaven.doExecute(DefaultMaven.java:194)
06-May-2018 14:57:37         at org.apache.maven.DefaultMaven.execute(DefaultMaven.java:107)
06-May-2018 14:57:37         ... 11 more
06-May-2018 14:57:37 Caused by: java.lang.RuntimeException: Error occurred while publishing artifact to Artifactory: /opt/bamboo-home/xml-data/build-dir/SCT-STASK-JOB1/spring-cloud-task-stream/target/spring-cloud-task-stream-2.0.0.RELEASE.jar.
06-May-2018 14:57:37 Skipping deployment of remaining artifacts (if any) and build info.
06-May-2018 14:57:37         at org.jfrog.build.extractor.maven.BuildDeploymentHelper.deployArtifacts(BuildDeploymentHelper.java:296)
06-May-2018 14:57:37         at org.jfrog.build.extractor.maven.BuildDeploymentHelper.deploy(BuildDeploymentHelper.java:117)
06-May-2018 14:57:37         at org.jfrog.build.extractor.maven.BuildInfoRecorder.sessionEnded(BuildInfoRecorder.java:173)
06-May-2018 14:57:37         ... 17 more
06-May-2018 14:57:37 Caused by: java.io.IOException: Failed to deploy file. Status code: 409 Response message: Artifactory returned the following errors:
06-May-2018 14:57:37 The repository 'libs-snapshot-local' rejected the resolution of an artifact 'libs-snapshot-local:org/springframework/cloud/spring-cloud-task-stream/2.0.0.RELEASE/spring-cloud-task-stream-2.0.0.RELEASE.jar' due to conflict in the snapshot release handling policy. Status code: 409
06-May-2018 14:57:37         at org.jfrog.build.extractor.clientConfiguration.client.ArtifactoryBuildInfoClient.uploadFile(ArtifactoryBuildInfoClient.java:656)
06-May-2018 14:57:37         at org.jfrog.build.extractor.clientConfiguration.client.ArtifactoryBuildInfoClient.deployArtifact(ArtifactoryBuildInfoClient.java:343)
06-May-2018 14:57:37         at org.jfrog.build.extractor.maven.BuildDeploymentHelper.deployArtifacts(BuildDeploymentHelper.java:294)
06-May-2018 14:57:37         ... 19 more
06-May-2018 14:57:37 [ERROR]
06-May-2018 14:57:37 [ERROR] To see the full stack trace of the errors, re-run Maven with the -e switch.
06-May-2018 14:57:37 [ERROR] Re-run Maven using the -X switch to enable full debug logging.
06-May-2018 14:57:37 [ERROR]
06-May-2018 14:57:37 [ERROR] For more information about the errors and possible solutions, please read the following articles:
06-May-2018 14:57:37 [ERROR] [Help 1] http://cwiki.apache.org/confluence/display/MAVEN/InternalErrorException
06-May-2018 14:57:37
06-May-2018 14:57:37 Failing task since return code of [/opt/jdk-8/bin/java -cp /opt/maven-3.5/boot/plexus-classworlds-2.5.2.jar -Dclassworlds.conf=/tmp/artifactoryM28131038985720474545conf -DbuildInfoConfig.propertiesFile=/tmp/buildInfo391981882739738588.properties -Xmx2048m -XX:MaxPermSize=2048m -Dmaven.home=/opt/maven-3.5 -Dmaven.multiModuleProjectDirectory=/opt/bamboo-home/xml-data/build-dir/SCT-STASK-JOB1 org.codehaus.plexus.classworlds.launcher.Launcher clean install -Pfull,skipIntegrationTests -Dartifactory.publish.password=********] was 1 while expected 0
06-May-2018 14:57:37 Parsing test results under /opt/bamboo-home/xml-data/build-dir/SCT-STASK-JOB1...
06-May-2018 14:57:37 Finished task 'Build and publish Spring Cloud Task Modules' with result: Failed
06-May-2018 14:57:37 Running post build plugin 'Docker Container Cleanup'
06-May-2018 14:57:37 Running post build plugin 'NCover Results Collector'
06-May-2018 14:57:37 Running post build plugin 'Artifactory Release Management Staging'
06-May-2018 14:57:38 Running post build plugin 'Artifactory Build Info Copier'
06-May-2018 14:57:38 Copying the buildinfo artifacts for build: SCT-STASK-JOB1-403
06-May-2018 14:57:38 Running post build plugin 'Artifactory Gradle Properties Info Copier'
06-May-2018 14:57:38 Running post build plugin 'Clover Results Collector'
06-May-2018 14:57:38 Running post build plugin 'npm Cache Cleanup'
06-May-2018 14:57:38 Running post build plugin 'Artifact Copier'
06-May-2018 14:57:38 Publishing an artifact: Test Results
06-May-2018 14:57:38 Finished publishing of artifact Shared artifact: [Test Results], pattern: [**/target/surefire-reports/**/*.*] in 301.5 ms
06-May-2018 14:57:38 Finalising the build...
06-May-2018 14:57:38 Stopping timer.
06-May-2018 14:57:38 Build SCT-STASK-JOB1-403 completed.
06-May-2018 14:57:38 Running on server: post build plugin 'NCover Results Collector'
06-May-2018 14:57:38 Running on server: post build plugin 'Build Hanging Detection Configuration'
06-May-2018 14:57:38 Running on server: post build plugin 'Clover Delta Calculator'
06-May-2018 14:57:38 Running on server: post build plugin 'Maven Dependencies Postprocessor'
06-May-2018 14:57:38 All post build plugins have finished
06-May-2018 14:57:38 Generating build results summary...
06-May-2018 14:57:39 Saving build results to disk...
06-May-2018 14:57:39 Logging substituted variables...
06-May-2018 14:57:39 Indexing build results...
06-May-2018 14:57:39 Finished building SCT-STASK-JOB1-403.