Build #479

Builds the Spring Cloud Task project

Build: #479 failed

Job: Build Spring Cloud Task Project failed

Stages & jobs

  1. Default Stage

Job result summary

Completed
Duration
4 minutes
Revision
d7a47002704786699976e6f1ab6820722b0addf5 d7a47002704786699976e6f1ab6820722b0addf5
Total tests
329
Failing since
#478 (Code changes detected – )
Fixed in
#481 (Code changes detected)

Tests

  • 329 tests in total
  • 1 test failed
  • 1 minute taken in total.
Existing test failures 1
Status Test Failing since Duration
org.springframework.context.ApplicationContextException: Failed to start bean 'outputBindingLifecycle'; nested exception is org.springframework.beans.factory.BeanCreationException: Error creating bean with name 'rabbitMessageChannelBinder' defined in org.springframework.cloud.stream.binder.rabbit.config.RabbitMessageChannelBinderConfiguration: Bean instantiation via factory method failed; nested exception is org.springframework.beans.BeanInstantiationException: Failed to instantiate [org.springframework.cloud.stream.binder.rabbit.RabbitMessageChannelBinder]: Factory method 'rabbitMessageChannelBinder' threw exception; nested exception is java.lang.NoClassDefFoundError: org/springframework/amqp/rabbit/core/support/BatchingStrategy
	at io.spring.cloud.BatchEventsApplicationTests.testExecution(BatchEventsApplicationTests.java:49)
Caused by: org.springframework.beans.factory.BeanCreationException: Error creating bean with name 'rabbitMessageChannelBinder' defined in org.springframework.cloud.stream.binder.rabbit.config.RabbitMessageChannelBinderConfiguration: Bean instantiation via factory method failed; nested exception is org.springframework.beans.BeanInstantiationException: Failed to instantiate [org.springframework.cloud.stream.binder.rabbit.RabbitMessageChannelBinder]: Factory method 'rabbitMessageChannelBinder' threw exception; nested exception is java.lang.NoClassDefFoundError: org/springframework/amqp/rabbit/core/support/BatchingStrategy
	at io.spring.cloud.BatchEventsApplicationTests.testExecution(BatchEventsApplicationTests.java:49)
Caused by: org.springframework.beans.BeanInstantiationException: Failed to instantiate [org.springframework.cloud.stream.binder.rabbit.RabbitMessageChannelBinder]: Factory method 'rabbitMessageChannelBinder' threw exception; nested exception is java.lang.NoClassDefFoundError: org/springframework/amqp/rabbit/core/support/BatchingStrategy
	at io.spring.cloud.BatchEventsApplicationTests.testExecution(BatchEventsApplicationTests.java:49)
Caused by: java.lang.NoClassDefFoundError: org/springframework/amqp/rabbit/core/support/BatchingStrategy
	at io.spring.cloud.BatchEventsApplicationTests.testExecution(BatchEventsApplicationTests.java:49)
(2 more lines...)

Error summary

The build generated some errors. See the full build log for more details.

Java HotSpot(TM) 64-Bit Server VM warning: ignoring option MaxPermSize=2048m; support was removed in 8.0