Build #479

Builds the Spring Cloud Task project

Build: #479 failed

Job: Build Spring Cloud Task Project failed

Stages & jobs

  1. Default Stage

Build log

The build generated 18,276 lines of output.The output is too long and has been truncated to the last 1,000 lines. Download or view full build log

21-May-2019 14:38:05 2019-05-21 14:38:05.699 DEBUG 9170 --- [           main] o.s.jdbc.core.JdbcTemplate               : Executing prepared SQL statement [SELECT TASK_EXECUTION_ID, START_TIME, END_TIME, TASK_NAME, EXIT_CODE, EXIT_MESSAGE, ERROR_MESSAGE, LAST_UPDATED, EXTERNAL_EXECUTION_ID, PARENT_EXECUTION_ID from TASK_EXECUTION where TASK_EXECUTION_ID = ?]
21-May-2019 14:38:05 2019-05-21 14:38:05.700 DEBUG 9170 --- [           main] o.s.jdbc.core.JdbcTemplate               : Executing prepared SQL query
21-May-2019 14:38:05 2019-05-21 14:38:05.700 DEBUG 9170 --- [           main] o.s.jdbc.core.JdbcTemplate               : Executing prepared SQL statement [SELECT TASK_EXECUTION_ID, TASK_PARAM from TASK_EXECUTION_PARAMS where TASK_EXECUTION_ID = ?]
21-May-2019 14:38:05 2019-05-21 14:38:05.701 DEBUG 9170 --- [           main] o.s.jdbc.core.JdbcTemplate               : Executing prepared SQL query
21-May-2019 14:38:05 2019-05-21 14:38:05.701 DEBUG 9170 --- [           main] o.s.jdbc.core.JdbcTemplate               : Executing prepared SQL statement [SELECT TASK_EXECUTION_ID, TASK_PARAM from TASK_EXECUTION_PARAMS where TASK_EXECUTION_ID = ?]
21-May-2019 14:38:05 2019-05-21 14:38:05.701 DEBUG 9170 --- [           main] o.s.j.d.DataSourceTransactionManager     : Initiating transaction commit
21-May-2019 14:38:05 2019-05-21 14:38:05.701 DEBUG 9170 --- [           main] o.s.j.d.DataSourceTransactionManager     : Committing JDBC transaction on Connection [HikariProxyConnection@1751753651 wrapping conn0: url=jdbc:h2:mem:testdb user=SA]
21-May-2019 14:38:05 2019-05-21 14:38:05.701 DEBUG 9170 --- [           main] o.s.j.d.DataSourceTransactionManager     : Releasing JDBC Connection [HikariProxyConnection@1751753651 wrapping conn0: url=jdbc:h2:mem:testdb user=SA] after transaction
21-May-2019 14:38:05 [INFO] Tests run: 1, Failures: 0, Errors: 0, Skipped: 0, Time elapsed: 1.878 s - in io.spring.BatchJobApplicationTests
21-May-2019 14:38:05 2019-05-21 14:38:05.722 DEBUG 9170 --- [       Thread-2] s.c.a.AnnotationConfigApplicationContext : Closing org.springframework.context.annotation.AnnotationConfigApplicationContext@48075da3, started on Tue May 21 14:38:04 UTC 2019
21-May-2019 14:38:05 2019-05-21 14:38:05.724 DEBUG 9170 --- [       Thread-2] o.s.c.support.DefaultLifecycleProcessor  : Stopping beans in phase 0
21-May-2019 14:38:05 2019-05-21 14:38:05.725 DEBUG 9170 --- [       Thread-2] o.s.c.support.DefaultLifecycleProcessor  : Bean 'taskLifecycleListener' completed its stop procedure
21-May-2019 14:38:05 2019-05-21 14:38:05.725  INFO 9170 --- [       Thread-2] com.zaxxer.hikari.HikariDataSource       : HikariPool-1 - Shutdown initiated...
21-May-2019 14:38:05 2019-05-21 14:38:05.725 DEBUG 9170 --- [       Thread-2] com.zaxxer.hikari.pool.HikariPool        : HikariPool-1 - Before shutdown stats (total=10, active=0, idle=10, waiting=0)
21-May-2019 14:38:05 2019-05-21 14:38:05.726 DEBUG 9170 --- [nnection closer] com.zaxxer.hikari.pool.PoolBase          : HikariPool-1 - Closing connection conn0: url=jdbc:h2:mem:testdb user=SA: (connection evicted)
21-May-2019 14:38:05 2019-05-21 14:38:05.726 DEBUG 9170 --- [nnection closer] com.zaxxer.hikari.pool.PoolBase          : HikariPool-1 - Closing connection conn1: url=jdbc:h2:mem:testdb user=SA: (connection evicted)
21-May-2019 14:38:05 2019-05-21 14:38:05.726 DEBUG 9170 --- [nnection closer] com.zaxxer.hikari.pool.PoolBase          : HikariPool-1 - Closing connection conn2: url=jdbc:h2:mem:testdb user=SA: (connection evicted)
21-May-2019 14:38:05 2019-05-21 14:38:05.727 DEBUG 9170 --- [nnection closer] com.zaxxer.hikari.pool.PoolBase          : HikariPool-1 - Closing connection conn3: url=jdbc:h2:mem:testdb user=SA: (connection evicted)
21-May-2019 14:38:05 2019-05-21 14:38:05.727 DEBUG 9170 --- [nnection closer] com.zaxxer.hikari.pool.PoolBase          : HikariPool-1 - Closing connection conn4: url=jdbc:h2:mem:testdb user=SA: (connection evicted)
21-May-2019 14:38:05 2019-05-21 14:38:05.727 DEBUG 9170 --- [nnection closer] com.zaxxer.hikari.pool.PoolBase          : HikariPool-1 - Closing connection conn5: url=jdbc:h2:mem:testdb user=SA: (connection evicted)
21-May-2019 14:38:05 2019-05-21 14:38:05.727 DEBUG 9170 --- [nnection closer] com.zaxxer.hikari.pool.PoolBase          : HikariPool-1 - Closing connection conn6: url=jdbc:h2:mem:testdb user=SA: (connection evicted)
21-May-2019 14:38:05 2019-05-21 14:38:05.727 DEBUG 9170 --- [nnection closer] com.zaxxer.hikari.pool.PoolBase          : HikariPool-1 - Closing connection conn7: url=jdbc:h2:mem:testdb user=SA: (connection evicted)
21-May-2019 14:38:05 2019-05-21 14:38:05.727 DEBUG 9170 --- [nnection closer] com.zaxxer.hikari.pool.PoolBase          : HikariPool-1 - Closing connection conn8: url=jdbc:h2:mem:testdb user=SA: (connection evicted)
21-May-2019 14:38:05 2019-05-21 14:38:05.727 DEBUG 9170 --- [nnection closer] com.zaxxer.hikari.pool.PoolBase          : HikariPool-1 - Closing connection conn9: url=jdbc:h2:mem:testdb user=SA: (connection evicted)
21-May-2019 14:38:05 2019-05-21 14:38:05.727 DEBUG 9170 --- [       Thread-2] com.zaxxer.hikari.pool.HikariPool        : HikariPool-1 - After shutdown stats (total=0, active=0, idle=0, waiting=0)
21-May-2019 14:38:05 2019-05-21 14:38:05.728  INFO 9170 --- [       Thread-2] com.zaxxer.hikari.HikariDataSource       : HikariPool-1 - Shutdown completed.
21-May-2019 14:38:06 [INFO]
21-May-2019 14:38:06 [INFO] Results:
21-May-2019 14:38:06 [INFO]
21-May-2019 14:38:06 [INFO] Tests run: 1, Failures: 0, Errors: 0, Skipped: 0
21-May-2019 14:38:06 [INFO]
21-May-2019 14:38:06 [INFO]
21-May-2019 14:38:06 [INFO] --- maven-jar-plugin:3.1.2:jar (default-jar) @ batch-job ---
21-May-2019 14:38:06 [INFO] Building jar: /opt/bamboo-home/xml-data/build-dir/SCT-STASK-JOB1/spring-cloud-task-samples/batch-job/target/batch-job-2.2.0.BUILD-SNAPSHOT.jar
21-May-2019 14:38:06 [INFO]
21-May-2019 14:38:06 [INFO] --- spring-boot-maven-plugin:2.2.0.BUILD-SNAPSHOT:repackage (repackage) @ batch-job ---
21-May-2019 14:38:06 [INFO] Replacing main artifact with repackaged archive
21-May-2019 14:38:06 [INFO]
21-May-2019 14:38:06 [INFO] --- maven-javadoc-plugin:3.0.1:jar (attach-javadocs) @ batch-job ---
21-May-2019 14:38:06 [ERROR] Error fetching link: /opt/bamboo-home/xml-data/build-dir/SCT-STASK-JOB1/spring-cloud-starter-task/target/apidocs/package-list. Ignored it.
21-May-2019 14:38:07 [INFO]
21-May-2019 14:38:07 Loading source files for package io.spring...
21-May-2019 14:38:07 Loading source files for package io.spring.configuration...
21-May-2019 14:38:07 Constructing Javadoc information...
21-May-2019 14:38:07 Standard Doclet version 1.8.0_201
21-May-2019 14:38:07 Building tree for all the packages and classes...
21-May-2019 14:38:07 Generating /opt/bamboo-home/xml-data/build-dir/SCT-STASK-JOB1/spring-cloud-task-samples/batch-job/target/apidocs/io/spring/BatchJobApplication.html...
21-May-2019 14:38:07 Generating /opt/bamboo-home/xml-data/build-dir/SCT-STASK-JOB1/spring-cloud-task-samples/batch-job/target/apidocs/io/spring/configuration/JobConfiguration.html...
21-May-2019 14:38:07 Generating /opt/bamboo-home/xml-data/build-dir/SCT-STASK-JOB1/spring-cloud-task-samples/batch-job/target/apidocs/overview-frame.html...
21-May-2019 14:38:07 Generating /opt/bamboo-home/xml-data/build-dir/SCT-STASK-JOB1/spring-cloud-task-samples/batch-job/target/apidocs/io/spring/package-frame.html...
21-May-2019 14:38:07 Generating /opt/bamboo-home/xml-data/build-dir/SCT-STASK-JOB1/spring-cloud-task-samples/batch-job/target/apidocs/io/spring/package-summary.html...
21-May-2019 14:38:07 Generating /opt/bamboo-home/xml-data/build-dir/SCT-STASK-JOB1/spring-cloud-task-samples/batch-job/target/apidocs/io/spring/package-tree.html...
21-May-2019 14:38:07 Generating /opt/bamboo-home/xml-data/build-dir/SCT-STASK-JOB1/spring-cloud-task-samples/batch-job/target/apidocs/io/spring/configuration/package-frame.html...
21-May-2019 14:38:07 Generating /opt/bamboo-home/xml-data/build-dir/SCT-STASK-JOB1/spring-cloud-task-samples/batch-job/target/apidocs/io/spring/configuration/package-summary.html...
21-May-2019 14:38:07 Generating /opt/bamboo-home/xml-data/build-dir/SCT-STASK-JOB1/spring-cloud-task-samples/batch-job/target/apidocs/io/spring/configuration/package-tree.html...
21-May-2019 14:38:07 Generating /opt/bamboo-home/xml-data/build-dir/SCT-STASK-JOB1/spring-cloud-task-samples/batch-job/target/apidocs/constant-values.html...
21-May-2019 14:38:07 Generating /opt/bamboo-home/xml-data/build-dir/SCT-STASK-JOB1/spring-cloud-task-samples/batch-job/target/apidocs/io/spring/class-use/BatchJobApplication.html...
21-May-2019 14:38:07 Generating /opt/bamboo-home/xml-data/build-dir/SCT-STASK-JOB1/spring-cloud-task-samples/batch-job/target/apidocs/io/spring/configuration/class-use/JobConfiguration.html...
21-May-2019 14:38:07 Generating /opt/bamboo-home/xml-data/build-dir/SCT-STASK-JOB1/spring-cloud-task-samples/batch-job/target/apidocs/io/spring/package-use.html...
21-May-2019 14:38:07 Generating /opt/bamboo-home/xml-data/build-dir/SCT-STASK-JOB1/spring-cloud-task-samples/batch-job/target/apidocs/io/spring/configuration/package-use.html...
21-May-2019 14:38:07 Building index for all the packages and classes...
21-May-2019 14:38:07 Generating /opt/bamboo-home/xml-data/build-dir/SCT-STASK-JOB1/spring-cloud-task-samples/batch-job/target/apidocs/overview-tree.html...
21-May-2019 14:38:07 Generating /opt/bamboo-home/xml-data/build-dir/SCT-STASK-JOB1/spring-cloud-task-samples/batch-job/target/apidocs/index-all.html...
21-May-2019 14:38:07 Generating /opt/bamboo-home/xml-data/build-dir/SCT-STASK-JOB1/spring-cloud-task-samples/batch-job/target/apidocs/deprecated-list.html...
21-May-2019 14:38:07 Building index for all classes...
21-May-2019 14:38:07 Generating /opt/bamboo-home/xml-data/build-dir/SCT-STASK-JOB1/spring-cloud-task-samples/batch-job/target/apidocs/allclasses-frame.html...
21-May-2019 14:38:07 Generating /opt/bamboo-home/xml-data/build-dir/SCT-STASK-JOB1/spring-cloud-task-samples/batch-job/target/apidocs/allclasses-noframe.html...
21-May-2019 14:38:07 Generating /opt/bamboo-home/xml-data/build-dir/SCT-STASK-JOB1/spring-cloud-task-samples/batch-job/target/apidocs/index.html...
21-May-2019 14:38:07 Generating /opt/bamboo-home/xml-data/build-dir/SCT-STASK-JOB1/spring-cloud-task-samples/batch-job/target/apidocs/overview-summary.html...
21-May-2019 14:38:07 Generating /opt/bamboo-home/xml-data/build-dir/SCT-STASK-JOB1/spring-cloud-task-samples/batch-job/target/apidocs/help-doc.html...
21-May-2019 14:38:07 [INFO] Building jar: /opt/bamboo-home/xml-data/build-dir/SCT-STASK-JOB1/spring-cloud-task-samples/batch-job/target/batch-job-2.2.0.BUILD-SNAPSHOT-javadoc.jar
21-May-2019 14:38:07 [INFO]
21-May-2019 14:38:07 [INFO] >>> maven-source-plugin:3.0.1:jar (attach-sources) > generate-sources @ batch-job >>>
21-May-2019 14:38:07 [INFO]
21-May-2019 14:38:07 [INFO] <<< maven-source-plugin:3.0.1:jar (attach-sources) < generate-sources @ batch-job <<<
21-May-2019 14:38:07 [INFO]
21-May-2019 14:38:07 [INFO]
21-May-2019 14:38:07 [INFO] --- maven-source-plugin:3.0.1:jar (attach-sources) @ batch-job ---
21-May-2019 14:38:07 [INFO] Building jar: /opt/bamboo-home/xml-data/build-dir/SCT-STASK-JOB1/spring-cloud-task-samples/batch-job/target/batch-job-2.2.0.BUILD-SNAPSHOT-sources.jar
21-May-2019 14:38:07 [INFO]
21-May-2019 14:38:07 [INFO] --- maven-install-plugin:2.5.2:install (default-install) @ batch-job ---
21-May-2019 14:38:07 [INFO] Installing /opt/bamboo-home/xml-data/build-dir/SCT-STASK-JOB1/spring-cloud-task-samples/batch-job/target/batch-job-2.2.0.BUILD-SNAPSHOT.jar to /home/bamboo/.m2/repository/io/spring/cloud/batch-job/2.2.0.BUILD-SNAPSHOT/batch-job-2.2.0.BUILD-SNAPSHOT.jar
21-May-2019 14:38:07 [INFO] Installing /opt/bamboo-home/xml-data/build-dir/SCT-STASK-JOB1/spring-cloud-task-samples/batch-job/pom.xml to /home/bamboo/.m2/repository/io/spring/cloud/batch-job/2.2.0.BUILD-SNAPSHOT/batch-job-2.2.0.BUILD-SNAPSHOT.pom
21-May-2019 14:38:07 [INFO] Installing /opt/bamboo-home/xml-data/build-dir/SCT-STASK-JOB1/spring-cloud-task-samples/batch-job/target/batch-job-2.2.0.BUILD-SNAPSHOT-javadoc.jar to /home/bamboo/.m2/repository/io/spring/cloud/batch-job/2.2.0.BUILD-SNAPSHOT/batch-job-2.2.0.BUILD-SNAPSHOT-javadoc.jar
21-May-2019 14:38:07 [INFO] Installing /opt/bamboo-home/xml-data/build-dir/SCT-STASK-JOB1/spring-cloud-task-samples/batch-job/target/batch-job-2.2.0.BUILD-SNAPSHOT-sources.jar to /home/bamboo/.m2/repository/io/spring/cloud/batch-job/2.2.0.BUILD-SNAPSHOT/batch-job-2.2.0.BUILD-SNAPSHOT-sources.jar
21-May-2019 14:38:07 [INFO]
21-May-2019 14:38:07 [INFO] ------------------------------------------------------------------------
21-May-2019 14:38:07 [INFO] Building Task Sink Sample Application 2.2.0.BUILD-SNAPSHOT
21-May-2019 14:38:07 [INFO] ------------------------------------------------------------------------
21-May-2019 14:38:07 [INFO]
21-May-2019 14:38:07 [INFO] --- maven-clean-plugin:3.1.0:clean (default-clean) @ tasksink ---
21-May-2019 14:38:07 [INFO] Deleting /opt/bamboo-home/xml-data/build-dir/SCT-STASK-JOB1/spring-cloud-task-samples/tasksink/target
21-May-2019 14:38:07 [INFO]
21-May-2019 14:38:07 [INFO] --- maven-resources-plugin:3.1.0:resources (default-resources) @ tasksink ---
21-May-2019 14:38:07 [INFO] Using 'UTF-8' encoding to copy filtered resources.
21-May-2019 14:38:07 [INFO] Copying 1 resource
21-May-2019 14:38:07 [INFO] Copying 0 resource
21-May-2019 14:38:07 [INFO]
21-May-2019 14:38:07 [INFO] --- maven-compiler-plugin:3.8.1:compile (default-compile) @ tasksink ---
21-May-2019 14:38:07 [INFO] Changes detected - recompiling the module!
21-May-2019 14:38:07 [INFO] Compiling 1 source file to /opt/bamboo-home/xml-data/build-dir/SCT-STASK-JOB1/spring-cloud-task-samples/tasksink/target/classes
21-May-2019 14:38:07 [INFO]
21-May-2019 14:38:07 [INFO] --- maven-resources-plugin:3.1.0:testResources (default-testResources) @ tasksink ---
21-May-2019 14:38:07 [INFO] Using 'UTF-8' encoding to copy filtered resources.
21-May-2019 14:38:07 [INFO] Copying 1 resource
21-May-2019 14:38:07 [INFO]
21-May-2019 14:38:07 [INFO] --- maven-compiler-plugin:3.8.1:testCompile (default-testCompile) @ tasksink ---
21-May-2019 14:38:07 [INFO] Changes detected - recompiling the module!
21-May-2019 14:38:07 [INFO] Compiling 2 source files to /opt/bamboo-home/xml-data/build-dir/SCT-STASK-JOB1/spring-cloud-task-samples/tasksink/target/test-classes
21-May-2019 14:38:07 [INFO] /opt/bamboo-home/xml-data/build-dir/SCT-STASK-JOB1/spring-cloud-task-samples/tasksink/src/test/java/io/spring/TaskSinkApplicationTests.java: /opt/bamboo-home/xml-data/build-dir/SCT-STASK-JOB1/spring-cloud-task-samples/tasksink/src/test/java/io/spring/TaskSinkApplicationTests.java uses unchecked or unsafe operations.
21-May-2019 14:38:07 [INFO] /opt/bamboo-home/xml-data/build-dir/SCT-STASK-JOB1/spring-cloud-task-samples/tasksink/src/test/java/io/spring/TaskSinkApplicationTests.java: Recompile with -Xlint:unchecked for details.
21-May-2019 14:38:07 [INFO]
21-May-2019 14:38:07 [INFO] --- maven-surefire-plugin:2.22.2:test (default-test) @ tasksink ---
21-May-2019 14:38:07 [INFO]
21-May-2019 14:38:07 [INFO] -------------------------------------------------------
21-May-2019 14:38:07 [INFO]  T E S T S
21-May-2019 14:38:07 [INFO] -------------------------------------------------------
21-May-2019 14:38:08 14:38:08.321 [main] DEBUG org.springframework.test.context.junit4.SpringJUnit4ClassRunner - SpringJUnit4ClassRunner constructor called with [class io.spring.TaskSinkApplicationTests]
21-May-2019 14:38:08 14:38:08.325 [main] DEBUG org.springframework.test.context.BootstrapUtils - Instantiating CacheAwareContextLoaderDelegate from class [org.springframework.test.context.cache.DefaultCacheAwareContextLoaderDelegate]
21-May-2019 14:38:08 14:38:08.331 [main] DEBUG org.springframework.test.context.BootstrapUtils - Instantiating BootstrapContext using constructor [public org.springframework.test.context.support.DefaultBootstrapContext(java.lang.Class,org.springframework.test.context.CacheAwareContextLoaderDelegate)]
21-May-2019 14:38:08 14:38:08.356 [main] DEBUG org.springframework.test.context.BootstrapUtils - Instantiating TestContextBootstrapper for test class [io.spring.TaskSinkApplicationTests] from class [org.springframework.boot.test.context.SpringBootTestContextBootstrapper]
21-May-2019 14:38:08 14:38:08.369 [main] INFO org.springframework.boot.test.context.SpringBootTestContextBootstrapper - Neither @ContextConfiguration nor @ContextHierarchy found for test class [io.spring.TaskSinkApplicationTests], using SpringBootContextLoader
21-May-2019 14:38:08 14:38:08.373 [main] DEBUG org.springframework.test.context.support.AbstractContextLoader - Did not detect default resource location for test class [io.spring.TaskSinkApplicationTests]: class path resource [io/spring/TaskSinkApplicationTests-context.xml] does not exist
21-May-2019 14:38:08 14:38:08.373 [main] DEBUG org.springframework.test.context.support.AbstractContextLoader - Did not detect default resource location for test class [io.spring.TaskSinkApplicationTests]: class path resource [io/spring/TaskSinkApplicationTestsContext.groovy] does not exist
21-May-2019 14:38:08 14:38:08.374 [main] INFO org.springframework.test.context.support.AbstractContextLoader - Could not detect default resource locations for test class [io.spring.TaskSinkApplicationTests]: no resource found for suffixes {-context.xml, Context.groovy}.
21-May-2019 14:38:08 14:38:08.406 [main] DEBUG org.springframework.test.context.support.ActiveProfilesUtils - Could not find an 'annotation declaring class' for annotation type [org.springframework.test.context.ActiveProfiles] and class [io.spring.TaskSinkApplicationTests]
21-May-2019 14:38:08 14:38:08.523 [main] DEBUG org.springframework.boot.test.context.SpringBootTestContextBootstrapper - @TestExecutionListeners is not present for class [io.spring.TaskSinkApplicationTests]: using defaults.
21-May-2019 14:38:08 14:38:08.523 [main] INFO org.springframework.boot.test.context.SpringBootTestContextBootstrapper - Loaded default TestExecutionListener class names from location [META-INF/spring.factories]: [org.springframework.boot.test.mock.mockito.MockitoTestExecutionListener, org.springframework.boot.test.mock.mockito.ResetMocksTestExecutionListener, org.springframework.boot.test.autoconfigure.restdocs.RestDocsTestExecutionListener, org.springframework.boot.test.autoconfigure.web.client.MockRestServiceServerResetTestExecutionListener, org.springframework.boot.test.autoconfigure.web.servlet.MockMvcPrintOnlyOnFailureTestExecutionListener, org.springframework.boot.test.autoconfigure.web.servlet.WebDriverTestExecutionListener, org.springframework.test.context.web.ServletTestExecutionListener, org.springframework.test.context.support.DirtiesContextBeforeModesTestExecutionListener, org.springframework.test.context.support.DependencyInjectionTestExecutionListener, org.springframework.test.context.support.DirtiesContextTestExecutionListener, org.springframework.test.context.transaction.TransactionalTestExecutionListener, org.springframework.test.context.jdbc.SqlScriptsTestExecutionListener, org.springframework.test.context.event.EventPublishingTestExecutionListener]
21-May-2019 14:38:08 14:38:08.530 [main] DEBUG org.springframework.boot.test.context.SpringBootTestContextBootstrapper - Skipping candidate TestExecutionListener [org.springframework.test.context.web.ServletTestExecutionListener] due to a missing dependency. Specify custom listener classes or make the default listener classes and their required dependencies available. Offending class: [javax/servlet/ServletContext]
21-May-2019 14:38:08 14:38:08.535 [main] INFO org.springframework.boot.test.context.SpringBootTestContextBootstrapper - Using TestExecutionListeners: [org.springframework.test.context.support.DirtiesContextBeforeModesTestExecutionListener@87a85e1, org.springframework.boot.test.mock.mockito.MockitoTestExecutionListener@671a5887, org.springframework.boot.test.autoconfigure.SpringBootDependencyInjectionTestExecutionListener@5552768b, org.springframework.test.context.support.DirtiesContextTestExecutionListener@3c947bc5, org.springframework.test.context.transaction.TransactionalTestExecutionListener@609db43b, org.springframework.test.context.jdbc.SqlScriptsTestExecutionListener@55f616cf, org.springframework.test.context.event.EventPublishingTestExecutionListener@1356d4d4, org.springframework.boot.test.mock.mockito.ResetMocksTestExecutionListener@c03cf28, org.springframework.boot.test.autoconfigure.restdocs.RestDocsTestExecutionListener@1329eff, org.springframework.boot.test.autoconfigure.web.client.MockRestServiceServerResetTestExecutionListener@6497b078, org.springframework.boot.test.autoconfigure.web.servlet.MockMvcPrintOnlyOnFailureTestExecutionListener@41c2284a, org.springframework.boot.test.autoconfigure.web.servlet.WebDriverTestExecutionListener@53aad5d5]
21-May-2019 14:38:08 14:38:08.537 [main] DEBUG org.springframework.test.annotation.ProfileValueUtils - Retrieved @ProfileValueSourceConfiguration [null] for test class [io.spring.TaskSinkApplicationTests]
21-May-2019 14:38:08 14:38:08.538 [main] DEBUG org.springframework.test.annotation.ProfileValueUtils - Retrieved ProfileValueSource type [class org.springframework.test.annotation.SystemProfileValueSource] for class [io.spring.TaskSinkApplicationTests]
21-May-2019 14:38:08 14:38:08.554 [main] DEBUG org.springframework.test.context.junit4.SpringJUnit4ClassRunner - SpringJUnit4ClassRunner constructor called with [class io.spring.TaskSinkApplicationTests]
21-May-2019 14:38:08 14:38:08.555 [main] DEBUG org.springframework.test.context.BootstrapUtils - Instantiating CacheAwareContextLoaderDelegate from class [org.springframework.test.context.cache.DefaultCacheAwareContextLoaderDelegate]
21-May-2019 14:38:08 14:38:08.555 [main] DEBUG org.springframework.test.context.BootstrapUtils - Instantiating BootstrapContext using constructor [public org.springframework.test.context.support.DefaultBootstrapContext(java.lang.Class,org.springframework.test.context.CacheAwareContextLoaderDelegate)]
21-May-2019 14:38:08 14:38:08.555 [main] DEBUG org.springframework.test.context.BootstrapUtils - Instantiating TestContextBootstrapper for test class [io.spring.TaskSinkApplicationTests] from class [org.springframework.boot.test.context.SpringBootTestContextBootstrapper]
21-May-2019 14:38:08 14:38:08.555 [main] INFO org.springframework.boot.test.context.SpringBootTestContextBootstrapper - Neither @ContextConfiguration nor @ContextHierarchy found for test class [io.spring.TaskSinkApplicationTests], using SpringBootContextLoader
21-May-2019 14:38:08 14:38:08.556 [main] DEBUG org.springframework.test.context.support.AbstractContextLoader - Did not detect default resource location for test class [io.spring.TaskSinkApplicationTests]: class path resource [io/spring/TaskSinkApplicationTests-context.xml] does not exist
21-May-2019 14:38:08 14:38:08.556 [main] DEBUG org.springframework.test.context.support.AbstractContextLoader - Did not detect default resource location for test class [io.spring.TaskSinkApplicationTests]: class path resource [io/spring/TaskSinkApplicationTestsContext.groovy] does not exist
21-May-2019 14:38:08 14:38:08.556 [main] INFO org.springframework.test.context.support.AbstractContextLoader - Could not detect default resource locations for test class [io.spring.TaskSinkApplicationTests]: no resource found for suffixes {-context.xml, Context.groovy}.
21-May-2019 14:38:08 14:38:08.559 [main] DEBUG org.springframework.test.context.support.ActiveProfilesUtils - Could not find an 'annotation declaring class' for annotation type [org.springframework.test.context.ActiveProfiles] and class [io.spring.TaskSinkApplicationTests]
21-May-2019 14:38:08 14:38:08.561 [main] DEBUG org.springframework.boot.test.context.SpringBootTestContextBootstrapper - @TestExecutionListeners is not present for class [io.spring.TaskSinkApplicationTests]: using defaults.
21-May-2019 14:38:08 14:38:08.561 [main] INFO org.springframework.boot.test.context.SpringBootTestContextBootstrapper - Loaded default TestExecutionListener class names from location [META-INF/spring.factories]: [org.springframework.boot.test.mock.mockito.MockitoTestExecutionListener, org.springframework.boot.test.mock.mockito.ResetMocksTestExecutionListener, org.springframework.boot.test.autoconfigure.restdocs.RestDocsTestExecutionListener, org.springframework.boot.test.autoconfigure.web.client.MockRestServiceServerResetTestExecutionListener, org.springframework.boot.test.autoconfigure.web.servlet.MockMvcPrintOnlyOnFailureTestExecutionListener, org.springframework.boot.test.autoconfigure.web.servlet.WebDriverTestExecutionListener, org.springframework.test.context.web.ServletTestExecutionListener, org.springframework.test.context.support.DirtiesContextBeforeModesTestExecutionListener, org.springframework.test.context.support.DependencyInjectionTestExecutionListener, org.springframework.test.context.support.DirtiesContextTestExecutionListener, org.springframework.test.context.transaction.TransactionalTestExecutionListener, org.springframework.test.context.jdbc.SqlScriptsTestExecutionListener, org.springframework.test.context.event.EventPublishingTestExecutionListener]
21-May-2019 14:38:08 14:38:08.562 [main] DEBUG org.springframework.boot.test.context.SpringBootTestContextBootstrapper - Skipping candidate TestExecutionListener [org.springframework.test.context.web.ServletTestExecutionListener] due to a missing dependency. Specify custom listener classes or make the default listener classes and their required dependencies available. Offending class: [javax/servlet/ServletContext]
21-May-2019 14:38:08 14:38:08.562 [main] INFO org.springframework.boot.test.context.SpringBootTestContextBootstrapper - Using TestExecutionListeners: [org.springframework.test.context.support.DirtiesContextBeforeModesTestExecutionListener@66498326, org.springframework.boot.test.mock.mockito.MockitoTestExecutionListener@cad498c, org.springframework.boot.test.autoconfigure.SpringBootDependencyInjectionTestExecutionListener@1e6454ec, org.springframework.test.context.support.DirtiesContextTestExecutionListener@2accdbb5, org.springframework.test.context.transaction.TransactionalTestExecutionListener@b62d79, org.springframework.test.context.jdbc.SqlScriptsTestExecutionListener@6631f5ca, org.springframework.test.context.event.EventPublishingTestExecutionListener@5ace1ed4, org.springframework.boot.test.mock.mockito.ResetMocksTestExecutionListener@1613674b, org.springframework.boot.test.autoconfigure.restdocs.RestDocsTestExecutionListener@27ff5d15, org.springframework.boot.test.autoconfigure.web.client.MockRestServiceServerResetTestExecutionListener@4e096385, org.springframework.boot.test.autoconfigure.web.servlet.MockMvcPrintOnlyOnFailureTestExecutionListener@649bec2e, org.springframework.boot.test.autoconfigure.web.servlet.WebDriverTestExecutionListener@693fe6c9]
21-May-2019 14:38:08 14:38:08.562 [main] DEBUG org.springframework.test.annotation.ProfileValueUtils - Retrieved @ProfileValueSourceConfiguration [null] for test class [io.spring.TaskSinkApplicationTests]
21-May-2019 14:38:08 14:38:08.562 [main] DEBUG org.springframework.test.annotation.ProfileValueUtils - Retrieved ProfileValueSource type [class org.springframework.test.annotation.SystemProfileValueSource] for class [io.spring.TaskSinkApplicationTests]
21-May-2019 14:38:08 14:38:08.606 [main] DEBUG org.springframework.test.annotation.ProfileValueUtils - Retrieved @ProfileValueSourceConfiguration [null] for test class [io.spring.TaskSinkApplicationTests]
21-May-2019 14:38:08 14:38:08.606 [main] DEBUG org.springframework.test.annotation.ProfileValueUtils - Retrieved ProfileValueSource type [class org.springframework.test.annotation.SystemProfileValueSource] for class [io.spring.TaskSinkApplicationTests]
21-May-2019 14:38:08 [INFO] Running io.spring.TaskSinkApplicationTests
21-May-2019 14:38:08 14:38:08.609 [main] DEBUG org.springframework.test.annotation.ProfileValueUtils - Retrieved @ProfileValueSourceConfiguration [null] for test class [io.spring.TaskSinkApplicationTests]
21-May-2019 14:38:08 14:38:08.609 [main] DEBUG org.springframework.test.annotation.ProfileValueUtils - Retrieved ProfileValueSource type [class org.springframework.test.annotation.SystemProfileValueSource] for class [io.spring.TaskSinkApplicationTests]
21-May-2019 14:38:08 14:38:08.609 [main] DEBUG org.springframework.test.annotation.ProfileValueUtils - Retrieved @ProfileValueSourceConfiguration [null] for test class [io.spring.TaskSinkApplicationTests]
21-May-2019 14:38:08 14:38:08.609 [main] DEBUG org.springframework.test.annotation.ProfileValueUtils - Retrieved ProfileValueSource type [class org.springframework.test.annotation.SystemProfileValueSource] for class [io.spring.TaskSinkApplicationTests]
21-May-2019 14:38:08 14:38:08.612 [main] DEBUG org.springframework.test.context.support.AbstractDirtiesContextTestExecutionListener - Before test class: context [DefaultTestContext@7b36aa0c testClass = TaskSinkApplicationTests, testInstance = [null], testMethod = [null], testException = [null], mergedContextConfiguration = [MergedContextConfiguration@5824a83d testClass = TaskSinkApplicationTests, locations = '{}', classes = '{class io.spring.TaskSinkApplication, class io.spring.TaskSinkApplication}', contextInitializerClasses = '[]', activeProfiles = '{}', propertySourceLocations = '{}', propertySourceProperties = '{org.springframework.boot.test.context.SpringBootTestContextBootstrapper=true}', contextCustomizers = set[org.springframework.boot.test.context.filter.ExcludeFilterContextCustomizer@184cf7cf, org.springframework.boot.test.json.DuplicateJsonObjectContextCustomizerFactory$DuplicateJsonObjectContextCustomizer@5db250b4, org.springframework.boot.test.mock.mockito.MockitoContextCustomizer@0, org.springframework.boot.test.web.client.TestRestTemplateContextCustomizer@61dd025, org.springframework.boot.test.autoconfigure.properties.PropertyMappingContextCustomizer@0, org.springframework.boot.test.autoconfigure.web.servlet.WebDriverContextCustomizerFactory$Customizer@5276e6b0], contextLoader = 'org.springframework.boot.test.context.SpringBootContextLoader', parent = [null]], attributes = map[[empty]]], class annotated with @DirtiesContext [false] with mode [null].
21-May-2019 14:38:08 14:38:08.613 [main] DEBUG org.springframework.test.annotation.ProfileValueUtils - Retrieved @ProfileValueSourceConfiguration [null] for test class [io.spring.TaskSinkApplicationTests]
21-May-2019 14:38:08 14:38:08.614 [main] DEBUG org.springframework.test.annotation.ProfileValueUtils - Retrieved ProfileValueSource type [class org.springframework.test.annotation.SystemProfileValueSource] for class [io.spring.TaskSinkApplicationTests]
21-May-2019 14:38:08 14:38:08.617 [main] DEBUG org.springframework.test.context.support.DependencyInjectionTestExecutionListener - Performing dependency injection for test context [[DefaultTestContext@7b36aa0c testClass = TaskSinkApplicationTests, testInstance = io.spring.TaskSinkApplicationTests@2892d68, testMethod = [null], testException = [null], mergedContextConfiguration = [MergedContextConfiguration@5824a83d testClass = TaskSinkApplicationTests, locations = '{}', classes = '{class io.spring.TaskSinkApplication, class io.spring.TaskSinkApplication}', contextInitializerClasses = '[]', activeProfiles = '{}', propertySourceLocations = '{}', propertySourceProperties = '{org.springframework.boot.test.context.SpringBootTestContextBootstrapper=true}', contextCustomizers = set[org.springframework.boot.test.context.filter.ExcludeFilterContextCustomizer@184cf7cf, org.springframework.boot.test.json.DuplicateJsonObjectContextCustomizerFactory$DuplicateJsonObjectContextCustomizer@5db250b4, org.springframework.boot.test.mock.mockito.MockitoContextCustomizer@0, org.springframework.boot.test.web.client.TestRestTemplateContextCustomizer@61dd025, org.springframework.boot.test.autoconfigure.properties.PropertyMappingContextCustomizer@0, org.springframework.boot.test.autoconfigure.web.servlet.WebDriverContextCustomizerFactory$Customizer@5276e6b0], contextLoader = 'org.springframework.boot.test.context.SpringBootContextLoader', parent = [null]], attributes = map[[empty]]]].
21-May-2019 14:38:08 14:38:08.634 [main] DEBUG org.springframework.test.context.support.TestPropertySourceUtils - Adding inlined properties to environment: {spring.jmx.enabled=false, org.springframework.boot.test.context.SpringBootTestContextBootstrapper=true, server.port=-1}
21-May-2019 14:38:08
21-May-2019 14:38:08   .   ____          _            __ _ _
21-May-2019 14:38:08 /\\ / ___'_ __ _ _(_)_ __  __ _ \ \ \ \
21-May-2019 14:38:08 ( ( )\___ | '_ | '_| | '_ \/ _` | \ \ \ \
21-May-2019 14:38:08 \\/  ___)| |_)| | | | | || (_| |  ) ) ) )
21-May-2019 14:38:08   '  |____| .__|_| |_|_| |_\__, | / / / /
21-May-2019 14:38:08 =========|_|==============|___/=/_/_/_/
21-May-2019 14:38:08 :: Spring Boot ::  (v2.2.0.BUILD-SNAPSHOT)
21-May-2019 14:38:08
21-May-2019 14:38:08 2019-05-21 14:38:08.855  INFO 9263 --- [           main] io.spring.TaskSinkApplicationTests       : Starting TaskSinkApplicationTests on bamboo-10 with PID 9263 (started by bamboo in /opt/bamboo-home/xml-data/build-dir/SCT-STASK-JOB1/spring-cloud-task-samples/tasksink)
21-May-2019 14:38:08 2019-05-21 14:38:08.856  INFO 9263 --- [           main] io.spring.TaskSinkApplicationTests       : No active profile set, falling back to default profiles: default
21-May-2019 14:38:09 2019-05-21 14:38:09.494  INFO 9263 --- [           main] o.s.c.a.ConfigurationClassEnhancer       : @Bean method BinderFactoryAutoConfiguration.implicitFunctionBinder is non-static and returns an object assignable to Spring's BeanFactoryPostProcessor interface. This will result in a failure to process annotations such as @Autowired, @Resource and @PostConstruct within the method's declaring @Configuration class. Add the 'static' modifier to this method to avoid these container lifecycle issues; see @Bean javadoc for complete details.
21-May-2019 14:38:09 2019-05-21 14:38:09.508  INFO 9263 --- [           main] faultConfiguringBeanFactoryPostProcessor : No bean named 'errorChannel' has been explicitly defined. Therefore, a default PublishSubscribeChannel will be created.
21-May-2019 14:38:09 2019-05-21 14:38:09.512  INFO 9263 --- [           main] faultConfiguringBeanFactoryPostProcessor : No bean named 'taskScheduler' has been explicitly defined. Therefore, a default ThreadPoolTaskScheduler will be created.
21-May-2019 14:38:09 2019-05-21 14:38:09.516  INFO 9263 --- [           main] faultConfiguringBeanFactoryPostProcessor : No bean named 'integrationHeaderChannelRegistry' has been explicitly defined. Therefore, a default DefaultHeaderChannelRegistry will be created.
21-May-2019 14:38:09 2019-05-21 14:38:09.604  INFO 9263 --- [           main] trationDelegate$BeanPostProcessorChecker : Bean 'integrationChannelResolver' of type [org.springframework.integration.support.channel.BeanFactoryChannelResolver] is not eligible for getting processed by all BeanPostProcessors (for example: not eligible for auto-proxying)
21-May-2019 14:38:09 2019-05-21 14:38:09.623  INFO 9263 --- [           main] trationDelegate$BeanPostProcessorChecker : Bean 'org.springframework.transaction.annotation.ProxyTransactionManagementConfiguration' of type [org.springframework.transaction.annotation.ProxyTransactionManagementConfiguration$$EnhancerBySpringCGLIB$$31b135d] is not eligible for getting processed by all BeanPostProcessors (for example: not eligible for auto-proxying)
21-May-2019 14:38:09 2019-05-21 14:38:09.722  INFO 9263 --- [           main] trationDelegate$BeanPostProcessorChecker : Bean 'integrationDisposableAutoCreatedBeans' of type [org.springframework.integration.config.annotation.Disposables] is not eligible for getting processed by all BeanPostProcessors (for example: not eligible for auto-proxying)
21-May-2019 14:38:09 2019-05-21 14:38:09.738  INFO 9263 --- [           main] trationDelegate$BeanPostProcessorChecker : Bean 'org.springframework.integration.config.IntegrationManagementConfiguration' of type [org.springframework.integration.config.IntegrationManagementConfiguration$$EnhancerBySpringCGLIB$$6e0cce8c] is not eligible for getting processed by all BeanPostProcessors (for example: not eligible for auto-proxying)
21-May-2019 14:38:10 2019-05-21 14:38:10.775  INFO 9263 --- [           main] o.s.s.c.ThreadPoolTaskScheduler          : Initializing ExecutorService 'taskScheduler'
21-May-2019 14:38:10 2019-05-21 14:38:10.939  INFO 9263 --- [           main] o.s.i.endpoint.EventDrivenConsumer       : Adding {logging-channel-adapter:_org.springframework.integration.errorLogger} as a subscriber to the 'errorChannel' channel
21-May-2019 14:38:10 2019-05-21 14:38:10.939  INFO 9263 --- [           main] o.s.i.channel.PublishSubscribeChannel    : Channel 'application.errorChannel' has 1 subscriber(s).
21-May-2019 14:38:10 2019-05-21 14:38:10.939  INFO 9263 --- [           main] o.s.i.endpoint.EventDrivenConsumer       : started _org.springframework.integration.errorLogger
21-May-2019 14:38:10 2019-05-21 14:38:10.939  INFO 9263 --- [           main] o.s.i.endpoint.EventDrivenConsumer       : Adding {service-activator:org.springframework.cloud.task.launcher.TaskLauncherSink.taskLauncherSink.serviceActivator} as a subscriber to the 'input' channel
21-May-2019 14:38:10 2019-05-21 14:38:10.939  INFO 9263 --- [           main] o.s.c.s.m.DirectWithAttributesChannel    : Channel 'application.input' has 1 subscriber(s).
21-May-2019 14:38:10 2019-05-21 14:38:10.939  INFO 9263 --- [           main] o.s.i.endpoint.EventDrivenConsumer       : started org.springframework.cloud.task.launcher.TaskLauncherSink.taskLauncherSink.serviceActivator
21-May-2019 14:38:11 2019-05-21 14:38:11.007  INFO 9263 --- [           main] io.spring.TaskSinkApplicationTests       : Started TaskSinkApplicationTests in 2.372 seconds (JVM running for 3.115)
21-May-2019 14:38:11 2019-05-21 14:38:11.063  INFO 9263 --- [           main] o.s.i.h.s.MessagingMethodInvokerHelper   : Overriding default instance of MessageHandlerMethodFactory with provided one.
21-May-2019 14:38:11 2019-05-21 14:38:11.072  INFO 9263 --- [           main] o.s.c.task.launcher.TaskLauncherSink     : Launching Task for the following uri maven://org.springframework.cloud.task.app:timestamp-task:jar:1.0.1.RELEASE
21-May-2019 14:38:11 [INFO] Tests run: 1, Failures: 0, Errors: 0, Skipped: 0, Time elapsed: 2.496 s - in io.spring.TaskSinkApplicationTests
21-May-2019 14:38:11 2019-05-21 14:38:11.128  INFO 9263 --- [       Thread-2] o.s.i.endpoint.EventDrivenConsumer       : Removing {logging-channel-adapter:_org.springframework.integration.errorLogger} as a subscriber to the 'errorChannel' channel
21-May-2019 14:38:11 2019-05-21 14:38:11.129  INFO 9263 --- [       Thread-2] o.s.i.channel.PublishSubscribeChannel    : Channel 'application.errorChannel' has 0 subscriber(s).
21-May-2019 14:38:11 2019-05-21 14:38:11.129  INFO 9263 --- [       Thread-2] o.s.i.endpoint.EventDrivenConsumer       : stopped _org.springframework.integration.errorLogger
21-May-2019 14:38:11 2019-05-21 14:38:11.129  INFO 9263 --- [       Thread-2] o.s.i.endpoint.EventDrivenConsumer       : Removing {service-activator:org.springframework.cloud.task.launcher.TaskLauncherSink.taskLauncherSink.serviceActivator} as a subscriber to the 'input' channel
21-May-2019 14:38:11 2019-05-21 14:38:11.129  INFO 9263 --- [       Thread-2] o.s.c.s.m.DirectWithAttributesChannel    : Channel 'application.input' has 0 subscriber(s).
21-May-2019 14:38:11 2019-05-21 14:38:11.129  INFO 9263 --- [       Thread-2] o.s.i.endpoint.EventDrivenConsumer       : stopped org.springframework.cloud.task.launcher.TaskLauncherSink.taskLauncherSink.serviceActivator
21-May-2019 14:38:11 2019-05-21 14:38:11.130  INFO 9263 --- [       Thread-2] o.s.s.c.ThreadPoolTaskScheduler          : Shutting down ExecutorService 'taskScheduler'
21-May-2019 14:38:11 [INFO]
21-May-2019 14:38:11 [INFO] Results:
21-May-2019 14:38:11 [INFO]
21-May-2019 14:38:11 [INFO] Tests run: 1, Failures: 0, Errors: 0, Skipped: 0
21-May-2019 14:38:11 [INFO]
21-May-2019 14:38:11 [INFO]
21-May-2019 14:38:11 [INFO] --- maven-jar-plugin:3.1.2:jar (default-jar) @ tasksink ---
21-May-2019 14:38:11 [INFO] Building jar: /opt/bamboo-home/xml-data/build-dir/SCT-STASK-JOB1/spring-cloud-task-samples/tasksink/target/tasksink-2.2.0.BUILD-SNAPSHOT.jar
21-May-2019 14:38:11 [INFO]
21-May-2019 14:38:11 [INFO] --- spring-boot-maven-plugin:2.2.0.BUILD-SNAPSHOT:repackage (repackage) @ tasksink ---
21-May-2019 14:38:11 [INFO] Replacing main artifact with repackaged archive
21-May-2019 14:38:11 [INFO]
21-May-2019 14:38:11 [INFO] --- maven-javadoc-plugin:3.0.1:jar (attach-javadocs) @ tasksink ---
21-May-2019 14:38:11 [ERROR] Error fetching link: /opt/bamboo-home/xml-data/build-dir/SCT-STASK-JOB1/spring-cloud-starter-task/target/apidocs/package-list. Ignored it.
21-May-2019 14:38:12 [INFO]
21-May-2019 14:38:12 Loading source files for package io.spring...
21-May-2019 14:38:12 Constructing Javadoc information...
21-May-2019 14:38:12 Standard Doclet version 1.8.0_201
21-May-2019 14:38:12 Building tree for all the packages and classes...
21-May-2019 14:38:12 Generating /opt/bamboo-home/xml-data/build-dir/SCT-STASK-JOB1/spring-cloud-task-samples/tasksink/target/apidocs/io/spring/TaskSinkApplication.html...
21-May-2019 14:38:12 Generating /opt/bamboo-home/xml-data/build-dir/SCT-STASK-JOB1/spring-cloud-task-samples/tasksink/target/apidocs/io/spring/package-frame.html...
21-May-2019 14:38:12 Generating /opt/bamboo-home/xml-data/build-dir/SCT-STASK-JOB1/spring-cloud-task-samples/tasksink/target/apidocs/io/spring/package-summary.html...
21-May-2019 14:38:12 Generating /opt/bamboo-home/xml-data/build-dir/SCT-STASK-JOB1/spring-cloud-task-samples/tasksink/target/apidocs/io/spring/package-tree.html...
21-May-2019 14:38:12 Generating /opt/bamboo-home/xml-data/build-dir/SCT-STASK-JOB1/spring-cloud-task-samples/tasksink/target/apidocs/constant-values.html...
21-May-2019 14:38:12 Generating /opt/bamboo-home/xml-data/build-dir/SCT-STASK-JOB1/spring-cloud-task-samples/tasksink/target/apidocs/io/spring/class-use/TaskSinkApplication.html...
21-May-2019 14:38:12 Generating /opt/bamboo-home/xml-data/build-dir/SCT-STASK-JOB1/spring-cloud-task-samples/tasksink/target/apidocs/io/spring/package-use.html...
21-May-2019 14:38:12 Building index for all the packages and classes...
21-May-2019 14:38:12 Generating /opt/bamboo-home/xml-data/build-dir/SCT-STASK-JOB1/spring-cloud-task-samples/tasksink/target/apidocs/overview-tree.html...
21-May-2019 14:38:12 Generating /opt/bamboo-home/xml-data/build-dir/SCT-STASK-JOB1/spring-cloud-task-samples/tasksink/target/apidocs/index-all.html...
21-May-2019 14:38:12 Generating /opt/bamboo-home/xml-data/build-dir/SCT-STASK-JOB1/spring-cloud-task-samples/tasksink/target/apidocs/deprecated-list.html...
21-May-2019 14:38:12 Building index for all classes...
21-May-2019 14:38:12 Generating /opt/bamboo-home/xml-data/build-dir/SCT-STASK-JOB1/spring-cloud-task-samples/tasksink/target/apidocs/allclasses-frame.html...
21-May-2019 14:38:12 Generating /opt/bamboo-home/xml-data/build-dir/SCT-STASK-JOB1/spring-cloud-task-samples/tasksink/target/apidocs/allclasses-noframe.html...
21-May-2019 14:38:12 Generating /opt/bamboo-home/xml-data/build-dir/SCT-STASK-JOB1/spring-cloud-task-samples/tasksink/target/apidocs/index.html...
21-May-2019 14:38:12 Generating /opt/bamboo-home/xml-data/build-dir/SCT-STASK-JOB1/spring-cloud-task-samples/tasksink/target/apidocs/help-doc.html...
21-May-2019 14:38:12 [INFO] Building jar: /opt/bamboo-home/xml-data/build-dir/SCT-STASK-JOB1/spring-cloud-task-samples/tasksink/target/tasksink-2.2.0.BUILD-SNAPSHOT-javadoc.jar
21-May-2019 14:38:12 [INFO]
21-May-2019 14:38:12 [INFO] >>> maven-source-plugin:3.0.1:jar (attach-sources) > generate-sources @ tasksink >>>
21-May-2019 14:38:12 [INFO]
21-May-2019 14:38:12 [INFO] <<< maven-source-plugin:3.0.1:jar (attach-sources) < generate-sources @ tasksink <<<
21-May-2019 14:38:12 [INFO]
21-May-2019 14:38:12 [INFO]
21-May-2019 14:38:12 [INFO] --- maven-source-plugin:3.0.1:jar (attach-sources) @ tasksink ---
21-May-2019 14:38:12 [INFO] Building jar: /opt/bamboo-home/xml-data/build-dir/SCT-STASK-JOB1/spring-cloud-task-samples/tasksink/target/tasksink-2.2.0.BUILD-SNAPSHOT-sources.jar
21-May-2019 14:38:12 [INFO]
21-May-2019 14:38:12 [INFO] --- maven-install-plugin:2.5.2:install (default-install) @ tasksink ---
21-May-2019 14:38:12 [INFO] Installing /opt/bamboo-home/xml-data/build-dir/SCT-STASK-JOB1/spring-cloud-task-samples/tasksink/target/tasksink-2.2.0.BUILD-SNAPSHOT.jar to /home/bamboo/.m2/repository/io/spring/cloud/tasksink/2.2.0.BUILD-SNAPSHOT/tasksink-2.2.0.BUILD-SNAPSHOT.jar
21-May-2019 14:38:12 [INFO] Installing /opt/bamboo-home/xml-data/build-dir/SCT-STASK-JOB1/spring-cloud-task-samples/tasksink/pom.xml to /home/bamboo/.m2/repository/io/spring/cloud/tasksink/2.2.0.BUILD-SNAPSHOT/tasksink-2.2.0.BUILD-SNAPSHOT.pom
21-May-2019 14:38:12 [INFO] Installing /opt/bamboo-home/xml-data/build-dir/SCT-STASK-JOB1/spring-cloud-task-samples/tasksink/target/tasksink-2.2.0.BUILD-SNAPSHOT-javadoc.jar to /home/bamboo/.m2/repository/io/spring/cloud/tasksink/2.2.0.BUILD-SNAPSHOT/tasksink-2.2.0.BUILD-SNAPSHOT-javadoc.jar
21-May-2019 14:38:12 [INFO] Installing /opt/bamboo-home/xml-data/build-dir/SCT-STASK-JOB1/spring-cloud-task-samples/tasksink/target/tasksink-2.2.0.BUILD-SNAPSHOT-sources.jar to /home/bamboo/.m2/repository/io/spring/cloud/tasksink/2.2.0.BUILD-SNAPSHOT/tasksink-2.2.0.BUILD-SNAPSHOT-sources.jar
21-May-2019 14:38:12 [INFO]
21-May-2019 14:38:12 [INFO] ------------------------------------------------------------------------
21-May-2019 14:38:12 [INFO] Building Task Processor Sample Application 2.2.0.BUILD-SNAPSHOT
21-May-2019 14:38:12 [INFO] ------------------------------------------------------------------------
21-May-2019 14:38:12 [INFO]
21-May-2019 14:38:12 [INFO] --- maven-clean-plugin:3.1.0:clean (default-clean) @ taskprocessor ---
21-May-2019 14:38:12 [INFO] Deleting /opt/bamboo-home/xml-data/build-dir/SCT-STASK-JOB1/spring-cloud-task-samples/taskprocessor/target
21-May-2019 14:38:12 [INFO]
21-May-2019 14:38:12 [INFO] --- maven-resources-plugin:3.1.0:resources (default-resources) @ taskprocessor ---
21-May-2019 14:38:12 [INFO] Using 'UTF-8' encoding to copy filtered resources.
21-May-2019 14:38:12 [INFO] skip non existing resourceDirectory /opt/bamboo-home/xml-data/build-dir/SCT-STASK-JOB1/spring-cloud-task-samples/taskprocessor/src/main/resources
21-May-2019 14:38:12 [INFO] skip non existing resourceDirectory /opt/bamboo-home/xml-data/build-dir/SCT-STASK-JOB1/spring-cloud-task-samples/taskprocessor/src/main/resources
21-May-2019 14:38:12 [INFO]
21-May-2019 14:38:12 [INFO] --- maven-compiler-plugin:3.8.1:compile (default-compile) @ taskprocessor ---
21-May-2019 14:38:12 [INFO] Changes detected - recompiling the module!
21-May-2019 14:38:12 [INFO] Compiling 3 source files to /opt/bamboo-home/xml-data/build-dir/SCT-STASK-JOB1/spring-cloud-task-samples/taskprocessor/target/classes
21-May-2019 14:38:12 [INFO]
21-May-2019 14:38:12 [INFO] --- maven-resources-plugin:3.1.0:testResources (default-testResources) @ taskprocessor ---
21-May-2019 14:38:12 [INFO] Using 'UTF-8' encoding to copy filtered resources.
21-May-2019 14:38:12 [INFO] skip non existing resourceDirectory /opt/bamboo-home/xml-data/build-dir/SCT-STASK-JOB1/spring-cloud-task-samples/taskprocessor/src/test/resources
21-May-2019 14:38:12 [INFO]
21-May-2019 14:38:12 [INFO] --- maven-compiler-plugin:3.8.1:testCompile (default-testCompile) @ taskprocessor ---
21-May-2019 14:38:12 [INFO] Changes detected - recompiling the module!
21-May-2019 14:38:12 [INFO] Compiling 1 source file to /opt/bamboo-home/xml-data/build-dir/SCT-STASK-JOB1/spring-cloud-task-samples/taskprocessor/target/test-classes
21-May-2019 14:38:12 [INFO] /opt/bamboo-home/xml-data/build-dir/SCT-STASK-JOB1/spring-cloud-task-samples/taskprocessor/src/test/java/io/spring/TaskProcessorApplicationTests.java: /opt/bamboo-home/xml-data/build-dir/SCT-STASK-JOB1/spring-cloud-task-samples/taskprocessor/src/test/java/io/spring/TaskProcessorApplicationTests.java uses unchecked or unsafe operations.
21-May-2019 14:38:12 [INFO] /opt/bamboo-home/xml-data/build-dir/SCT-STASK-JOB1/spring-cloud-task-samples/taskprocessor/src/test/java/io/spring/TaskProcessorApplicationTests.java: Recompile with -Xlint:unchecked for details.
21-May-2019 14:38:12 [INFO]
21-May-2019 14:38:12 [INFO] --- maven-surefire-plugin:2.22.2:test (default-test) @ taskprocessor ---
21-May-2019 14:38:12 [INFO]
21-May-2019 14:38:12 [INFO] -------------------------------------------------------
21-May-2019 14:38:12 [INFO]  T E S T S
21-May-2019 14:38:12 [INFO] -------------------------------------------------------
21-May-2019 14:38:13 14:38:13.193 [main] DEBUG org.springframework.test.context.junit4.SpringJUnit4ClassRunner - SpringJUnit4ClassRunner constructor called with [class io.spring.TaskProcessorApplicationTests]
21-May-2019 14:38:13 14:38:13.197 [main] DEBUG org.springframework.test.context.BootstrapUtils - Instantiating CacheAwareContextLoaderDelegate from class [org.springframework.test.context.cache.DefaultCacheAwareContextLoaderDelegate]
21-May-2019 14:38:13 14:38:13.204 [main] DEBUG org.springframework.test.context.BootstrapUtils - Instantiating BootstrapContext using constructor [public org.springframework.test.context.support.DefaultBootstrapContext(java.lang.Class,org.springframework.test.context.CacheAwareContextLoaderDelegate)]
21-May-2019 14:38:13 14:38:13.229 [main] DEBUG org.springframework.test.context.BootstrapUtils - Instantiating TestContextBootstrapper for test class [io.spring.TaskProcessorApplicationTests] from class [org.springframework.boot.test.context.SpringBootTestContextBootstrapper]
21-May-2019 14:38:13 14:38:13.243 [main] INFO org.springframework.boot.test.context.SpringBootTestContextBootstrapper - Neither @ContextConfiguration nor @ContextHierarchy found for test class [io.spring.TaskProcessorApplicationTests], using SpringBootContextLoader
21-May-2019 14:38:13 14:38:13.247 [main] DEBUG org.springframework.test.context.support.AbstractContextLoader - Did not detect default resource location for test class [io.spring.TaskProcessorApplicationTests]: class path resource [io/spring/TaskProcessorApplicationTests-context.xml] does not exist
21-May-2019 14:38:13 14:38:13.247 [main] DEBUG org.springframework.test.context.support.AbstractContextLoader - Did not detect default resource location for test class [io.spring.TaskProcessorApplicationTests]: class path resource [io/spring/TaskProcessorApplicationTestsContext.groovy] does not exist
21-May-2019 14:38:13 14:38:13.247 [main] INFO org.springframework.test.context.support.AbstractContextLoader - Could not detect default resource locations for test class [io.spring.TaskProcessorApplicationTests]: no resource found for suffixes {-context.xml, Context.groovy}.
21-May-2019 14:38:13 14:38:13.278 [main] DEBUG org.springframework.test.context.support.ActiveProfilesUtils - Could not find an 'annotation declaring class' for annotation type [org.springframework.test.context.ActiveProfiles] and class [io.spring.TaskProcessorApplicationTests]
21-May-2019 14:38:13 14:38:13.381 [main] DEBUG org.springframework.boot.test.context.SpringBootTestContextBootstrapper - @TestExecutionListeners is not present for class [io.spring.TaskProcessorApplicationTests]: using defaults.
21-May-2019 14:38:13 14:38:13.382 [main] INFO org.springframework.boot.test.context.SpringBootTestContextBootstrapper - Loaded default TestExecutionListener class names from location [META-INF/spring.factories]: [org.springframework.boot.test.mock.mockito.MockitoTestExecutionListener, org.springframework.boot.test.mock.mockito.ResetMocksTestExecutionListener, org.springframework.boot.test.autoconfigure.restdocs.RestDocsTestExecutionListener, org.springframework.boot.test.autoconfigure.web.client.MockRestServiceServerResetTestExecutionListener, org.springframework.boot.test.autoconfigure.web.servlet.MockMvcPrintOnlyOnFailureTestExecutionListener, org.springframework.boot.test.autoconfigure.web.servlet.WebDriverTestExecutionListener, org.springframework.test.context.web.ServletTestExecutionListener, org.springframework.test.context.support.DirtiesContextBeforeModesTestExecutionListener, org.springframework.test.context.support.DependencyInjectionTestExecutionListener, org.springframework.test.context.support.DirtiesContextTestExecutionListener, org.springframework.test.context.transaction.TransactionalTestExecutionListener, org.springframework.test.context.jdbc.SqlScriptsTestExecutionListener, org.springframework.test.context.event.EventPublishingTestExecutionListener]
21-May-2019 14:38:13 14:38:13.388 [main] DEBUG org.springframework.boot.test.context.SpringBootTestContextBootstrapper - Skipping candidate TestExecutionListener [org.springframework.test.context.web.ServletTestExecutionListener] due to a missing dependency. Specify custom listener classes or make the default listener classes and their required dependencies available. Offending class: [javax/servlet/ServletContext]
21-May-2019 14:38:13 14:38:13.394 [main] INFO org.springframework.boot.test.context.SpringBootTestContextBootstrapper - Using TestExecutionListeners: [org.springframework.test.context.support.DirtiesContextBeforeModesTestExecutionListener@8317c52, org.springframework.boot.test.mock.mockito.MockitoTestExecutionListener@76f2bbc1, org.springframework.boot.test.autoconfigure.SpringBootDependencyInjectionTestExecutionListener@68e965f5, org.springframework.test.context.support.DirtiesContextTestExecutionListener@6f27a732, org.springframework.test.context.transaction.TransactionalTestExecutionListener@6c779568, org.springframework.test.context.jdbc.SqlScriptsTestExecutionListener@f381794, org.springframework.test.context.event.EventPublishingTestExecutionListener@2cdd0d4b, org.springframework.boot.test.mock.mockito.ResetMocksTestExecutionListener@7e9131d5, org.springframework.boot.test.autoconfigure.restdocs.RestDocsTestExecutionListener@2e1d27ba, org.springframework.boot.test.autoconfigure.web.client.MockRestServiceServerResetTestExecutionListener@61d6015a, org.springframework.boot.test.autoconfigure.web.servlet.MockMvcPrintOnlyOnFailureTestExecutionListener@2525ff7e, org.springframework.boot.test.autoconfigure.web.servlet.WebDriverTestExecutionListener@524d6d96]
21-May-2019 14:38:13 14:38:13.396 [main] DEBUG org.springframework.test.annotation.ProfileValueUtils - Retrieved @ProfileValueSourceConfiguration [null] for test class [io.spring.TaskProcessorApplicationTests]
21-May-2019 14:38:13 14:38:13.397 [main] DEBUG org.springframework.test.annotation.ProfileValueUtils - Retrieved ProfileValueSource type [class org.springframework.test.annotation.SystemProfileValueSource] for class [io.spring.TaskProcessorApplicationTests]
21-May-2019 14:38:13 14:38:13.413 [main] DEBUG org.springframework.test.context.junit4.SpringJUnit4ClassRunner - SpringJUnit4ClassRunner constructor called with [class io.spring.TaskProcessorApplicationTests]
21-May-2019 14:38:13 14:38:13.413 [main] DEBUG org.springframework.test.context.BootstrapUtils - Instantiating CacheAwareContextLoaderDelegate from class [org.springframework.test.context.cache.DefaultCacheAwareContextLoaderDelegate]
21-May-2019 14:38:13 14:38:13.414 [main] DEBUG org.springframework.test.context.BootstrapUtils - Instantiating BootstrapContext using constructor [public org.springframework.test.context.support.DefaultBootstrapContext(java.lang.Class,org.springframework.test.context.CacheAwareContextLoaderDelegate)]
21-May-2019 14:38:13 14:38:13.414 [main] DEBUG org.springframework.test.context.BootstrapUtils - Instantiating TestContextBootstrapper for test class [io.spring.TaskProcessorApplicationTests] from class [org.springframework.boot.test.context.SpringBootTestContextBootstrapper]
21-May-2019 14:38:13 14:38:13.414 [main] INFO org.springframework.boot.test.context.SpringBootTestContextBootstrapper - Neither @ContextConfiguration nor @ContextHierarchy found for test class [io.spring.TaskProcessorApplicationTests], using SpringBootContextLoader
21-May-2019 14:38:13 14:38:13.415 [main] DEBUG org.springframework.test.context.support.AbstractContextLoader - Did not detect default resource location for test class [io.spring.TaskProcessorApplicationTests]: class path resource [io/spring/TaskProcessorApplicationTests-context.xml] does not exist
21-May-2019 14:38:13 14:38:13.415 [main] DEBUG org.springframework.test.context.support.AbstractContextLoader - Did not detect default resource location for test class [io.spring.TaskProcessorApplicationTests]: class path resource [io/spring/TaskProcessorApplicationTestsContext.groovy] does not exist
21-May-2019 14:38:13 14:38:13.415 [main] INFO org.springframework.test.context.support.AbstractContextLoader - Could not detect default resource locations for test class [io.spring.TaskProcessorApplicationTests]: no resource found for suffixes {-context.xml, Context.groovy}.
21-May-2019 14:38:13 14:38:13.417 [main] DEBUG org.springframework.test.context.support.ActiveProfilesUtils - Could not find an 'annotation declaring class' for annotation type [org.springframework.test.context.ActiveProfiles] and class [io.spring.TaskProcessorApplicationTests]
21-May-2019 14:38:13 14:38:13.419 [main] DEBUG org.springframework.boot.test.context.SpringBootTestContextBootstrapper - @TestExecutionListeners is not present for class [io.spring.TaskProcessorApplicationTests]: using defaults.
21-May-2019 14:38:13 14:38:13.420 [main] INFO org.springframework.boot.test.context.SpringBootTestContextBootstrapper - Loaded default TestExecutionListener class names from location [META-INF/spring.factories]: [org.springframework.boot.test.mock.mockito.MockitoTestExecutionListener, org.springframework.boot.test.mock.mockito.ResetMocksTestExecutionListener, org.springframework.boot.test.autoconfigure.restdocs.RestDocsTestExecutionListener, org.springframework.boot.test.autoconfigure.web.client.MockRestServiceServerResetTestExecutionListener, org.springframework.boot.test.autoconfigure.web.servlet.MockMvcPrintOnlyOnFailureTestExecutionListener, org.springframework.boot.test.autoconfigure.web.servlet.WebDriverTestExecutionListener, org.springframework.test.context.web.ServletTestExecutionListener, org.springframework.test.context.support.DirtiesContextBeforeModesTestExecutionListener, org.springframework.test.context.support.DependencyInjectionTestExecutionListener, org.springframework.test.context.support.DirtiesContextTestExecutionListener, org.springframework.test.context.transaction.TransactionalTestExecutionListener, org.springframework.test.context.jdbc.SqlScriptsTestExecutionListener, org.springframework.test.context.event.EventPublishingTestExecutionListener]
21-May-2019 14:38:13 14:38:13.420 [main] DEBUG org.springframework.boot.test.context.SpringBootTestContextBootstrapper - Skipping candidate TestExecutionListener [org.springframework.test.context.web.ServletTestExecutionListener] due to a missing dependency. Specify custom listener classes or make the default listener classes and their required dependencies available. Offending class: [javax/servlet/ServletContext]
21-May-2019 14:38:13 14:38:13.421 [main] INFO org.springframework.boot.test.context.SpringBootTestContextBootstrapper - Using TestExecutionListeners: [org.springframework.test.context.support.DirtiesContextBeforeModesTestExecutionListener@306f16f3, org.springframework.boot.test.mock.mockito.MockitoTestExecutionListener@702b8b12, org.springframework.boot.test.autoconfigure.SpringBootDependencyInjectionTestExecutionListener@22e357dc, org.springframework.test.context.support.DirtiesContextTestExecutionListener@49912c99, org.springframework.test.context.transaction.TransactionalTestExecutionListener@10163d6, org.springframework.test.context.jdbc.SqlScriptsTestExecutionListener@2dde1bff, org.springframework.test.context.event.EventPublishingTestExecutionListener@15bbf42f, org.springframework.boot.test.mock.mockito.ResetMocksTestExecutionListener@550ee7e5, org.springframework.boot.test.autoconfigure.restdocs.RestDocsTestExecutionListener@5f9b2141, org.springframework.boot.test.autoconfigure.web.client.MockRestServiceServerResetTestExecutionListener@247d8ae, org.springframework.boot.test.autoconfigure.web.servlet.MockMvcPrintOnlyOnFailureTestExecutionListener@48974e45, org.springframework.boot.test.autoconfigure.web.servlet.WebDriverTestExecutionListener@6a84a97d]
21-May-2019 14:38:13 14:38:13.421 [main] DEBUG org.springframework.test.annotation.ProfileValueUtils - Retrieved @ProfileValueSourceConfiguration [null] for test class [io.spring.TaskProcessorApplicationTests]
21-May-2019 14:38:13 14:38:13.421 [main] DEBUG org.springframework.test.annotation.ProfileValueUtils - Retrieved ProfileValueSource type [class org.springframework.test.annotation.SystemProfileValueSource] for class [io.spring.TaskProcessorApplicationTests]
21-May-2019 14:38:13 14:38:13.460 [main] DEBUG org.springframework.test.annotation.ProfileValueUtils - Retrieved @ProfileValueSourceConfiguration [null] for test class [io.spring.TaskProcessorApplicationTests]
21-May-2019 14:38:13 14:38:13.460 [main] DEBUG org.springframework.test.annotation.ProfileValueUtils - Retrieved ProfileValueSource type [class org.springframework.test.annotation.SystemProfileValueSource] for class [io.spring.TaskProcessorApplicationTests]
21-May-2019 14:38:13 [INFO] Running io.spring.TaskProcessorApplicationTests
21-May-2019 14:38:13 14:38:13.462 [main] DEBUG org.springframework.test.annotation.ProfileValueUtils - Retrieved @ProfileValueSourceConfiguration [null] for test class [io.spring.TaskProcessorApplicationTests]
21-May-2019 14:38:13 14:38:13.463 [main] DEBUG org.springframework.test.annotation.ProfileValueUtils - Retrieved ProfileValueSource type [class org.springframework.test.annotation.SystemProfileValueSource] for class [io.spring.TaskProcessorApplicationTests]
21-May-2019 14:38:13 14:38:13.463 [main] DEBUG org.springframework.test.annotation.ProfileValueUtils - Retrieved @ProfileValueSourceConfiguration [null] for test class [io.spring.TaskProcessorApplicationTests]
21-May-2019 14:38:13 14:38:13.463 [main] DEBUG org.springframework.test.annotation.ProfileValueUtils - Retrieved ProfileValueSource type [class org.springframework.test.annotation.SystemProfileValueSource] for class [io.spring.TaskProcessorApplicationTests]
21-May-2019 14:38:13 14:38:13.466 [main] DEBUG org.springframework.test.context.support.AbstractDirtiesContextTestExecutionListener - Before test class: context [DefaultTestContext@45099dd3 testClass = TaskProcessorApplicationTests, testInstance = [null], testMethod = [null], testException = [null], mergedContextConfiguration = [MergedContextConfiguration@13e344d testClass = TaskProcessorApplicationTests, locations = '{}', classes = '{class io.spring.TaskProcessorApplication, class io.spring.TaskProcessorApplication}', contextInitializerClasses = '[]', activeProfiles = '{}', propertySourceLocations = '{}', propertySourceProperties = '{org.springframework.boot.test.context.SpringBootTestContextBootstrapper=true}', contextCustomizers = set[org.springframework.boot.test.context.filter.ExcludeFilterContextCustomizer@30b7c004, org.springframework.boot.test.json.DuplicateJsonObjectContextCustomizerFactory$DuplicateJsonObjectContextCustomizer@27ae2fd0, org.springframework.boot.test.mock.mockito.MockitoContextCustomizer@0, org.springframework.boot.test.web.client.TestRestTemplateContextCustomizer@1a04f701, org.springframework.boot.test.autoconfigure.properties.PropertyMappingContextCustomizer@0, org.springframework.boot.test.autoconfigure.web.servlet.WebDriverContextCustomizerFactory$Customizer@56528192], contextLoader = 'org.springframework.boot.test.context.SpringBootContextLoader', parent = [null]], attributes = map[[empty]]], class annotated with @DirtiesContext [false] with mode [null].
21-May-2019 14:38:13 14:38:13.468 [main] DEBUG org.springframework.test.annotation.ProfileValueUtils - Retrieved @ProfileValueSourceConfiguration [null] for test class [io.spring.TaskProcessorApplicationTests]
21-May-2019 14:38:13 14:38:13.468 [main] DEBUG org.springframework.test.annotation.ProfileValueUtils - Retrieved ProfileValueSource type [class org.springframework.test.annotation.SystemProfileValueSource] for class [io.spring.TaskProcessorApplicationTests]
21-May-2019 14:38:13 14:38:13.573 [main] DEBUG org.springframework.test.context.support.DependencyInjectionTestExecutionListener - Performing dependency injection for test context [[DefaultTestContext@45099dd3 testClass = TaskProcessorApplicationTests, testInstance = io.spring.TaskProcessorApplicationTests@3e44f2a5, testMethod = [null], testException = [null], mergedContextConfiguration = [MergedContextConfiguration@13e344d testClass = TaskProcessorApplicationTests, locations = '{}', classes = '{class io.spring.TaskProcessorApplication, class io.spring.TaskProcessorApplication}', contextInitializerClasses = '[]', activeProfiles = '{}', propertySourceLocations = '{}', propertySourceProperties = '{org.springframework.boot.test.context.SpringBootTestContextBootstrapper=true}', contextCustomizers = set[org.springframework.boot.test.context.filter.ExcludeFilterContextCustomizer@30b7c004, org.springframework.boot.test.json.DuplicateJsonObjectContextCustomizerFactory$DuplicateJsonObjectContextCustomizer@27ae2fd0, org.springframework.boot.test.mock.mockito.MockitoContextCustomizer@0, org.springframework.boot.test.web.client.TestRestTemplateContextCustomizer@1a04f701, org.springframework.boot.test.autoconfigure.properties.PropertyMappingContextCustomizer@0, org.springframework.boot.test.autoconfigure.web.servlet.WebDriverContextCustomizerFactory$Customizer@56528192], contextLoader = 'org.springframework.boot.test.context.SpringBootContextLoader', parent = [null]], attributes = map[[empty]]]].
21-May-2019 14:38:13 14:38:13.591 [main] DEBUG org.springframework.test.context.support.TestPropertySourceUtils - Adding inlined properties to environment: {spring.jmx.enabled=false, org.springframework.boot.test.context.SpringBootTestContextBootstrapper=true, server.port=-1}
21-May-2019 14:38:13
21-May-2019 14:38:13   .   ____          _            __ _ _
21-May-2019 14:38:13 /\\ / ___'_ __ _ _(_)_ __  __ _ \ \ \ \
21-May-2019 14:38:13 ( ( )\___ | '_ | '_| | '_ \/ _` | \ \ \ \
21-May-2019 14:38:13 \\/  ___)| |_)| | | | | || (_| |  ) ) ) )
21-May-2019 14:38:13   '  |____| .__|_| |_|_| |_\__, | / / / /
21-May-2019 14:38:13 =========|_|==============|___/=/_/_/_/
21-May-2019 14:38:13 :: Spring Boot ::  (v2.2.0.BUILD-SNAPSHOT)
21-May-2019 14:38:13
21-May-2019 14:38:13 2019-05-21 14:38:13.828  INFO 9343 --- [           main] io.spring.TaskProcessorApplicationTests  : Starting TaskProcessorApplicationTests on bamboo-10 with PID 9343 (started by bamboo in /opt/bamboo-home/xml-data/build-dir/SCT-STASK-JOB1/spring-cloud-task-samples/taskprocessor)
21-May-2019 14:38:13 2019-05-21 14:38:13.830  INFO 9343 --- [           main] io.spring.TaskProcessorApplicationTests  : No active profile set, falling back to default profiles: default
21-May-2019 14:38:14 2019-05-21 14:38:14.438  INFO 9343 --- [           main] o.s.c.a.ConfigurationClassEnhancer       : @Bean method BinderFactoryAutoConfiguration.implicitFunctionBinder is non-static and returns an object assignable to Spring's BeanFactoryPostProcessor interface. This will result in a failure to process annotations such as @Autowired, @Resource and @PostConstruct within the method's declaring @Configuration class. Add the 'static' modifier to this method to avoid these container lifecycle issues; see @Bean javadoc for complete details.
21-May-2019 14:38:14 2019-05-21 14:38:14.452  INFO 9343 --- [           main] faultConfiguringBeanFactoryPostProcessor : No bean named 'errorChannel' has been explicitly defined. Therefore, a default PublishSubscribeChannel will be created.
21-May-2019 14:38:14 2019-05-21 14:38:14.456  INFO 9343 --- [           main] faultConfiguringBeanFactoryPostProcessor : No bean named 'taskScheduler' has been explicitly defined. Therefore, a default ThreadPoolTaskScheduler will be created.
21-May-2019 14:38:14 2019-05-21 14:38:14.460  INFO 9343 --- [           main] faultConfiguringBeanFactoryPostProcessor : No bean named 'integrationHeaderChannelRegistry' has been explicitly defined. Therefore, a default DefaultHeaderChannelRegistry will be created.
21-May-2019 14:38:14 2019-05-21 14:38:14.548  INFO 9343 --- [           main] trationDelegate$BeanPostProcessorChecker : Bean 'integrationChannelResolver' of type [org.springframework.integration.support.channel.BeanFactoryChannelResolver] is not eligible for getting processed by all BeanPostProcessors (for example: not eligible for auto-proxying)
21-May-2019 14:38:14 2019-05-21 14:38:14.555  INFO 9343 --- [           main] trationDelegate$BeanPostProcessorChecker : Bean 'org.springframework.transaction.annotation.ProxyTransactionManagementConfiguration' of type [org.springframework.transaction.annotation.ProxyTransactionManagementConfiguration$$EnhancerBySpringCGLIB$$fdc344cd] is not eligible for getting processed by all BeanPostProcessors (for example: not eligible for auto-proxying)
21-May-2019 14:38:14 2019-05-21 14:38:14.650  INFO 9343 --- [           main] trationDelegate$BeanPostProcessorChecker : Bean 'integrationDisposableAutoCreatedBeans' of type [org.springframework.integration.config.annotation.Disposables] is not eligible for getting processed by all BeanPostProcessors (for example: not eligible for auto-proxying)
21-May-2019 14:38:14 2019-05-21 14:38:14.666  INFO 9343 --- [           main] trationDelegate$BeanPostProcessorChecker : Bean 'org.springframework.integration.config.IntegrationManagementConfiguration' of type [org.springframework.integration.config.IntegrationManagementConfiguration$$EnhancerBySpringCGLIB$$68b4fffc] is not eligible for getting processed by all BeanPostProcessors (for example: not eligible for auto-proxying)
21-May-2019 14:38:15 2019-05-21 14:38:15.460  INFO 9343 --- [           main] o.s.s.c.ThreadPoolTaskScheduler          : Initializing ExecutorService 'taskScheduler'
21-May-2019 14:38:15 2019-05-21 14:38:15.600  INFO 9343 --- [           main] o.s.i.endpoint.EventDrivenConsumer       : Adding {logging-channel-adapter:_org.springframework.integration.errorLogger} as a subscriber to the 'errorChannel' channel
21-May-2019 14:38:15 2019-05-21 14:38:15.600  INFO 9343 --- [           main] o.s.i.channel.PublishSubscribeChannel    : Channel 'application.errorChannel' has 1 subscriber(s).
21-May-2019 14:38:15 2019-05-21 14:38:15.600  INFO 9343 --- [           main] o.s.i.endpoint.EventDrivenConsumer       : started _org.springframework.integration.errorLogger
21-May-2019 14:38:15 2019-05-21 14:38:15.600  INFO 9343 --- [           main] o.s.i.endpoint.EventDrivenConsumer       : Adding {transformer:taskProcessor.setupRequest.transformer} as a subscriber to the 'input' channel
21-May-2019 14:38:15 2019-05-21 14:38:15.600  INFO 9343 --- [           main] o.s.c.s.m.DirectWithAttributesChannel    : Channel 'application.input' has 1 subscriber(s).
21-May-2019 14:38:15 2019-05-21 14:38:15.600  INFO 9343 --- [           main] o.s.i.endpoint.EventDrivenConsumer       : started taskProcessor.setupRequest.transformer
21-May-2019 14:38:15 2019-05-21 14:38:15.649  INFO 9343 --- [           main] o.s.c.s.m.DirectWithAttributesChannel    : Channel 'application.output' has 1 subscriber(s).
21-May-2019 14:38:15 2019-05-21 14:38:15.664  INFO 9343 --- [           main] io.spring.TaskProcessorApplicationTests  : Started TaskProcessorApplicationTests in 2.072 seconds (JVM running for 2.888)
21-May-2019 14:38:15 2019-05-21 14:38:15.784  INFO 9343 --- [           main] o.s.i.h.s.MessagingMethodInvokerHelper   : Overriding default instance of MessageHandlerMethodFactory with provided one.
21-May-2019 14:38:15 [INFO] Tests run: 1, Failures: 0, Errors: 0, Skipped: 0, Time elapsed: 2.431 s - in io.spring.TaskProcessorApplicationTests
21-May-2019 14:38:15 2019-05-21 14:38:15.908  INFO 9343 --- [       Thread-2] o.s.i.endpoint.EventDrivenConsumer       : Removing {logging-channel-adapter:_org.springframework.integration.errorLogger} as a subscriber to the 'errorChannel' channel
21-May-2019 14:38:15 2019-05-21 14:38:15.908  INFO 9343 --- [       Thread-2] o.s.i.channel.PublishSubscribeChannel    : Channel 'application.errorChannel' has 0 subscriber(s).
21-May-2019 14:38:15 2019-05-21 14:38:15.909  INFO 9343 --- [       Thread-2] o.s.i.endpoint.EventDrivenConsumer       : stopped _org.springframework.integration.errorLogger
21-May-2019 14:38:15 2019-05-21 14:38:15.909  INFO 9343 --- [       Thread-2] o.s.i.endpoint.EventDrivenConsumer       : Removing {transformer:taskProcessor.setupRequest.transformer} as a subscriber to the 'input' channel
21-May-2019 14:38:15 2019-05-21 14:38:15.909  INFO 9343 --- [       Thread-2] o.s.c.s.m.DirectWithAttributesChannel    : Channel 'application.input' has 0 subscriber(s).
21-May-2019 14:38:15 2019-05-21 14:38:15.909  INFO 9343 --- [       Thread-2] o.s.i.endpoint.EventDrivenConsumer       : stopped taskProcessor.setupRequest.transformer
21-May-2019 14:38:15 2019-05-21 14:38:15.913  INFO 9343 --- [       Thread-2] o.s.s.c.ThreadPoolTaskScheduler          : Shutting down ExecutorService 'taskScheduler'
21-May-2019 14:38:16 [INFO]
21-May-2019 14:38:16 [INFO] Results:
21-May-2019 14:38:16 [INFO]
21-May-2019 14:38:16 [INFO] Tests run: 1, Failures: 0, Errors: 0, Skipped: 0
21-May-2019 14:38:16 [INFO]
21-May-2019 14:38:16 [INFO]
21-May-2019 14:38:16 [INFO] --- maven-jar-plugin:3.1.2:jar (default-jar) @ taskprocessor ---
21-May-2019 14:38:16 [INFO] Building jar: /opt/bamboo-home/xml-data/build-dir/SCT-STASK-JOB1/spring-cloud-task-samples/taskprocessor/target/taskprocessor-2.2.0.BUILD-SNAPSHOT.jar
21-May-2019 14:38:16 [INFO]
21-May-2019 14:38:16 [INFO] --- spring-boot-maven-plugin:2.2.0.BUILD-SNAPSHOT:repackage (repackage) @ taskprocessor ---
21-May-2019 14:38:16 [INFO] Replacing main artifact with repackaged archive
21-May-2019 14:38:16 [INFO]
21-May-2019 14:38:16 [INFO] --- maven-javadoc-plugin:3.0.1:jar (attach-javadocs) @ taskprocessor ---
21-May-2019 14:38:16 [ERROR] Error fetching link: /opt/bamboo-home/xml-data/build-dir/SCT-STASK-JOB1/spring-cloud-starter-task/target/apidocs/package-list. Ignored it.
21-May-2019 14:38:17 [INFO]
21-May-2019 14:38:17 Loading source files for package io.spring...
21-May-2019 14:38:17 Constructing Javadoc information...
21-May-2019 14:38:17 Standard Doclet version 1.8.0_201
21-May-2019 14:38:17 Building tree for all the packages and classes...
21-May-2019 14:38:17 Generating /opt/bamboo-home/xml-data/build-dir/SCT-STASK-JOB1/spring-cloud-task-samples/taskprocessor/target/apidocs/io/spring/TaskProcessor.html...
21-May-2019 14:38:17 Generating /opt/bamboo-home/xml-data/build-dir/SCT-STASK-JOB1/spring-cloud-task-samples/taskprocessor/target/apidocs/io/spring/TaskProcessorApplication.html...
21-May-2019 14:38:17 Generating /opt/bamboo-home/xml-data/build-dir/SCT-STASK-JOB1/spring-cloud-task-samples/taskprocessor/target/apidocs/io/spring/TaskProcessorProperties.html...
21-May-2019 14:38:17 Generating /opt/bamboo-home/xml-data/build-dir/SCT-STASK-JOB1/spring-cloud-task-samples/taskprocessor/target/apidocs/io/spring/package-frame.html...
21-May-2019 14:38:17 Generating /opt/bamboo-home/xml-data/build-dir/SCT-STASK-JOB1/spring-cloud-task-samples/taskprocessor/target/apidocs/io/spring/package-summary.html...
21-May-2019 14:38:17 Generating /opt/bamboo-home/xml-data/build-dir/SCT-STASK-JOB1/spring-cloud-task-samples/taskprocessor/target/apidocs/io/spring/package-tree.html...
21-May-2019 14:38:17 Generating /opt/bamboo-home/xml-data/build-dir/SCT-STASK-JOB1/spring-cloud-task-samples/taskprocessor/target/apidocs/constant-values.html...
21-May-2019 14:38:17 Generating /opt/bamboo-home/xml-data/build-dir/SCT-STASK-JOB1/spring-cloud-task-samples/taskprocessor/target/apidocs/io/spring/class-use/TaskProcessorApplication.html...
21-May-2019 14:38:17 Generating /opt/bamboo-home/xml-data/build-dir/SCT-STASK-JOB1/spring-cloud-task-samples/taskprocessor/target/apidocs/io/spring/class-use/TaskProcessor.html...
21-May-2019 14:38:17 Generating /opt/bamboo-home/xml-data/build-dir/SCT-STASK-JOB1/spring-cloud-task-samples/taskprocessor/target/apidocs/io/spring/class-use/TaskProcessorProperties.html...
21-May-2019 14:38:17 Generating /opt/bamboo-home/xml-data/build-dir/SCT-STASK-JOB1/spring-cloud-task-samples/taskprocessor/target/apidocs/io/spring/package-use.html...
21-May-2019 14:38:17 Building index for all the packages and classes...
21-May-2019 14:38:17 Generating /opt/bamboo-home/xml-data/build-dir/SCT-STASK-JOB1/spring-cloud-task-samples/taskprocessor/target/apidocs/overview-tree.html...
21-May-2019 14:38:17 Generating /opt/bamboo-home/xml-data/build-dir/SCT-STASK-JOB1/spring-cloud-task-samples/taskprocessor/target/apidocs/index-all.html...
21-May-2019 14:38:17 Generating /opt/bamboo-home/xml-data/build-dir/SCT-STASK-JOB1/spring-cloud-task-samples/taskprocessor/target/apidocs/deprecated-list.html...
21-May-2019 14:38:17 Building index for all classes...
21-May-2019 14:38:17 Generating /opt/bamboo-home/xml-data/build-dir/SCT-STASK-JOB1/spring-cloud-task-samples/taskprocessor/target/apidocs/allclasses-frame.html...
21-May-2019 14:38:17 Generating /opt/bamboo-home/xml-data/build-dir/SCT-STASK-JOB1/spring-cloud-task-samples/taskprocessor/target/apidocs/allclasses-noframe.html...
21-May-2019 14:38:17 Generating /opt/bamboo-home/xml-data/build-dir/SCT-STASK-JOB1/spring-cloud-task-samples/taskprocessor/target/apidocs/index.html...
21-May-2019 14:38:17 Generating /opt/bamboo-home/xml-data/build-dir/SCT-STASK-JOB1/spring-cloud-task-samples/taskprocessor/target/apidocs/help-doc.html...
21-May-2019 14:38:17 [INFO] Building jar: /opt/bamboo-home/xml-data/build-dir/SCT-STASK-JOB1/spring-cloud-task-samples/taskprocessor/target/taskprocessor-2.2.0.BUILD-SNAPSHOT-javadoc.jar
21-May-2019 14:38:17 [INFO]
21-May-2019 14:38:17 [INFO] >>> maven-source-plugin:3.0.1:jar (attach-sources) > generate-sources @ taskprocessor >>>
21-May-2019 14:38:17 [INFO]
21-May-2019 14:38:17 [INFO] <<< maven-source-plugin:3.0.1:jar (attach-sources) < generate-sources @ taskprocessor <<<
21-May-2019 14:38:17 [INFO]
21-May-2019 14:38:17 [INFO]
21-May-2019 14:38:17 [INFO] --- maven-source-plugin:3.0.1:jar (attach-sources) @ taskprocessor ---
21-May-2019 14:38:17 [INFO] Building jar: /opt/bamboo-home/xml-data/build-dir/SCT-STASK-JOB1/spring-cloud-task-samples/taskprocessor/target/taskprocessor-2.2.0.BUILD-SNAPSHOT-sources.jar
21-May-2019 14:38:17 [INFO]
21-May-2019 14:38:17 [INFO] --- maven-install-plugin:2.5.2:install (default-install) @ taskprocessor ---
21-May-2019 14:38:17 [INFO] Installing /opt/bamboo-home/xml-data/build-dir/SCT-STASK-JOB1/spring-cloud-task-samples/taskprocessor/target/taskprocessor-2.2.0.BUILD-SNAPSHOT.jar to /home/bamboo/.m2/repository/io/spring/cloud/taskprocessor/2.2.0.BUILD-SNAPSHOT/taskprocessor-2.2.0.BUILD-SNAPSHOT.jar
21-May-2019 14:38:17 [INFO] Installing /opt/bamboo-home/xml-data/build-dir/SCT-STASK-JOB1/spring-cloud-task-samples/taskprocessor/pom.xml to /home/bamboo/.m2/repository/io/spring/cloud/taskprocessor/2.2.0.BUILD-SNAPSHOT/taskprocessor-2.2.0.BUILD-SNAPSHOT.pom
21-May-2019 14:38:17 [INFO] Installing /opt/bamboo-home/xml-data/build-dir/SCT-STASK-JOB1/spring-cloud-task-samples/taskprocessor/target/taskprocessor-2.2.0.BUILD-SNAPSHOT-javadoc.jar to /home/bamboo/.m2/repository/io/spring/cloud/taskprocessor/2.2.0.BUILD-SNAPSHOT/taskprocessor-2.2.0.BUILD-SNAPSHOT-javadoc.jar
21-May-2019 14:38:17 [INFO] Installing /opt/bamboo-home/xml-data/build-dir/SCT-STASK-JOB1/spring-cloud-task-samples/taskprocessor/target/taskprocessor-2.2.0.BUILD-SNAPSHOT-sources.jar to /home/bamboo/.m2/repository/io/spring/cloud/taskprocessor/2.2.0.BUILD-SNAPSHOT/taskprocessor-2.2.0.BUILD-SNAPSHOT-sources.jar
21-May-2019 14:38:17 [INFO]
21-May-2019 14:38:17 [INFO] ------------------------------------------------------------------------
21-May-2019 14:38:17 [INFO] Building Partitioned Batch Job 2.2.0.BUILD-SNAPSHOT
21-May-2019 14:38:17 [INFO] ------------------------------------------------------------------------
21-May-2019 14:38:17 [INFO]
21-May-2019 14:38:17 [INFO] --- maven-clean-plugin:3.1.0:clean (default-clean) @ partitioned-batch-job ---
21-May-2019 14:38:17 [INFO] Deleting /opt/bamboo-home/xml-data/build-dir/SCT-STASK-JOB1/spring-cloud-task-samples/partitioned-batch-job/target
21-May-2019 14:38:17 [INFO]
21-May-2019 14:38:17 [INFO] --- maven-resources-plugin:3.1.0:resources (default-resources) @ partitioned-batch-job ---
21-May-2019 14:38:17 [INFO] Using 'UTF-8' encoding to copy filtered resources.
21-May-2019 14:38:17 [INFO] Copying 1 resource
21-May-2019 14:38:17 [INFO] Copying 0 resource
21-May-2019 14:38:17 [INFO]
21-May-2019 14:38:17 [INFO] --- maven-compiler-plugin:3.8.1:compile (default-compile) @ partitioned-batch-job ---
21-May-2019 14:38:17 [INFO] Changes detected - recompiling the module!
21-May-2019 14:38:17 [INFO] Compiling 2 source files to /opt/bamboo-home/xml-data/build-dir/SCT-STASK-JOB1/spring-cloud-task-samples/partitioned-batch-job/target/classes
21-May-2019 14:38:17 [INFO]
21-May-2019 14:38:17 [INFO] --- maven-resources-plugin:3.1.0:testResources (default-testResources) @ partitioned-batch-job ---
21-May-2019 14:38:17 [INFO] Using 'UTF-8' encoding to copy filtered resources.
21-May-2019 14:38:17 [INFO] skip non existing resourceDirectory /opt/bamboo-home/xml-data/build-dir/SCT-STASK-JOB1/spring-cloud-task-samples/partitioned-batch-job/src/test/resources
21-May-2019 14:38:17 [INFO]
21-May-2019 14:38:17 [INFO] --- maven-compiler-plugin:3.8.1:testCompile (default-testCompile) @ partitioned-batch-job ---
21-May-2019 14:38:17 [INFO] Changes detected - recompiling the module!
21-May-2019 14:38:17 [INFO] Compiling 1 source file to /opt/bamboo-home/xml-data/build-dir/SCT-STASK-JOB1/spring-cloud-task-samples/partitioned-batch-job/target/test-classes
21-May-2019 14:38:17 [INFO]
21-May-2019 14:38:17 [INFO] --- maven-surefire-plugin:2.12.4:test (default-test) @ partitioned-batch-job ---
21-May-2019 14:38:17 [INFO]
21-May-2019 14:38:17 [INFO] --- maven-jar-plugin:3.1.2:jar (default-jar) @ partitioned-batch-job ---
21-May-2019 14:38:17 [INFO] Building jar: /opt/bamboo-home/xml-data/build-dir/SCT-STASK-JOB1/spring-cloud-task-samples/partitioned-batch-job/target/partitioned-batch-job-2.2.0.BUILD-SNAPSHOT.jar
21-May-2019 14:38:17 [INFO]
21-May-2019 14:38:17 [INFO] --- spring-boot-maven-plugin:2.2.0.BUILD-SNAPSHOT:repackage (repackage) @ partitioned-batch-job ---
21-May-2019 14:38:17 [INFO] Replacing main artifact with repackaged archive
21-May-2019 14:38:17 [INFO]
21-May-2019 14:38:17 [INFO] --- maven-javadoc-plugin:3.0.1:jar (attach-javadocs) @ partitioned-batch-job ---
21-May-2019 14:38:17 [ERROR] Error fetching link: /opt/bamboo-home/xml-data/build-dir/SCT-STASK-JOB1/spring-cloud-starter-task/target/apidocs/package-list. Ignored it.
21-May-2019 14:38:18 [INFO]
21-May-2019 14:38:18 Loading source files for package io.spring...
21-May-2019 14:38:18 Constructing Javadoc information...
21-May-2019 14:38:18 Standard Doclet version 1.8.0_201
21-May-2019 14:38:18 Building tree for all the packages and classes...
21-May-2019 14:38:18 Generating /opt/bamboo-home/xml-data/build-dir/SCT-STASK-JOB1/spring-cloud-task-samples/partitioned-batch-job/target/apidocs/io/spring/JobConfiguration.html...
21-May-2019 14:38:18 Generating /opt/bamboo-home/xml-data/build-dir/SCT-STASK-JOB1/spring-cloud-task-samples/partitioned-batch-job/target/apidocs/io/spring/PartitionedBatchJobApplication.html...
21-May-2019 14:38:18 Generating /opt/bamboo-home/xml-data/build-dir/SCT-STASK-JOB1/spring-cloud-task-samples/partitioned-batch-job/target/apidocs/io/spring/package-frame.html...
21-May-2019 14:38:18 Generating /opt/bamboo-home/xml-data/build-dir/SCT-STASK-JOB1/spring-cloud-task-samples/partitioned-batch-job/target/apidocs/io/spring/package-summary.html...
21-May-2019 14:38:18 Generating /opt/bamboo-home/xml-data/build-dir/SCT-STASK-JOB1/spring-cloud-task-samples/partitioned-batch-job/target/apidocs/io/spring/package-tree.html...
21-May-2019 14:38:18 Generating /opt/bamboo-home/xml-data/build-dir/SCT-STASK-JOB1/spring-cloud-task-samples/partitioned-batch-job/target/apidocs/constant-values.html...
21-May-2019 14:38:18 Generating /opt/bamboo-home/xml-data/build-dir/SCT-STASK-JOB1/spring-cloud-task-samples/partitioned-batch-job/target/apidocs/io/spring/class-use/JobConfiguration.html...
21-May-2019 14:38:18 Generating /opt/bamboo-home/xml-data/build-dir/SCT-STASK-JOB1/spring-cloud-task-samples/partitioned-batch-job/target/apidocs/io/spring/class-use/PartitionedBatchJobApplication.html...
21-May-2019 14:38:18 Generating /opt/bamboo-home/xml-data/build-dir/SCT-STASK-JOB1/spring-cloud-task-samples/partitioned-batch-job/target/apidocs/io/spring/package-use.html...
21-May-2019 14:38:18 Building index for all the packages and classes...
21-May-2019 14:38:18 Generating /opt/bamboo-home/xml-data/build-dir/SCT-STASK-JOB1/spring-cloud-task-samples/partitioned-batch-job/target/apidocs/overview-tree.html...
21-May-2019 14:38:18 Generating /opt/bamboo-home/xml-data/build-dir/SCT-STASK-JOB1/spring-cloud-task-samples/partitioned-batch-job/target/apidocs/index-all.html...
21-May-2019 14:38:18 Generating /opt/bamboo-home/xml-data/build-dir/SCT-STASK-JOB1/spring-cloud-task-samples/partitioned-batch-job/target/apidocs/deprecated-list.html...
21-May-2019 14:38:18 Building index for all classes...
21-May-2019 14:38:18 Generating /opt/bamboo-home/xml-data/build-dir/SCT-STASK-JOB1/spring-cloud-task-samples/partitioned-batch-job/target/apidocs/allclasses-frame.html...
21-May-2019 14:38:18 Generating /opt/bamboo-home/xml-data/build-dir/SCT-STASK-JOB1/spring-cloud-task-samples/partitioned-batch-job/target/apidocs/allclasses-noframe.html...
21-May-2019 14:38:18 Generating /opt/bamboo-home/xml-data/build-dir/SCT-STASK-JOB1/spring-cloud-task-samples/partitioned-batch-job/target/apidocs/index.html...
21-May-2019 14:38:18 Generating /opt/bamboo-home/xml-data/build-dir/SCT-STASK-JOB1/spring-cloud-task-samples/partitioned-batch-job/target/apidocs/help-doc.html...
21-May-2019 14:38:18 [INFO] Building jar: /opt/bamboo-home/xml-data/build-dir/SCT-STASK-JOB1/spring-cloud-task-samples/partitioned-batch-job/target/partitioned-batch-job-2.2.0.BUILD-SNAPSHOT-javadoc.jar
21-May-2019 14:38:18 [INFO]
21-May-2019 14:38:18 [INFO] >>> maven-source-plugin:3.0.1:jar (attach-sources) > generate-sources @ partitioned-batch-job >>>
21-May-2019 14:38:18 [INFO]
21-May-2019 14:38:18 [INFO] <<< maven-source-plugin:3.0.1:jar (attach-sources) < generate-sources @ partitioned-batch-job <<<
21-May-2019 14:38:18 [INFO]
21-May-2019 14:38:18 [INFO]
21-May-2019 14:38:18 [INFO] --- maven-source-plugin:3.0.1:jar (attach-sources) @ partitioned-batch-job ---
21-May-2019 14:38:18 [INFO] Building jar: /opt/bamboo-home/xml-data/build-dir/SCT-STASK-JOB1/spring-cloud-task-samples/partitioned-batch-job/target/partitioned-batch-job-2.2.0.BUILD-SNAPSHOT-sources.jar
21-May-2019 14:38:18 [INFO]
21-May-2019 14:38:18 [INFO] --- maven-install-plugin:2.5.2:install (default-install) @ partitioned-batch-job ---
21-May-2019 14:38:18 [INFO] Installing /opt/bamboo-home/xml-data/build-dir/SCT-STASK-JOB1/spring-cloud-task-samples/partitioned-batch-job/target/partitioned-batch-job-2.2.0.BUILD-SNAPSHOT.jar to /home/bamboo/.m2/repository/io/spring/cloud/partitioned-batch-job/2.2.0.BUILD-SNAPSHOT/partitioned-batch-job-2.2.0.BUILD-SNAPSHOT.jar
21-May-2019 14:38:18 [INFO] Installing /opt/bamboo-home/xml-data/build-dir/SCT-STASK-JOB1/spring-cloud-task-samples/partitioned-batch-job/pom.xml to /home/bamboo/.m2/repository/io/spring/cloud/partitioned-batch-job/2.2.0.BUILD-SNAPSHOT/partitioned-batch-job-2.2.0.BUILD-SNAPSHOT.pom
21-May-2019 14:38:18 [INFO] Installing /opt/bamboo-home/xml-data/build-dir/SCT-STASK-JOB1/spring-cloud-task-samples/partitioned-batch-job/target/partitioned-batch-job-2.2.0.BUILD-SNAPSHOT-javadoc.jar to /home/bamboo/.m2/repository/io/spring/cloud/partitioned-batch-job/2.2.0.BUILD-SNAPSHOT/partitioned-batch-job-2.2.0.BUILD-SNAPSHOT-javadoc.jar
21-May-2019 14:38:18 [INFO] Installing /opt/bamboo-home/xml-data/build-dir/SCT-STASK-JOB1/spring-cloud-task-samples/partitioned-batch-job/target/partitioned-batch-job-2.2.0.BUILD-SNAPSHOT-sources.jar to /home/bamboo/.m2/repository/io/spring/cloud/partitioned-batch-job/2.2.0.BUILD-SNAPSHOT/partitioned-batch-job-2.2.0.BUILD-SNAPSHOT-sources.jar
21-May-2019 14:38:18 [INFO]
21-May-2019 14:38:18 [INFO] ------------------------------------------------------------------------
21-May-2019 14:38:18 [INFO] Building Task Events 2.2.0.BUILD-SNAPSHOT
21-May-2019 14:38:18 [INFO] ------------------------------------------------------------------------
21-May-2019 14:38:18 [INFO]
21-May-2019 14:38:18 [INFO] --- maven-clean-plugin:3.1.0:clean (default-clean) @ task-events ---
21-May-2019 14:38:18 [INFO] Deleting /opt/bamboo-home/xml-data/build-dir/SCT-STASK-JOB1/spring-cloud-task-samples/task-events/target
21-May-2019 14:38:18 [INFO]
21-May-2019 14:38:18 [INFO] --- maven-resources-plugin:3.1.0:resources (default-resources) @ task-events ---
21-May-2019 14:38:18 [INFO] Using 'UTF-8' encoding to copy filtered resources.
21-May-2019 14:38:18 [INFO] Copying 1 resource
21-May-2019 14:38:18 [INFO] Copying 0 resource
21-May-2019 14:38:18 [INFO]
21-May-2019 14:38:18 [INFO] --- maven-compiler-plugin:3.8.1:compile (default-compile) @ task-events ---
21-May-2019 14:38:18 [INFO] Changes detected - recompiling the module!
21-May-2019 14:38:18 [INFO] Compiling 1 source file to /opt/bamboo-home/xml-data/build-dir/SCT-STASK-JOB1/spring-cloud-task-samples/task-events/target/classes
21-May-2019 14:38:18 [INFO]
21-May-2019 14:38:18 [INFO] --- maven-resources-plugin:3.1.0:testResources (default-testResources) @ task-events ---
21-May-2019 14:38:18 [INFO] Using 'UTF-8' encoding to copy filtered resources.
21-May-2019 14:38:18 [INFO] skip non existing resourceDirectory /opt/bamboo-home/xml-data/build-dir/SCT-STASK-JOB1/spring-cloud-task-samples/task-events/src/test/resources
21-May-2019 14:38:18 [INFO]
21-May-2019 14:38:18 [INFO] --- maven-compiler-plugin:3.8.1:testCompile (default-testCompile) @ task-events ---
21-May-2019 14:38:18 [INFO] No sources to compile
21-May-2019 14:38:18 [INFO]
21-May-2019 14:38:18 [INFO] --- maven-surefire-plugin:2.22.2:test (default-test) @ task-events ---
21-May-2019 14:38:18 [INFO] No tests to run.
21-May-2019 14:38:18 [INFO]
21-May-2019 14:38:18 [INFO] --- maven-jar-plugin:3.1.2:jar (default-jar) @ task-events ---
21-May-2019 14:38:18 [INFO] Building jar: /opt/bamboo-home/xml-data/build-dir/SCT-STASK-JOB1/spring-cloud-task-samples/task-events/target/task-events-2.2.0.BUILD-SNAPSHOT.jar
21-May-2019 14:38:18 [INFO]
21-May-2019 14:38:18 [INFO] --- spring-boot-maven-plugin:2.2.0.BUILD-SNAPSHOT:repackage (repackage) @ task-events ---
21-May-2019 14:38:19 [INFO] Replacing main artifact with repackaged archive
21-May-2019 14:38:19 [INFO]
21-May-2019 14:38:19 [INFO] --- maven-javadoc-plugin:3.0.1:jar (attach-javadocs) @ task-events ---
21-May-2019 14:38:19 [ERROR] Error fetching link: /opt/bamboo-home/xml-data/build-dir/SCT-STASK-JOB1/spring-cloud-starter-task/target/apidocs/package-list. Ignored it.
21-May-2019 14:38:19 [INFO]
21-May-2019 14:38:19 Loading source files for package io.spring...
21-May-2019 14:38:19 Constructing Javadoc information...
21-May-2019 14:38:19 Standard Doclet version 1.8.0_201
21-May-2019 14:38:19 Building tree for all the packages and classes...
21-May-2019 14:38:19 Generating /opt/bamboo-home/xml-data/build-dir/SCT-STASK-JOB1/spring-cloud-task-samples/task-events/target/apidocs/io/spring/TaskEventsApplication.html...
21-May-2019 14:38:19 Generating /opt/bamboo-home/xml-data/build-dir/SCT-STASK-JOB1/spring-cloud-task-samples/task-events/target/apidocs/io/spring/TaskEventsApplication.TaskConfiguration.html...
21-May-2019 14:38:19 Generating /opt/bamboo-home/xml-data/build-dir/SCT-STASK-JOB1/spring-cloud-task-samples/task-events/target/apidocs/io/spring/package-frame.html...
21-May-2019 14:38:19 Generating /opt/bamboo-home/xml-data/build-dir/SCT-STASK-JOB1/spring-cloud-task-samples/task-events/target/apidocs/io/spring/package-summary.html...
21-May-2019 14:38:19 Generating /opt/bamboo-home/xml-data/build-dir/SCT-STASK-JOB1/spring-cloud-task-samples/task-events/target/apidocs/io/spring/package-tree.html...
21-May-2019 14:38:19 Generating /opt/bamboo-home/xml-data/build-dir/SCT-STASK-JOB1/spring-cloud-task-samples/task-events/target/apidocs/constant-values.html...
21-May-2019 14:38:19 Generating /opt/bamboo-home/xml-data/build-dir/SCT-STASK-JOB1/spring-cloud-task-samples/task-events/target/apidocs/io/spring/class-use/TaskEventsApplication.html...
21-May-2019 14:38:19 Generating /opt/bamboo-home/xml-data/build-dir/SCT-STASK-JOB1/spring-cloud-task-samples/task-events/target/apidocs/io/spring/class-use/TaskEventsApplication.TaskConfiguration.html...
21-May-2019 14:38:19 Generating /opt/bamboo-home/xml-data/build-dir/SCT-STASK-JOB1/spring-cloud-task-samples/task-events/target/apidocs/io/spring/package-use.html...
21-May-2019 14:38:19 Building index for all the packages and classes...
21-May-2019 14:38:19 Generating /opt/bamboo-home/xml-data/build-dir/SCT-STASK-JOB1/spring-cloud-task-samples/task-events/target/apidocs/overview-tree.html...
21-May-2019 14:38:19 Generating /opt/bamboo-home/xml-data/build-dir/SCT-STASK-JOB1/spring-cloud-task-samples/task-events/target/apidocs/index-all.html...
21-May-2019 14:38:19 Generating /opt/bamboo-home/xml-data/build-dir/SCT-STASK-JOB1/spring-cloud-task-samples/task-events/target/apidocs/deprecated-list.html...
21-May-2019 14:38:19 Building index for all classes...
21-May-2019 14:38:19 Generating /opt/bamboo-home/xml-data/build-dir/SCT-STASK-JOB1/spring-cloud-task-samples/task-events/target/apidocs/allclasses-frame.html...
21-May-2019 14:38:19 Generating /opt/bamboo-home/xml-data/build-dir/SCT-STASK-JOB1/spring-cloud-task-samples/task-events/target/apidocs/allclasses-noframe.html...
21-May-2019 14:38:19 Generating /opt/bamboo-home/xml-data/build-dir/SCT-STASK-JOB1/spring-cloud-task-samples/task-events/target/apidocs/index.html...
21-May-2019 14:38:19 Generating /opt/bamboo-home/xml-data/build-dir/SCT-STASK-JOB1/spring-cloud-task-samples/task-events/target/apidocs/help-doc.html...
21-May-2019 14:38:19 [INFO] Building jar: /opt/bamboo-home/xml-data/build-dir/SCT-STASK-JOB1/spring-cloud-task-samples/task-events/target/task-events-2.2.0.BUILD-SNAPSHOT-javadoc.jar
21-May-2019 14:38:19 [INFO]
21-May-2019 14:38:19 [INFO] >>> maven-source-plugin:3.0.1:jar (attach-sources) > generate-sources @ task-events >>>
21-May-2019 14:38:19 [INFO]
21-May-2019 14:38:19 [INFO] <<< maven-source-plugin:3.0.1:jar (attach-sources) < generate-sources @ task-events <<<
21-May-2019 14:38:19 [INFO]
21-May-2019 14:38:19 [INFO]
21-May-2019 14:38:19 [INFO] --- maven-source-plugin:3.0.1:jar (attach-sources) @ task-events ---
21-May-2019 14:38:19 [INFO] Building jar: /opt/bamboo-home/xml-data/build-dir/SCT-STASK-JOB1/spring-cloud-task-samples/task-events/target/task-events-2.2.0.BUILD-SNAPSHOT-sources.jar
21-May-2019 14:38:19 [INFO]
21-May-2019 14:38:19 [INFO] --- maven-install-plugin:2.5.2:install (default-install) @ task-events ---
21-May-2019 14:38:19 [INFO] Installing /opt/bamboo-home/xml-data/build-dir/SCT-STASK-JOB1/spring-cloud-task-samples/task-events/target/task-events-2.2.0.BUILD-SNAPSHOT.jar to /home/bamboo/.m2/repository/io/spring/cloud/task-events/2.2.0.BUILD-SNAPSHOT/task-events-2.2.0.BUILD-SNAPSHOT.jar
21-May-2019 14:38:19 [INFO] Installing /opt/bamboo-home/xml-data/build-dir/SCT-STASK-JOB1/spring-cloud-task-samples/task-events/pom.xml to /home/bamboo/.m2/repository/io/spring/cloud/task-events/2.2.0.BUILD-SNAPSHOT/task-events-2.2.0.BUILD-SNAPSHOT.pom
21-May-2019 14:38:19 [INFO] Installing /opt/bamboo-home/xml-data/build-dir/SCT-STASK-JOB1/spring-cloud-task-samples/task-events/target/task-events-2.2.0.BUILD-SNAPSHOT-javadoc.jar to /home/bamboo/.m2/repository/io/spring/cloud/task-events/2.2.0.BUILD-SNAPSHOT/task-events-2.2.0.BUILD-SNAPSHOT-javadoc.jar
21-May-2019 14:38:19 [INFO] Installing /opt/bamboo-home/xml-data/build-dir/SCT-STASK-JOB1/spring-cloud-task-samples/task-events/target/task-events-2.2.0.BUILD-SNAPSHOT-sources.jar to /home/bamboo/.m2/repository/io/spring/cloud/task-events/2.2.0.BUILD-SNAPSHOT/task-events-2.2.0.BUILD-SNAPSHOT-sources.jar
21-May-2019 14:38:20 [INFO]
21-May-2019 14:38:20 [INFO] ------------------------------------------------------------------------
21-May-2019 14:38:20 [INFO] Building Batch Events Sample Application 2.2.0.BUILD-SNAPSHOT
21-May-2019 14:38:20 [INFO] ------------------------------------------------------------------------
21-May-2019 14:38:20 Downloading: https://repo.spring.io/libs-snapshot-local/org/springframework/cloud/spring-cloud-stream-binder-rabbit-test-support/2.2.1.BUILD-SNAPSHOT/spring-cloud-stream-binder-rabbit-test-support-2.2.1.BUILD-20190520.111344-7.jar
21-May-2019 14:38:20 Progress (1): 0.7/9.2 kB
21-May-2019 14:38:20 Progress (1): 2.1/9.2 kB
21-May-2019 14:38:20 Progress (1): 3.4/9.2 kB
21-May-2019 14:38:20 Progress (1): 4.8/9.2 kB
21-May-2019 14:38:20 Progress (1): 6.2/9.2 kB
21-May-2019 14:38:20 Progress (1): 7.5/9.2 kB
21-May-2019 14:38:20 Progress (1): 8.9/9.2 kB
21-May-2019 14:38:20 Progress (1): 9.2 kB   
21-May-2019 14:38:20                    
21-May-2019 14:38:20 Downloaded: https://repo.spring.io/libs-snapshot-local/org/springframework/cloud/spring-cloud-stream-binder-rabbit-test-support/2.2.1.BUILD-SNAPSHOT/spring-cloud-stream-binder-rabbit-test-support-2.2.1.BUILD-20190520.111344-7.jar (9.2 kB at 42 kB/s)
21-May-2019 14:38:20 [INFO]
21-May-2019 14:38:20 [INFO] --- maven-clean-plugin:3.1.0:clean (default-clean) @ batch-events ---
21-May-2019 14:38:20 [INFO] Deleting /opt/bamboo-home/xml-data/build-dir/SCT-STASK-JOB1/spring-cloud-task-samples/batch-events/target
21-May-2019 14:38:20 [INFO]
21-May-2019 14:38:20 [INFO] --- maven-resources-plugin:3.1.0:resources (default-resources) @ batch-events ---
21-May-2019 14:38:20 [INFO] Using 'UTF-8' encoding to copy filtered resources.
21-May-2019 14:38:20 [INFO] Copying 1 resource
21-May-2019 14:38:20 [INFO] Copying 0 resource
21-May-2019 14:38:20 [INFO]
21-May-2019 14:38:20 [INFO] --- maven-compiler-plugin:3.8.1:compile (default-compile) @ batch-events ---
21-May-2019 14:38:20 [INFO] Changes detected - recompiling the module!
21-May-2019 14:38:20 [INFO] Compiling 1 source file to /opt/bamboo-home/xml-data/build-dir/SCT-STASK-JOB1/spring-cloud-task-samples/batch-events/target/classes
21-May-2019 14:38:20 [INFO]
21-May-2019 14:38:20 [INFO] --- maven-resources-plugin:3.1.0:testResources (default-testResources) @ batch-events ---
21-May-2019 14:38:20 [INFO] Using 'UTF-8' encoding to copy filtered resources.
21-May-2019 14:38:20 [INFO] Copying 1 resource
21-May-2019 14:38:20 [INFO]
21-May-2019 14:38:20 [INFO] --- maven-compiler-plugin:3.8.1:testCompile (default-testCompile) @ batch-events ---
21-May-2019 14:38:20 [INFO] Changes detected - recompiling the module!
21-May-2019 14:38:20 [INFO] Compiling 1 source file to /opt/bamboo-home/xml-data/build-dir/SCT-STASK-JOB1/spring-cloud-task-samples/batch-events/target/test-classes
21-May-2019 14:38:20 [INFO]
21-May-2019 14:38:20 [INFO] --- maven-surefire-plugin:2.22.2:test (default-test) @ batch-events ---
21-May-2019 14:38:20 [INFO]
21-May-2019 14:38:20 [INFO] -------------------------------------------------------
21-May-2019 14:38:20 [INFO]  T E S T S
21-May-2019 14:38:20 [INFO] -------------------------------------------------------
21-May-2019 14:38:20 [INFO] Running io.spring.cloud.BatchEventsApplicationTests
21-May-2019 14:38:20 14:38:20.903 [main] INFO org.springframework.amqp.rabbit.connection.CachingConnectionFactory - Attempting to connect to: localhost:5672
21-May-2019 14:38:20 14:38:20.957 [main] INFO org.springframework.amqp.rabbit.connection.CachingConnectionFactory - Created new connection: SpringAMQP#78aab498:0/SimpleConnection@63355449 [delegate=amqp://guest@127.0.0.1:5672/, localPort= 52180]
21-May-2019 14:38:21
21-May-2019 14:38:21   .   ____          _            __ _ _
21-May-2019 14:38:21 /\\ / ___'_ __ _ _(_)_ __  __ _ \ \ \ \
21-May-2019 14:38:21 ( ( )\___ | '_ | '_| | '_ \/ _` | \ \ \ \
21-May-2019 14:38:21 \\/  ___)| |_)| | | | | || (_| |  ) ) ) )
21-May-2019 14:38:21   '  |____| .__|_| |_|_| |_\__, | / / / /
21-May-2019 14:38:21 =========|_|==============|___/=/_/_/_/
21-May-2019 14:38:21 :: Spring Boot ::  (v2.2.0.BUILD-SNAPSHOT)
21-May-2019 14:38:21
21-May-2019 14:38:21 2019-05-21 14:38:21.325  INFO 9521 --- [           main] o.a.maven.surefire.booter.ForkedBooter   : Starting ForkedBooter v2.22.2 on bamboo-10 with PID 9521 (started by bamboo in /opt/bamboo-home/xml-data/build-dir/SCT-STASK-JOB1/spring-cloud-task-samples/batch-events)
21-May-2019 14:38:21 2019-05-21 14:38:21.364  INFO 9521 --- [           main] o.a.maven.surefire.booter.ForkedBooter   : No active profile set, falling back to default profiles: default
21-May-2019 14:38:21 2019-05-21 14:38:21.622  INFO 9521 --- [           main] o.s.c.a.ConfigurationClassEnhancer       : @Bean method BinderFactoryConfiguration.implicitFunctionBinder is non-static and returns an object assignable to Spring's BeanFactoryPostProcessor interface. This will result in a failure to process annotations such as @Autowired, @Resource and @PostConstruct within the method's declaring @Configuration class. Add the 'static' modifier to this method to avoid these container lifecycle issues; see @Bean javadoc for complete details.
21-May-2019 14:38:21 2019-05-21 14:38:21.638  INFO 9521 --- [           main] faultConfiguringBeanFactoryPostProcessor : No bean named 'errorChannel' has been explicitly defined. Therefore, a default PublishSubscribeChannel will be created.
21-May-2019 14:38:21 2019-05-21 14:38:21.644  INFO 9521 --- [           main] faultConfiguringBeanFactoryPostProcessor : No bean named 'taskScheduler' has been explicitly defined. Therefore, a default ThreadPoolTaskScheduler will be created.
21-May-2019 14:38:21 2019-05-21 14:38:21.650  INFO 9521 --- [           main] faultConfiguringBeanFactoryPostProcessor : No bean named 'integrationHeaderChannelRegistry' has been explicitly defined. Therefore, a default DefaultHeaderChannelRegistry will be created.
21-May-2019 14:38:21 2019-05-21 14:38:21.675  INFO 9521 --- [           main] trationDelegate$BeanPostProcessorChecker : Bean 'integrationChannelResolver' of type [org.springframework.integration.support.channel.BeanFactoryChannelResolver] is not eligible for getting processed by all BeanPostProcessors (for example: not eligible for auto-proxying)
21-May-2019 14:38:21 2019-05-21 14:38:21.681  INFO 9521 --- [           main] trationDelegate$BeanPostProcessorChecker : Bean 'integrationDisposableAutoCreatedBeans' of type [org.springframework.integration.config.annotation.Disposables] is not eligible for getting processed by all BeanPostProcessors (for example: not eligible for auto-proxying)
21-May-2019 14:38:21 2019-05-21 14:38:21.903  INFO 9521 --- [           main] o.s.s.c.ThreadPoolTaskScheduler          : Initializing ExecutorService 'taskScheduler'
21-May-2019 14:38:21 2019-05-21 14:38:21.929  INFO 9521 --- [           main] o.s.i.endpoint.EventDrivenConsumer       : Adding {logging-channel-adapter:_org.springframework.integration.errorLogger} as a subscriber to the 'errorChannel' channel
21-May-2019 14:38:21 2019-05-21 14:38:21.930  INFO 9521 --- [           main] o.s.i.channel.PublishSubscribeChannel    : Channel 'batchEvents.errorChannel' has 1 subscriber(s).
21-May-2019 14:38:21 2019-05-21 14:38:21.930  INFO 9521 --- [           main] o.s.i.endpoint.EventDrivenConsumer       : started _org.springframework.integration.errorLogger
21-May-2019 14:38:21 2019-05-21 14:38:21.934  INFO 9521 --- [           main] o.a.maven.surefire.booter.ForkedBooter   : Started ForkedBooter in 0.896 seconds (JVM running for 1.507)
21-May-2019 14:38:21
21-May-2019 14:38:21   .   ____          _            __ _ _
21-May-2019 14:38:21 /\\ / ___'_ __ _ _(_)_ __  __ _ \ \ \ \
21-May-2019 14:38:21 ( ( )\___ | '_ | '_| | '_ \/ _` | \ \ \ \
21-May-2019 14:38:21 \\/  ___)| |_)| | | | | || (_| |  ) ) ) )
21-May-2019 14:38:21   '  |____| .__|_| |_|_| |_\__, | / / / /
21-May-2019 14:38:21 =========|_|==============|___/=/_/_/_/
21-May-2019 14:38:21 :: Spring Boot ::  (v2.2.0.BUILD-SNAPSHOT)
21-May-2019 14:38:21
21-May-2019 14:38:21 2019-05-21 14:38:21.962  INFO 9521 --- [           main] o.a.maven.surefire.booter.ForkedBooter   : Starting ForkedBooter v2.22.2 on bamboo-10 with PID 9521 (started by bamboo in /opt/bamboo-home/xml-data/build-dir/SCT-STASK-JOB1/spring-cloud-task-samples/batch-events)
21-May-2019 14:38:21 2019-05-21 14:38:21.962  INFO 9521 --- [           main] o.a.maven.surefire.booter.ForkedBooter   : No active profile set, falling back to default profiles: default
21-May-2019 14:38:22 2019-05-21 14:38:22.365  INFO 9521 --- [           main] o.s.c.a.ConfigurationClassEnhancer       : @Bean method BinderFactoryConfiguration.implicitFunctionBinder is non-static and returns an object assignable to Spring's BeanFactoryPostProcessor interface. This will result in a failure to process annotations such as @Autowired, @Resource and @PostConstruct within the method's declaring @Configuration class. Add the 'static' modifier to this method to avoid these container lifecycle issues; see @Bean javadoc for complete details.
21-May-2019 14:38:22 2019-05-21 14:38:22.378  INFO 9521 --- [           main] faultConfiguringBeanFactoryPostProcessor : No bean named 'errorChannel' has been explicitly defined. Therefore, a default PublishSubscribeChannel will be created.
21-May-2019 14:38:22 2019-05-21 14:38:22.378  INFO 9521 --- [           main] faultConfiguringBeanFactoryPostProcessor : No bean named 'taskScheduler' has been explicitly defined. Therefore, a default ThreadPoolTaskScheduler will be created.
21-May-2019 14:38:22 2019-05-21 14:38:22.379  INFO 9521 --- [           main] faultConfiguringBeanFactoryPostProcessor : No bean named 'integrationHeaderChannelRegistry' has been explicitly defined. Therefore, a default DefaultHeaderChannelRegistry will be created.
21-May-2019 14:38:22 2019-05-21 14:38:22.404  INFO 9521 --- [           main] trationDelegate$BeanPostProcessorChecker : Bean 'integrationChannelResolver' of type [org.springframework.integration.support.channel.BeanFactoryChannelResolver] is not eligible for getting processed by all BeanPostProcessors (for example: not eligible for auto-proxying)
21-May-2019 14:38:22 2019-05-21 14:38:22.411  INFO 9521 --- [           main] trationDelegate$BeanPostProcessorChecker : Bean 'org.springframework.transaction.annotation.ProxyTransactionManagementConfiguration' of type [org.springframework.transaction.annotation.ProxyTransactionManagementConfiguration$$EnhancerBySpringCGLIB$$3dbebb46] is not eligible for getting processed by all BeanPostProcessors (for example: not eligible for auto-proxying)
21-May-2019 14:38:22 2019-05-21 14:38:22.503  INFO 9521 --- [           main] trationDelegate$BeanPostProcessorChecker : Bean 'integrationDisposableAutoCreatedBeans' of type [org.springframework.integration.config.annotation.Disposables] is not eligible for getting processed by all BeanPostProcessors (for example: not eligible for auto-proxying)
21-May-2019 14:38:22 2019-05-21 14:38:22.510  INFO 9521 --- [           main] trationDelegate$BeanPostProcessorChecker : Bean 'org.springframework.integration.config.IntegrationManagementConfiguration' of type [org.springframework.integration.config.IntegrationManagementConfiguration$$EnhancerBySpringCGLIB$$a8b07675] is not eligible for getting processed by all BeanPostProcessors (for example: not eligible for auto-proxying)
21-May-2019 14:38:22 2019-05-21 14:38:22.516  INFO 9521 --- [           main] trationDelegate$BeanPostProcessorChecker : Bean 'org.springframework.cloud.task.batch.configuration.TaskBatchAutoConfiguration' of type [org.springframework.cloud.task.batch.configuration.TaskBatchAutoConfiguration$$EnhancerBySpringCGLIB$$c32e66d2] is not eligible for getting processed by all BeanPostProcessors (for example: not eligible for auto-proxying)
21-May-2019 14:38:22 2019-05-21 14:38:22.520  INFO 9521 --- [           main] trationDelegate$BeanPostProcessorChecker : Bean 'org.springframework.cloud.task.batch.listener.BatchEventAutoConfiguration' of type [org.springframework.cloud.task.batch.listener.BatchEventAutoConfiguration$$EnhancerBySpringCGLIB$$b8470d5] is not eligible for getting processed by all BeanPostProcessors (for example: not eligible for auto-proxying)
21-May-2019 14:38:22 2019-05-21 14:38:22.923  INFO 9521 --- [           main] com.zaxxer.hikari.HikariDataSource       : HikariPool-1 - Starting...
21-May-2019 14:38:22 2019-05-21 14:38:22.926  WARN 9521 --- [           main] com.zaxxer.hikari.util.DriverDataSource  : Registered driver with driverClassName=org.hsqldb.jdbcDriver was not found, trying direct instantiation.
21-May-2019 14:38:23 2019-05-21 14:38:23.163  INFO 9521 --- [           main] com.zaxxer.hikari.pool.PoolBase          : HikariPool-1 - Driver does not support get/set network timeout for connections. (feature not supported)
21-May-2019 14:38:23 2019-05-21 14:38:23.165  INFO 9521 --- [           main] com.zaxxer.hikari.HikariDataSource       : HikariPool-1 - Start completed.
21-May-2019 14:38:23 2019-05-21 14:38:23.173 DEBUG 9521 --- [           main] o.s.c.t.c.SimpleTaskAutoConfiguration    : Using org.springframework.cloud.task.configuration.DefaultTaskConfigurer TaskConfigurer
21-May-2019 14:38:23 2019-05-21 14:38:23.173 DEBUG 9521 --- [           main] o.s.c.t.c.DefaultTaskConfigurer          : No EntityManager was found, using DataSourceTransactionManager
21-May-2019 14:38:23 2019-05-21 14:38:23.237  INFO 9521 --- [           main] o.s.s.c.ThreadPoolTaskScheduler          : Initializing ExecutorService 'taskScheduler'
21-May-2019 14:38:23 2019-05-21 14:38:23.359  INFO 9521 --- [           main] o.s.b.c.r.s.JobRepositoryFactoryBean     : No database type set, using meta data indicating: HSQL
21-May-2019 14:38:23 2019-05-21 14:38:23.372  INFO 9521 --- [           main] o.s.b.c.l.support.SimpleJobLauncher      : No TaskExecutor has been set, defaulting to synchronous executor.
21-May-2019 14:38:23 2019-05-21 14:38:23.473 DEBUG 9521 --- [           main] o.s.c.t.r.s.TaskRepositoryInitializer    : Initializing task schema for hsqldb database
21-May-2019 14:38:23 2019-05-21 14:38:23.575  INFO 9521 --- [           main] o.s.c.s.m.DirectWithAttributesChannel    : Channel 'batchEvents.input' has 1 subscriber(s).
21-May-2019 14:38:23 2019-05-21 14:38:23.577  INFO 9521 --- [           main] o.s.i.endpoint.EventDrivenConsumer       : Adding {logging-channel-adapter:_org.springframework.integration.errorLogger} as a subscriber to the 'errorChannel' channel
21-May-2019 14:38:23 2019-05-21 14:38:23.577  INFO 9521 --- [           main] o.s.i.channel.PublishSubscribeChannel    : Channel 'batchEvents.errorChannel' has 1 subscriber(s).
21-May-2019 14:38:23 2019-05-21 14:38:23.577  INFO 9521 --- [           main] o.s.i.endpoint.EventDrivenConsumer       : started _org.springframework.integration.errorLogger
21-May-2019 14:38:23 2019-05-21 14:38:23.578 DEBUG 9521 --- [           main] o.s.c.s.binding.BindableProxyFactory     : Binding outputs for :interface org.springframework.cloud.stream.messaging.Sink
21-May-2019 14:38:23 2019-05-21 14:38:23.578 DEBUG 9521 --- [           main] o.s.c.s.binding.BindableProxyFactory     : Binding outputs for :interface org.springframework.cloud.task.listener.TaskEventAutoConfiguration$TaskEventChannels
21-May-2019 14:38:23 2019-05-21 14:38:23.578 DEBUG 9521 --- [           main] o.s.c.s.binding.BindableProxyFactory     : Binding :interface org.springframework.cloud.task.listener.TaskEventAutoConfiguration$TaskEventChannels:task-events
21-May-2019 14:38:23 2019-05-21 14:38:23.645  WARN 9521 --- [           main] s.c.a.AnnotationConfigApplicationContext : Exception encountered during context initialization - cancelling refresh attempt: org.springframework.beans.factory.BeanCreationException: Error creating bean with name 'rabbitMessageChannelBinder' defined in org.springframework.cloud.stream.binder.rabbit.config.RabbitMessageChannelBinderConfiguration: Bean instantiation via factory method failed; nested exception is org.springframework.beans.BeanInstantiationException: Failed to instantiate [org.springframework.cloud.stream.binder.rabbit.RabbitMessageChannelBinder]: Factory method 'rabbitMessageChannelBinder' threw exception; nested exception is java.lang.NoClassDefFoundError: org/springframework/amqp/rabbit/core/support/BatchingStrategy
21-May-2019 14:38:23 2019-05-21 14:38:23.647  INFO 9521 --- [           main] ConditionEvaluationReportLoggingListener :
21-May-2019 14:38:23
21-May-2019 14:38:23 Error starting ApplicationContext. To display the conditions report re-run your application with 'debug' enabled.
21-May-2019 14:38:23 2019-05-21 14:38:23.653 ERROR 9521 --- [           main] o.s.boot.SpringApplication               : Application run failed
21-May-2019 14:38:23
21-May-2019 14:38:23 org.springframework.beans.factory.BeanCreationException: Error creating bean with name 'rabbitMessageChannelBinder' defined in org.springframework.cloud.stream.binder.rabbit.config.RabbitMessageChannelBinderConfiguration: Bean instantiation via factory method failed; nested exception is org.springframework.beans.BeanInstantiationException: Failed to instantiate [org.springframework.cloud.stream.binder.rabbit.RabbitMessageChannelBinder]: Factory method 'rabbitMessageChannelBinder' threw exception; nested exception is java.lang.NoClassDefFoundError: org/springframework/amqp/rabbit/core/support/BatchingStrategy
21-May-2019 14:38:23         at org.springframework.beans.factory.support.ConstructorResolver.instantiate(ConstructorResolver.java:638) ~[spring-beans-5.2.0.M2.jar:5.2.0.M2]
21-May-2019 14:38:23         at org.springframework.beans.factory.support.ConstructorResolver.instantiateUsingFactoryMethod(ConstructorResolver.java:618) ~[spring-beans-5.2.0.M2.jar:5.2.0.M2]
21-May-2019 14:38:23         at org.springframework.beans.factory.support.AbstractAutowireCapableBeanFactory.instantiateUsingFactoryMethod(AbstractAutowireCapableBeanFactory.java:1325) ~[spring-beans-5.2.0.M2.jar:5.2.0.M2]
21-May-2019 14:38:23         at org.springframework.beans.factory.support.AbstractAutowireCapableBeanFactory.createBeanInstance(AbstractAutowireCapableBeanFactory.java:1164) ~[spring-beans-5.2.0.M2.jar:5.2.0.M2]
21-May-2019 14:38:23         at org.springframework.beans.factory.support.AbstractAutowireCapableBeanFactory.doCreateBean(AbstractAutowireCapableBeanFactory.java:555) ~[spring-beans-5.2.0.M2.jar:5.2.0.M2]
21-May-2019 14:38:23         at org.springframework.beans.factory.support.AbstractAutowireCapableBeanFactory.createBean(AbstractAutowireCapableBeanFactory.java:515) ~[spring-beans-5.2.0.M2.jar:5.2.0.M2]
21-May-2019 14:38:23         at org.springframework.beans.factory.support.AbstractBeanFactory.lambda$doGetBean$0(AbstractBeanFactory.java:320) ~[spring-beans-5.2.0.M2.jar:5.2.0.M2]
21-May-2019 14:38:23         at org.springframework.beans.factory.support.DefaultSingletonBeanRegistry.getSingleton(DefaultSingletonBeanRegistry.java:222) ~[spring-beans-5.2.0.M2.jar:5.2.0.M2]
21-May-2019 14:38:23         at org.springframework.beans.factory.support.AbstractBeanFactory.doGetBean(AbstractBeanFactory.java:318) ~[spring-beans-5.2.0.M2.jar:5.2.0.M2]
21-May-2019 14:38:23         at org.springframework.beans.factory.support.AbstractBeanFactory.getBean(AbstractBeanFactory.java:199) ~[spring-beans-5.2.0.M2.jar:5.2.0.M2]
21-May-2019 14:38:23         at org.springframework.beans.factory.support.DefaultListableBeanFactory.preInstantiateSingletons(DefaultListableBeanFactory.java:868) ~[spring-beans-5.2.0.M2.jar:5.2.0.M2]
21-May-2019 14:38:23         at org.springframework.context.support.AbstractApplicationContext.finishBeanFactoryInitialization(AbstractApplicationContext.java:877) ~[spring-context-5.2.0.M2.jar:5.2.0.M2]
21-May-2019 14:38:23         at org.springframework.context.support.AbstractApplicationContext.refresh(AbstractApplicationContext.java:549) ~[spring-context-5.2.0.M2.jar:5.2.0.M2]
21-May-2019 14:38:23         at org.springframework.boot.SpringApplication.refresh(SpringApplication.java:782) ~[spring-boot-2.2.0.BUILD-SNAPSHOT.jar:2.2.0.BUILD-SNAPSHOT]
21-May-2019 14:38:23         at org.springframework.boot.SpringApplication.refreshContext(SpringApplication.java:404) ~[spring-boot-2.2.0.BUILD-SNAPSHOT.jar:2.2.0.BUILD-SNAPSHOT]
21-May-2019 14:38:23         at org.springframework.boot.SpringApplication.run(SpringApplication.java:319) ~[spring-boot-2.2.0.BUILD-SNAPSHOT.jar:2.2.0.BUILD-SNAPSHOT]
21-May-2019 14:38:23         at org.springframework.boot.builder.SpringApplicationBuilder.run(SpringApplicationBuilder.java:139) [spring-boot-2.2.0.BUILD-SNAPSHOT.jar:2.2.0.BUILD-SNAPSHOT]
21-May-2019 14:38:23         at org.springframework.cloud.stream.binder.DefaultBinderFactory.getBinderInstance(DefaultBinderFactory.java:292) [spring-cloud-stream-2.2.0.RELEASE.jar:2.2.0.RELEASE]
21-May-2019 14:38:23         at org.springframework.cloud.stream.binder.DefaultBinderFactory.doGetBinder(DefaultBinderFactory.java:192) [spring-cloud-stream-2.2.0.RELEASE.jar:2.2.0.RELEASE]
21-May-2019 14:38:23         at org.springframework.cloud.stream.binder.DefaultBinderFactory.getBinder(DefaultBinderFactory.java:130) [spring-cloud-stream-2.2.0.RELEASE.jar:2.2.0.RELEASE]
21-May-2019 14:38:23         at org.springframework.cloud.stream.binding.BindingService.getBinder(BindingService.java:337) [spring-cloud-stream-2.2.0.RELEASE.jar:2.2.0.RELEASE]
21-May-2019 14:38:23         at org.springframework.cloud.stream.binding.BindingService.bindProducer(BindingService.java:229) [spring-cloud-stream-2.2.0.RELEASE.jar:2.2.0.RELEASE]
21-May-2019 14:38:23         at org.springframework.cloud.stream.binding.BindableProxyFactory.createAndBindOutputs(BindableProxyFactory.java:287) [spring-cloud-stream-2.2.0.RELEASE.jar:2.2.0.RELEASE]
21-May-2019 14:38:23         at org.springframework.cloud.stream.binding.OutputBindingLifecycle.doStartWithBindable(OutputBindingLifecycle.java:58) [spring-cloud-stream-2.2.0.RELEASE.jar:2.2.0.RELEASE]
21-May-2019 14:38:23         at java.util.LinkedHashMap$LinkedValues.forEach(LinkedHashMap.java:608) ~[na:1.8.0_201]
21-May-2019 14:38:23         at org.springframework.cloud.stream.binding.AbstractBindingLifecycle.start(AbstractBindingLifecycle.java:48) ~[spring-cloud-stream-2.2.0.RELEASE.jar:2.2.0.RELEASE]
21-May-2019 14:38:23         at org.springframework.cloud.stream.binding.OutputBindingLifecycle.start(OutputBindingLifecycle.java:34) [spring-cloud-stream-2.2.0.RELEASE.jar:2.2.0.RELEASE]
21-May-2019 14:38:23         at org.springframework.context.support.DefaultLifecycleProcessor.doStart(DefaultLifecycleProcessor.java:182) ~[spring-context-5.2.0.M2.jar:5.2.0.M2]
21-May-2019 14:38:23         at org.springframework.context.support.DefaultLifecycleProcessor.access$200(DefaultLifecycleProcessor.java:53) ~[spring-context-5.2.0.M2.jar:5.2.0.M2]
21-May-2019 14:38:23         at org.springframework.context.support.DefaultLifecycleProcessor$LifecycleGroup.start(DefaultLifecycleProcessor.java:360) ~[spring-context-5.2.0.M2.jar:5.2.0.M2]
21-May-2019 14:38:23         at org.springframework.context.support.DefaultLifecycleProcessor.startBeans(DefaultLifecycleProcessor.java:158) ~[spring-context-5.2.0.M2.jar:5.2.0.M2]
21-May-2019 14:38:23         at org.springframework.context.support.DefaultLifecycleProcessor.onRefresh(DefaultLifecycleProcessor.java:122) ~[spring-context-5.2.0.M2.jar:5.2.0.M2]
21-May-2019 14:38:23         at org.springframework.context.support.AbstractApplicationContext.finishRefresh(AbstractApplicationContext.java:893) ~[spring-context-5.2.0.M2.jar:5.2.0.M2]
21-May-2019 14:38:23         at org.springframework.context.support.AbstractApplicationContext.refresh(AbstractApplicationContext.java:552) ~[spring-context-5.2.0.M2.jar:5.2.0.M2]
21-May-2019 14:38:23         at org.springframework.boot.SpringApplication.refresh(SpringApplication.java:782) ~[spring-boot-2.2.0.BUILD-SNAPSHOT.jar:2.2.0.BUILD-SNAPSHOT]
21-May-2019 14:38:23         at org.springframework.boot.SpringApplication.refreshContext(SpringApplication.java:404) ~[spring-boot-2.2.0.BUILD-SNAPSHOT.jar:2.2.0.BUILD-SNAPSHOT]
21-May-2019 14:38:23         at org.springframework.boot.SpringApplication.run(SpringApplication.java:319) ~[spring-boot-2.2.0.BUILD-SNAPSHOT.jar:2.2.0.BUILD-SNAPSHOT]
21-May-2019 14:38:23         at org.springframework.boot.SpringApplication.run(SpringApplication.java:1275) ~[spring-boot-2.2.0.BUILD-SNAPSHOT.jar:2.2.0.BUILD-SNAPSHOT]
21-May-2019 14:38:23         at org.springframework.boot.SpringApplication.run(SpringApplication.java:1263) ~[spring-boot-2.2.0.BUILD-SNAPSHOT.jar:2.2.0.BUILD-SNAPSHOT]
21-May-2019 14:38:23         at io.spring.cloud.BatchEventsApplicationTests.testExecution(BatchEventsApplicationTests.java:49) ~[test-classes/:na]
21-May-2019 14:38:23         at sun.reflect.NativeMethodAccessorImpl.invoke0(Native Method) ~[na:1.8.0_201]
21-May-2019 14:38:23         at sun.reflect.NativeMethodAccessorImpl.invoke(NativeMethodAccessorImpl.java:62) ~[na:1.8.0_201]
21-May-2019 14:38:23         at sun.reflect.DelegatingMethodAccessorImpl.invoke(DelegatingMethodAccessorImpl.java:43) ~[na:1.8.0_201]
21-May-2019 14:38:23         at java.lang.reflect.Method.invoke(Method.java:498) ~[na:1.8.0_201]
21-May-2019 14:38:23         at org.junit.runners.model.FrameworkMethod$1.runReflectiveCall(FrameworkMethod.java:50) ~[junit-4.12.jar:4.12]
21-May-2019 14:38:23         at org.junit.internal.runners.model.ReflectiveCallable.run(ReflectiveCallable.java:12) ~[junit-4.12.jar:4.12]
21-May-2019 14:38:23         at org.junit.runners.model.FrameworkMethod.invokeExplosively(FrameworkMethod.java:47) ~[junit-4.12.jar:4.12]
21-May-2019 14:38:23         at org.junit.internal.runners.statements.InvokeMethod.evaluate(InvokeMethod.java:17) ~[junit-4.12.jar:4.12]
21-May-2019 14:38:23         at org.junit.runners.ParentRunner.runLeaf(ParentRunner.java:325) ~[junit-4.12.jar:4.12]
21-May-2019 14:38:23         at org.junit.runners.BlockJUnit4ClassRunner.runChild(BlockJUnit4ClassRunner.java:78) ~[junit-4.12.jar:4.12]
21-May-2019 14:38:23         at org.junit.runners.BlockJUnit4ClassRunner.runChild(BlockJUnit4ClassRunner.java:57) ~[junit-4.12.jar:4.12]
21-May-2019 14:38:23         at org.junit.runners.ParentRunner$3.run(ParentRunner.java:290) ~[junit-4.12.jar:4.12]
21-May-2019 14:38:23         at org.junit.runners.ParentRunner$1.schedule(ParentRunner.java:71) ~[junit-4.12.jar:4.12]
21-May-2019 14:38:23         at org.junit.runners.ParentRunner.runChildren(ParentRunner.java:288) ~[junit-4.12.jar:4.12]
21-May-2019 14:38:23         at org.junit.runners.ParentRunner.access$000(ParentRunner.java:58) ~[junit-4.12.jar:4.12]
21-May-2019 14:38:23         at org.junit.runners.ParentRunner$2.evaluate(ParentRunner.java:268) ~[junit-4.12.jar:4.12]
21-May-2019 14:38:23         at org.springframework.cloud.stream.test.junit.AbstractExternalResourceTestSupport$1.evaluate(AbstractExternalResourceTestSupport.java:76) ~[spring-cloud-stream-test-support-internal-2.2.1.BUILD-SNAPSHOT.jar:2.2.1.BUILD-SNAPSHOT]
21-May-2019 14:38:23         at org.junit.rules.RunRules.evaluate(RunRules.java:20) ~[junit-4.12.jar:4.12]
21-May-2019 14:38:23         at org.junit.runners.ParentRunner.run(ParentRunner.java:363) ~[junit-4.12.jar:4.12]
21-May-2019 14:38:23         at org.junit.runner.JUnitCore.run(JUnitCore.java:137) ~[junit-4.12.jar:4.12]
21-May-2019 14:38:23         at org.junit.runner.JUnitCore.run(JUnitCore.java:115) ~[junit-4.12.jar:4.12]
21-May-2019 14:38:23         at org.junit.vintage.engine.execution.RunnerExecutor.execute(RunnerExecutor.java:40) ~[junit-vintage-engine-5.4.2.jar:5.4.2]
21-May-2019 14:38:23         at java.util.stream.ForEachOps$ForEachOp$OfRef.accept(ForEachOps.java:184) ~[na:1.8.0_201]
21-May-2019 14:38:23         at java.util.stream.ReferencePipeline$3$1.accept(ReferencePipeline.java:193) ~[na:1.8.0_201]
21-May-2019 14:38:23         at java.util.Iterator.forEachRemaining(Iterator.java:116) ~[na:1.8.0_201]
21-May-2019 14:38:23         at java.util.Spliterators$IteratorSpliterator.forEachRemaining(Spliterators.java:1801) ~[na:1.8.0_201]
21-May-2019 14:38:23         at java.util.stream.AbstractPipeline.copyInto(AbstractPipeline.java:481) ~[na:1.8.0_201]
21-May-2019 14:38:23         at java.util.stream.AbstractPipeline.wrapAndCopyInto(AbstractPipeline.java:471) ~[na:1.8.0_201]
21-May-2019 14:38:23         at java.util.stream.ForEachOps$ForEachOp.evaluateSequential(ForEachOps.java:151) ~[na:1.8.0_201]
21-May-2019 14:38:23         at java.util.stream.ForEachOps$ForEachOp$OfRef.evaluateSequential(ForEachOps.java:174) ~[na:1.8.0_201]
21-May-2019 14:38:23         at java.util.stream.AbstractPipeline.evaluate(AbstractPipeline.java:234) ~[na:1.8.0_201]
21-May-2019 14:38:23         at java.util.stream.ReferencePipeline.forEach(ReferencePipeline.java:418) ~[na:1.8.0_201]
21-May-2019 14:38:23         at org.junit.vintage.engine.VintageTestEngine.executeAllChildren(VintageTestEngine.java:80) ~[junit-vintage-engine-5.4.2.jar:5.4.2]
21-May-2019 14:38:23         at org.junit.vintage.engine.VintageTestEngine.execute(VintageTestEngine.java:71) ~[junit-vintage-engine-5.4.2.jar:5.4.2]
21-May-2019 14:38:23         at org.junit.platform.launcher.core.DefaultLauncher.execute(DefaultLauncher.java:220) ~[junit-platform-launcher-1.3.1.jar:1.3.1]
21-May-2019 14:38:23         at org.junit.platform.launcher.core.DefaultLauncher.lambda$execute$6(DefaultLauncher.java:188) ~[junit-platform-launcher-1.3.1.jar:1.3.1]
21-May-2019 14:38:23         at org.junit.platform.launcher.core.DefaultLauncher.withInterceptedStreams(DefaultLauncher.java:202) ~[junit-platform-launcher-1.3.1.jar:1.3.1]
21-May-2019 14:38:23         at org.junit.platform.launcher.core.DefaultLauncher.execute(DefaultLauncher.java:181) ~[junit-platform-launcher-1.3.1.jar:1.3.1]
21-May-2019 14:38:23         at org.junit.platform.launcher.core.DefaultLauncher.execute(DefaultLauncher.java:128) ~[junit-platform-launcher-1.3.1.jar:1.3.1]
21-May-2019 14:38:23         at org.apache.maven.surefire.junitplatform.JUnitPlatformProvider.invokeAllTests(JUnitPlatformProvider.java:150) ~[surefire-junit-platform-2.22.2.jar:2.22.2]
21-May-2019 14:38:23         at org.apache.maven.surefire.junitplatform.JUnitPlatformProvider.invoke(JUnitPlatformProvider.java:124) ~[surefire-junit-platform-2.22.2.jar:2.22.2]
21-May-2019 14:38:23         at org.apache.maven.surefire.booter.ForkedBooter.invokeProviderInSameClassLoader(ForkedBooter.java:384) ~[surefire-booter-2.22.2.jar:2.22.2]
21-May-2019 14:38:23         at org.apache.maven.surefire.booter.ForkedBooter.runSuitesInProcess(ForkedBooter.java:345) ~[surefire-booter-2.22.2.jar:2.22.2]
21-May-2019 14:38:23         at org.apache.maven.surefire.booter.ForkedBooter.execute(ForkedBooter.java:126) ~[surefire-booter-2.22.2.jar:2.22.2]
21-May-2019 14:38:23         at org.apache.maven.surefire.booter.ForkedBooter.main(ForkedBooter.java:418) ~[surefire-booter-2.22.2.jar:2.22.2]
21-May-2019 14:38:23 Caused by: org.springframework.beans.BeanInstantiationException: Failed to instantiate [org.springframework.cloud.stream.binder.rabbit.RabbitMessageChannelBinder]: Factory method 'rabbitMessageChannelBinder' threw exception; nested exception is java.lang.NoClassDefFoundError: org/springframework/amqp/rabbit/core/support/BatchingStrategy
21-May-2019 14:38:23         at org.springframework.beans.factory.support.SimpleInstantiationStrategy.instantiate(SimpleInstantiationStrategy.java:185) ~[spring-beans-5.2.0.M2.jar:5.2.0.M2]
21-May-2019 14:38:23         at org.springframework.beans.factory.support.ConstructorResolver.instantiate(ConstructorResolver.java:633) ~[spring-beans-5.2.0.M2.jar:5.2.0.M2]
21-May-2019 14:38:23         ... 84 common frames omitted
21-May-2019 14:38:23 Caused by: java.lang.NoClassDefFoundError: org/springframework/amqp/rabbit/core/support/BatchingStrategy
21-May-2019 14:38:23         at org.springframework.cloud.stream.binder.rabbit.config.RabbitMessageChannelBinderConfiguration.rabbitMessageChannelBinder(RabbitMessageChannelBinderConfiguration.java:78) ~[spring-cloud-stream-binder-rabbit-2.2.0.RELEASE.jar:2.2.0.RELEASE]
21-May-2019 14:38:23         at org.springframework.cloud.stream.binder.rabbit.config.RabbitMessageChannelBinderConfiguration$$EnhancerBySpringCGLIB$$cd67f093.CGLIB$rabbitMessageChannelBinder$1(<generated>) ~[spring-cloud-stream-binder-rabbit-2.2.0.RELEASE.jar:2.2.0.RELEASE]
21-May-2019 14:38:23         at org.springframework.cloud.stream.binder.rabbit.config.RabbitMessageChannelBinderConfiguration$$EnhancerBySpringCGLIB$$cd67f093$$FastClassBySpringCGLIB$$9745357.invoke(<generated>) ~[spring-cloud-stream-binder-rabbit-2.2.0.RELEASE.jar:2.2.0.RELEASE]
21-May-2019 14:38:23         at org.springframework.cglib.proxy.MethodProxy.invokeSuper(MethodProxy.java:244) ~[spring-core-5.2.0.M2.jar:5.2.0.M2]
21-May-2019 14:38:23         at org.springframework.context.annotation.ConfigurationClassEnhancer$BeanMethodInterceptor.intercept(ConfigurationClassEnhancer.java:363) ~[spring-context-5.2.0.M2.jar:5.2.0.M2]
21-May-2019 14:38:23         at org.springframework.cloud.stream.binder.rabbit.config.RabbitMessageChannelBinderConfiguration$$EnhancerBySpringCGLIB$$cd67f093.rabbitMessageChannelBinder(<generated>) ~[spring-cloud-stream-binder-rabbit-2.2.0.RELEASE.jar:2.2.0.RELEASE]
21-May-2019 14:38:23         at sun.reflect.NativeMethodAccessorImpl.invoke0(Native Method) ~[na:1.8.0_201]
21-May-2019 14:38:23         at sun.reflect.NativeMethodAccessorImpl.invoke(NativeMethodAccessorImpl.java:62) ~[na:1.8.0_201]
21-May-2019 14:38:23         at sun.reflect.DelegatingMethodAccessorImpl.invoke(DelegatingMethodAccessorImpl.java:43) ~[na:1.8.0_201]
21-May-2019 14:38:23         at java.lang.reflect.Method.invoke(Method.java:498) ~[na:1.8.0_201]
21-May-2019 14:38:23         at org.springframework.beans.factory.support.SimpleInstantiationStrategy.instantiate(SimpleInstantiationStrategy.java:154) ~[spring-beans-5.2.0.M2.jar:5.2.0.M2]
21-May-2019 14:38:23         ... 85 common frames omitted
21-May-2019 14:38:23 Caused by: java.lang.ClassNotFoundException: org.springframework.amqp.rabbit.core.support.BatchingStrategy
21-May-2019 14:38:23         at java.net.URLClassLoader.findClass(URLClassLoader.java:382) ~[na:1.8.0_201]
21-May-2019 14:38:23         at java.lang.ClassLoader.loadClass(ClassLoader.java:424) ~[na:1.8.0_201]
21-May-2019 14:38:23         at sun.misc.Launcher$AppClassLoader.loadClass(Launcher.java:349) ~[na:1.8.0_201]
21-May-2019 14:38:23         at java.lang.ClassLoader.loadClass(ClassLoader.java:357) ~[na:1.8.0_201]
21-May-2019 14:38:23         ... 96 common frames omitted
21-May-2019 14:38:23
21-May-2019 14:38:23 2019-05-21 14:38:23.656  WARN 9521 --- [           main] s.c.a.AnnotationConfigApplicationContext : Exception encountered during context initialization - cancelling refresh attempt: org.springframework.context.ApplicationContextException: Failed to start bean 'outputBindingLifecycle'; nested exception is org.springframework.beans.factory.BeanCreationException: Error creating bean with name 'rabbitMessageChannelBinder' defined in org.springframework.cloud.stream.binder.rabbit.config.RabbitMessageChannelBinderConfiguration: Bean instantiation via factory method failed; nested exception is org.springframework.beans.BeanInstantiationException: Failed to instantiate [org.springframework.cloud.stream.binder.rabbit.RabbitMessageChannelBinder]: Factory method 'rabbitMessageChannelBinder' threw exception; nested exception is java.lang.NoClassDefFoundError: org/springframework/amqp/rabbit/core/support/BatchingStrategy
21-May-2019 14:38:23 2019-05-21 14:38:23.658  INFO 9521 --- [           main] o.s.s.c.ThreadPoolTaskScheduler          : Shutting down ExecutorService 'taskScheduler'
21-May-2019 14:38:23 2019-05-21 14:38:23.658  INFO 9521 --- [           main] com.zaxxer.hikari.HikariDataSource       : HikariPool-1 - Shutdown initiated...
21-May-2019 14:38:23 2019-05-21 14:38:23.660  INFO 9521 --- [           main] com.zaxxer.hikari.HikariDataSource       : HikariPool-1 - Shutdown completed.
21-May-2019 14:38:23 2019-05-21 14:38:23.665  INFO 9521 --- [           main] ConditionEvaluationReportLoggingListener :
21-May-2019 14:38:23
21-May-2019 14:38:23 Error starting ApplicationContext. To display the conditions report re-run your application with 'debug' enabled.
21-May-2019 14:38:23 2019-05-21 14:38:23.665 ERROR 9521 --- [           main] o.s.c.t.listener.TaskLifecycleListener   : An event to end a task has been received for a task that has not yet started.
21-May-2019 14:38:23 2019-05-21 14:38:23.666 ERROR 9521 --- [           main] o.s.boot.SpringApplication               : Application run failed
21-May-2019 14:38:23
21-May-2019 14:38:23 org.springframework.context.ApplicationContextException: Failed to start bean 'outputBindingLifecycle'; nested exception is org.springframework.beans.factory.BeanCreationException: Error creating bean with name 'rabbitMessageChannelBinder' defined in org.springframework.cloud.stream.binder.rabbit.config.RabbitMessageChannelBinderConfiguration: Bean instantiation via factory method failed; nested exception is org.springframework.beans.BeanInstantiationException: Failed to instantiate [org.springframework.cloud.stream.binder.rabbit.RabbitMessageChannelBinder]: Factory method 'rabbitMessageChannelBinder' threw exception; nested exception is java.lang.NoClassDefFoundError: org/springframework/amqp/rabbit/core/support/BatchingStrategy
21-May-2019 14:38:23         at org.springframework.context.support.DefaultLifecycleProcessor.doStart(DefaultLifecycleProcessor.java:185) ~[spring-context-5.2.0.M2.jar:5.2.0.M2]
21-May-2019 14:38:23         at org.springframework.context.support.DefaultLifecycleProcessor.access$200(DefaultLifecycleProcessor.java:53) ~[spring-context-5.2.0.M2.jar:5.2.0.M2]
21-May-2019 14:38:23         at org.springframework.context.support.DefaultLifecycleProcessor$LifecycleGroup.start(DefaultLifecycleProcessor.java:360) ~[spring-context-5.2.0.M2.jar:5.2.0.M2]
21-May-2019 14:38:23         at org.springframework.context.support.DefaultLifecycleProcessor.startBeans(DefaultLifecycleProcessor.java:158) ~[spring-context-5.2.0.M2.jar:5.2.0.M2]
21-May-2019 14:38:23         at org.springframework.context.support.DefaultLifecycleProcessor.onRefresh(DefaultLifecycleProcessor.java:122) ~[spring-context-5.2.0.M2.jar:5.2.0.M2]
21-May-2019 14:38:23         at org.springframework.context.support.AbstractApplicationContext.finishRefresh(AbstractApplicationContext.java:893) ~[spring-context-5.2.0.M2.jar:5.2.0.M2]
21-May-2019 14:38:23         at org.springframework.context.support.AbstractApplicationContext.refresh(AbstractApplicationContext.java:552) ~[spring-context-5.2.0.M2.jar:5.2.0.M2]
21-May-2019 14:38:23         at org.springframework.boot.SpringApplication.refresh(SpringApplication.java:782) [spring-boot-2.2.0.BUILD-SNAPSHOT.jar:2.2.0.BUILD-SNAPSHOT]
21-May-2019 14:38:23         at org.springframework.boot.SpringApplication.refreshContext(SpringApplication.java:404) [spring-boot-2.2.0.BUILD-SNAPSHOT.jar:2.2.0.BUILD-SNAPSHOT]
21-May-2019 14:38:23         at org.springframework.boot.SpringApplication.run(SpringApplication.java:319) [spring-boot-2.2.0.BUILD-SNAPSHOT.jar:2.2.0.BUILD-SNAPSHOT]
21-May-2019 14:38:23         at org.springframework.boot.SpringApplication.run(SpringApplication.java:1275) [spring-boot-2.2.0.BUILD-SNAPSHOT.jar:2.2.0.BUILD-SNAPSHOT]
21-May-2019 14:38:23         at org.springframework.boot.SpringApplication.run(SpringApplication.java:1263) [spring-boot-2.2.0.BUILD-SNAPSHOT.jar:2.2.0.BUILD-SNAPSHOT]
21-May-2019 14:38:23         at io.spring.cloud.BatchEventsApplicationTests.testExecution(BatchEventsApplicationTests.java:49) [test-classes/:na]
21-May-2019 14:38:23         at sun.reflect.NativeMethodAccessorImpl.invoke0(Native Method) ~[na:1.8.0_201]
21-May-2019 14:38:23         at sun.reflect.NativeMethodAccessorImpl.invoke(NativeMethodAccessorImpl.java:62) ~[na:1.8.0_201]
21-May-2019 14:38:23         at sun.reflect.DelegatingMethodAccessorImpl.invoke(DelegatingMethodAccessorImpl.java:43) ~[na:1.8.0_201]
21-May-2019 14:38:23         at java.lang.reflect.Method.invoke(Method.java:498) ~[na:1.8.0_201]
21-May-2019 14:38:23         at org.junit.runners.model.FrameworkMethod$1.runReflectiveCall(FrameworkMethod.java:50) [junit-4.12.jar:4.12]
21-May-2019 14:38:23         at org.junit.internal.runners.model.ReflectiveCallable.run(ReflectiveCallable.java:12) [junit-4.12.jar:4.12]
21-May-2019 14:38:23         at org.junit.runners.model.FrameworkMethod.invokeExplosively(FrameworkMethod.java:47) [junit-4.12.jar:4.12]
21-May-2019 14:38:23         at org.junit.internal.runners.statements.InvokeMethod.evaluate(InvokeMethod.java:17) [junit-4.12.jar:4.12]
21-May-2019 14:38:23         at org.junit.runners.ParentRunner.runLeaf(ParentRunner.java:325) [junit-4.12.jar:4.12]
21-May-2019 14:38:23         at org.junit.runners.BlockJUnit4ClassRunner.runChild(BlockJUnit4ClassRunner.java:78) [junit-4.12.jar:4.12]
21-May-2019 14:38:23         at org.junit.runners.BlockJUnit4ClassRunner.runChild(BlockJUnit4ClassRunner.java:57) [junit-4.12.jar:4.12]
21-May-2019 14:38:23         at org.junit.runners.ParentRunner$3.run(ParentRunner.java:290) [junit-4.12.jar:4.12]
21-May-2019 14:38:23         at org.junit.runners.ParentRunner$1.schedule(ParentRunner.java:71) [junit-4.12.jar:4.12]
21-May-2019 14:38:23         at org.junit.runners.ParentRunner.runChildren(ParentRunner.java:288) [junit-4.12.jar:4.12]
21-May-2019 14:38:23         at org.junit.runners.ParentRunner.access$000(ParentRunner.java:58) [junit-4.12.jar:4.12]
21-May-2019 14:38:23         at org.junit.runners.ParentRunner$2.evaluate(ParentRunner.java:268) [junit-4.12.jar:4.12]
21-May-2019 14:38:23         at org.springframework.cloud.stream.test.junit.AbstractExternalResourceTestSupport$1.evaluate(AbstractExternalResourceTestSupport.java:76) [spring-cloud-stream-test-support-internal-2.2.1.BUILD-SNAPSHOT.jar:2.2.1.BUILD-SNAPSHOT]
21-May-2019 14:38:23         at org.junit.rules.RunRules.evaluate(RunRules.java:20) [junit-4.12.jar:4.12]
21-May-2019 14:38:23         at org.junit.runners.ParentRunner.run(ParentRunner.java:363) [junit-4.12.jar:4.12]
21-May-2019 14:38:23         at org.junit.runner.JUnitCore.run(JUnitCore.java:137) [junit-4.12.jar:4.12]
21-May-2019 14:38:23         at org.junit.runner.JUnitCore.run(JUnitCore.java:115) [junit-4.12.jar:4.12]
21-May-2019 14:38:23         at org.junit.vintage.engine.execution.RunnerExecutor.execute(RunnerExecutor.java:40) [junit-vintage-engine-5.4.2.jar:5.4.2]
21-May-2019 14:38:23         at java.util.stream.ForEachOps$ForEachOp$OfRef.accept(ForEachOps.java:184) ~[na:1.8.0_201]
21-May-2019 14:38:23         at java.util.stream.ReferencePipeline$3$1.accept(ReferencePipeline.java:193) ~[na:1.8.0_201]
21-May-2019 14:38:23         at java.util.Iterator.forEachRemaining(Iterator.java:116) ~[na:1.8.0_201]
21-May-2019 14:38:23         at java.util.Spliterators$IteratorSpliterator.forEachRemaining(Spliterators.java:1801) ~[na:1.8.0_201]
21-May-2019 14:38:23         at java.util.stream.AbstractPipeline.copyInto(AbstractPipeline.java:481) ~[na:1.8.0_201]
21-May-2019 14:38:23         at java.util.stream.AbstractPipeline.wrapAndCopyInto(AbstractPipeline.java:471) ~[na:1.8.0_201]
21-May-2019 14:38:23         at java.util.stream.ForEachOps$ForEachOp.evaluateSequential(ForEachOps.java:151) ~[na:1.8.0_201]
21-May-2019 14:38:23         at java.util.stream.ForEachOps$ForEachOp$OfRef.evaluateSequential(ForEachOps.java:174) ~[na:1.8.0_201]
21-May-2019 14:38:23         at java.util.stream.AbstractPipeline.evaluate(AbstractPipeline.java:234) ~[na:1.8.0_201]
21-May-2019 14:38:23         at java.util.stream.ReferencePipeline.forEach(ReferencePipeline.java:418) ~[na:1.8.0_201]
21-May-2019 14:38:23         at org.junit.vintage.engine.VintageTestEngine.executeAllChildren(VintageTestEngine.java:80) ~[junit-vintage-engine-5.4.2.jar:5.4.2]
21-May-2019 14:38:23         at org.junit.vintage.engine.VintageTestEngine.execute(VintageTestEngine.java:71) ~[junit-vintage-engine-5.4.2.jar:5.4.2]
21-May-2019 14:38:23         at org.junit.platform.launcher.core.DefaultLauncher.execute(DefaultLauncher.java:220) ~[junit-platform-launcher-1.3.1.jar:1.3.1]
21-May-2019 14:38:23         at org.junit.platform.launcher.core.DefaultLauncher.lambda$execute$6(DefaultLauncher.java:188) ~[junit-platform-launcher-1.3.1.jar:1.3.1]
21-May-2019 14:38:23         at org.junit.platform.launcher.core.DefaultLauncher.withInterceptedStreams(DefaultLauncher.java:202) ~[junit-platform-launcher-1.3.1.jar:1.3.1]
21-May-2019 14:38:23         at org.junit.platform.launcher.core.DefaultLauncher.execute(DefaultLauncher.java:181) ~[junit-platform-launcher-1.3.1.jar:1.3.1]
21-May-2019 14:38:23         at org.junit.platform.launcher.core.DefaultLauncher.execute(DefaultLauncher.java:128) ~[junit-platform-launcher-1.3.1.jar:1.3.1]
21-May-2019 14:38:23         at org.apache.maven.surefire.junitplatform.JUnitPlatformProvider.invokeAllTests(JUnitPlatformProvider.java:150) ~[surefire-junit-platform-2.22.2.jar:2.22.2]
21-May-2019 14:38:23         at org.apache.maven.surefire.junitplatform.JUnitPlatformProvider.invoke(JUnitPlatformProvider.java:124) ~[surefire-junit-platform-2.22.2.jar:2.22.2]
21-May-2019 14:38:23         at org.apache.maven.surefire.booter.ForkedBooter.invokeProviderInSameClassLoader(ForkedBooter.java:384) ~[surefire-booter-2.22.2.jar:2.22.2]
21-May-2019 14:38:23         at org.apache.maven.surefire.booter.ForkedBooter.runSuitesInProcess(ForkedBooter.java:345) ~[surefire-booter-2.22.2.jar:2.22.2]
21-May-2019 14:38:23         at org.apache.maven.surefire.booter.ForkedBooter.execute(ForkedBooter.java:126) ~[surefire-booter-2.22.2.jar:2.22.2]
21-May-2019 14:38:23         at org.apache.maven.surefire.booter.ForkedBooter.main(ForkedBooter.java:418) ~[surefire-booter-2.22.2.jar:2.22.2]
21-May-2019 14:38:23 Caused by: org.springframework.beans.factory.BeanCreationException: Error creating bean with name 'rabbitMessageChannelBinder' defined in org.springframework.cloud.stream.binder.rabbit.config.RabbitMessageChannelBinderConfiguration: Bean instantiation via factory method failed; nested exception is org.springframework.beans.BeanInstantiationException: Failed to instantiate [org.springframework.cloud.stream.binder.rabbit.RabbitMessageChannelBinder]: Factory method 'rabbitMessageChannelBinder' threw exception; nested exception is java.lang.NoClassDefFoundError: org/springframework/amqp/rabbit/core/support/BatchingStrategy
21-May-2019 14:38:23         at org.springframework.beans.factory.support.ConstructorResolver.instantiate(ConstructorResolver.java:638) ~[spring-beans-5.2.0.M2.jar:5.2.0.M2]
21-May-2019 14:38:23         at org.springframework.beans.factory.support.ConstructorResolver.instantiateUsingFactoryMethod(ConstructorResolver.java:618) ~[spring-beans-5.2.0.M2.jar:5.2.0.M2]
21-May-2019 14:38:23         at org.springframework.beans.factory.support.AbstractAutowireCapableBeanFactory.instantiateUsingFactoryMethod(AbstractAutowireCapableBeanFactory.java:1325) ~[spring-beans-5.2.0.M2.jar:5.2.0.M2]
21-May-2019 14:38:23         at org.springframework.beans.factory.support.AbstractAutowireCapableBeanFactory.createBeanInstance(AbstractAutowireCapableBeanFactory.java:1164) ~[spring-beans-5.2.0.M2.jar:5.2.0.M2]
21-May-2019 14:38:23         at org.springframework.beans.factory.support.AbstractAutowireCapableBeanFactory.doCreateBean(AbstractAutowireCapableBeanFactory.java:555) ~[spring-beans-5.2.0.M2.jar:5.2.0.M2]
21-May-2019 14:38:23         at org.springframework.beans.factory.support.AbstractAutowireCapableBeanFactory.createBean(AbstractAutowireCapableBeanFactory.java:515) ~[spring-beans-5.2.0.M2.jar:5.2.0.M2]
21-May-2019 14:38:23         at org.springframework.beans.factory.support.AbstractBeanFactory.lambda$doGetBean$0(AbstractBeanFactory.java:320) ~[spring-beans-5.2.0.M2.jar:5.2.0.M2]
21-May-2019 14:38:23         at org.springframework.beans.factory.support.DefaultSingletonBeanRegistry.getSingleton(DefaultSingletonBeanRegistry.java:222) ~[spring-beans-5.2.0.M2.jar:5.2.0.M2]
21-May-2019 14:38:23         at org.springframework.beans.factory.support.AbstractBeanFactory.doGetBean(AbstractBeanFactory.java:318) ~[spring-beans-5.2.0.M2.jar:5.2.0.M2]
21-May-2019 14:38:23         at org.springframework.beans.factory.support.AbstractBeanFactory.getBean(AbstractBeanFactory.java:199) ~[spring-beans-5.2.0.M2.jar:5.2.0.M2]
21-May-2019 14:38:23         at org.springframework.beans.factory.support.DefaultListableBeanFactory.preInstantiateSingletons(DefaultListableBeanFactory.java:868) ~[spring-beans-5.2.0.M2.jar:5.2.0.M2]
21-May-2019 14:38:23         at org.springframework.context.support.AbstractApplicationContext.finishBeanFactoryInitialization(AbstractApplicationContext.java:877) ~[spring-context-5.2.0.M2.jar:5.2.0.M2]
21-May-2019 14:38:23         at org.springframework.context.support.AbstractApplicationContext.refresh(AbstractApplicationContext.java:549) ~[spring-context-5.2.0.M2.jar:5.2.0.M2]
21-May-2019 14:38:23         at org.springframework.boot.SpringApplication.refresh(SpringApplication.java:782) [spring-boot-2.2.0.BUILD-SNAPSHOT.jar:2.2.0.BUILD-SNAPSHOT]
21-May-2019 14:38:23         at org.springframework.boot.SpringApplication.refreshContext(SpringApplication.java:404) [spring-boot-2.2.0.BUILD-SNAPSHOT.jar:2.2.0.BUILD-SNAPSHOT]
21-May-2019 14:38:23         at org.springframework.boot.SpringApplication.run(SpringApplication.java:319) [spring-boot-2.2.0.BUILD-SNAPSHOT.jar:2.2.0.BUILD-SNAPSHOT]
21-May-2019 14:38:23         at org.springframework.boot.builder.SpringApplicationBuilder.run(SpringApplicationBuilder.java:139) ~[spring-boot-2.2.0.BUILD-SNAPSHOT.jar:2.2.0.BUILD-SNAPSHOT]
21-May-2019 14:38:23         at org.springframework.cloud.stream.binder.DefaultBinderFactory.getBinderInstance(DefaultBinderFactory.java:292) ~[spring-cloud-stream-2.2.0.RELEASE.jar:2.2.0.RELEASE]
21-May-2019 14:38:23         at org.springframework.cloud.stream.binder.DefaultBinderFactory.doGetBinder(DefaultBinderFactory.java:192) ~[spring-cloud-stream-2.2.0.RELEASE.jar:2.2.0.RELEASE]
21-May-2019 14:38:23         at org.springframework.cloud.stream.binder.DefaultBinderFactory.getBinder(DefaultBinderFactory.java:130) ~[spring-cloud-stream-2.2.0.RELEASE.jar:2.2.0.RELEASE]
21-May-2019 14:38:23         at org.springframework.cloud.stream.binding.BindingService.getBinder(BindingService.java:337) ~[spring-cloud-stream-2.2.0.RELEASE.jar:2.2.0.RELEASE]
21-May-2019 14:38:23         at org.springframework.cloud.stream.binding.BindingService.bindProducer(BindingService.java:229) ~[spring-cloud-stream-2.2.0.RELEASE.jar:2.2.0.RELEASE]
21-May-2019 14:38:23         at org.springframework.cloud.stream.binding.BindableProxyFactory.createAndBindOutputs(BindableProxyFactory.java:287) ~[spring-cloud-stream-2.2.0.RELEASE.jar:2.2.0.RELEASE]
21-May-2019 14:38:23         at org.springframework.cloud.stream.binding.OutputBindingLifecycle.doStartWithBindable(OutputBindingLifecycle.java:58) ~[spring-cloud-stream-2.2.0.RELEASE.jar:2.2.0.RELEASE]
21-May-2019 14:38:23         at java.util.LinkedHashMap$LinkedValues.forEach(LinkedHashMap.java:608) ~[na:1.8.0_201]
21-May-2019 14:38:23         at org.springframework.cloud.stream.binding.AbstractBindingLifecycle.start(AbstractBindingLifecycle.java:48) ~[spring-cloud-stream-2.2.0.RELEASE.jar:2.2.0.RELEASE]
21-May-2019 14:38:23         at org.springframework.cloud.stream.binding.OutputBindingLifecycle.start(OutputBindingLifecycle.java:34) ~[spring-cloud-stream-2.2.0.RELEASE.jar:2.2.0.RELEASE]
21-May-2019 14:38:23         at org.springframework.context.support.DefaultLifecycleProcessor.doStart(DefaultLifecycleProcessor.java:182) ~[spring-context-5.2.0.M2.jar:5.2.0.M2]
21-May-2019 14:38:23         ... 57 common frames omitted
21-May-2019 14:38:23 Caused by: org.springframework.beans.BeanInstantiationException: Failed to instantiate [org.springframework.cloud.stream.binder.rabbit.RabbitMessageChannelBinder]: Factory method 'rabbitMessageChannelBinder' threw exception; nested exception is java.lang.NoClassDefFoundError: org/springframework/amqp/rabbit/core/support/BatchingStrategy
21-May-2019 14:38:23         at org.springframework.beans.factory.support.SimpleInstantiationStrategy.instantiate(SimpleInstantiationStrategy.java:185) ~[spring-beans-5.2.0.M2.jar:5.2.0.M2]
21-May-2019 14:38:23         at org.springframework.beans.factory.support.ConstructorResolver.instantiate(ConstructorResolver.java:633) ~[spring-beans-5.2.0.M2.jar:5.2.0.M2]
21-May-2019 14:38:23         ... 84 common frames omitted
21-May-2019 14:38:23 Caused by: java.lang.NoClassDefFoundError: org/springframework/amqp/rabbit/core/support/BatchingStrategy
21-May-2019 14:38:23         at org.springframework.cloud.stream.binder.rabbit.config.RabbitMessageChannelBinderConfiguration.rabbitMessageChannelBinder(RabbitMessageChannelBinderConfiguration.java:78) ~[spring-cloud-stream-binder-rabbit-2.2.0.RELEASE.jar:2.2.0.RELEASE]
21-May-2019 14:38:23         at org.springframework.cloud.stream.binder.rabbit.config.RabbitMessageChannelBinderConfiguration$$EnhancerBySpringCGLIB$$cd67f093.CGLIB$rabbitMessageChannelBinder$1(<generated>) ~[spring-cloud-stream-binder-rabbit-2.2.0.RELEASE.jar:2.2.0.RELEASE]
21-May-2019 14:38:23         at org.springframework.cloud.stream.binder.rabbit.config.RabbitMessageChannelBinderConfiguration$$EnhancerBySpringCGLIB$$cd67f093$$FastClassBySpringCGLIB$$9745357.invoke(<generated>) ~[spring-cloud-stream-binder-rabbit-2.2.0.RELEASE.jar:2.2.0.RELEASE]
21-May-2019 14:38:23         at org.springframework.cglib.proxy.MethodProxy.invokeSuper(MethodProxy.java:244) ~[spring-core-5.2.0.M2.jar:5.2.0.M2]
21-May-2019 14:38:23         at org.springframework.context.annotation.ConfigurationClassEnhancer$BeanMethodInterceptor.intercept(ConfigurationClassEnhancer.java:363) ~[spring-context-5.2.0.M2.jar:5.2.0.M2]
21-May-2019 14:38:23         at org.springframework.cloud.stream.binder.rabbit.config.RabbitMessageChannelBinderConfiguration$$EnhancerBySpringCGLIB$$cd67f093.rabbitMessageChannelBinder(<generated>) ~[spring-cloud-stream-binder-rabbit-2.2.0.RELEASE.jar:2.2.0.RELEASE]
21-May-2019 14:38:23         at sun.reflect.NativeMethodAccessorImpl.invoke0(Native Method) ~[na:1.8.0_201]
21-May-2019 14:38:23         at sun.reflect.NativeMethodAccessorImpl.invoke(NativeMethodAccessorImpl.java:62) ~[na:1.8.0_201]
21-May-2019 14:38:23         at sun.reflect.DelegatingMethodAccessorImpl.invoke(DelegatingMethodAccessorImpl.java:43) ~[na:1.8.0_201]
21-May-2019 14:38:23         at java.lang.reflect.Method.invoke(Method.java:498) ~[na:1.8.0_201]
21-May-2019 14:38:23         at org.springframework.beans.factory.support.SimpleInstantiationStrategy.instantiate(SimpleInstantiationStrategy.java:154) ~[spring-beans-5.2.0.M2.jar:5.2.0.M2]
21-May-2019 14:38:23         ... 85 common frames omitted
21-May-2019 14:38:23 Caused by: java.lang.ClassNotFoundException: org.springframework.amqp.rabbit.core.support.BatchingStrategy
21-May-2019 14:38:23         at java.net.URLClassLoader.findClass(URLClassLoader.java:382) ~[na:1.8.0_201]
21-May-2019 14:38:23         at java.lang.ClassLoader.loadClass(ClassLoader.java:424) ~[na:1.8.0_201]
21-May-2019 14:38:23         at sun.misc.Launcher$AppClassLoader.loadClass(Launcher.java:349) ~[na:1.8.0_201]
21-May-2019 14:38:23         at java.lang.ClassLoader.loadClass(ClassLoader.java:357) ~[na:1.8.0_201]
21-May-2019 14:38:23         ... 96 common frames omitted
21-May-2019 14:38:23
21-May-2019 14:38:23 [ERROR] Tests run: 1, Failures: 0, Errors: 1, Skipped: 0, Time elapsed: 2.862 s <<< FAILURE! - in io.spring.cloud.BatchEventsApplicationTests
21-May-2019 14:38:23 [ERROR] testExecution  Time elapsed: 2.714 s  <<< ERROR!
21-May-2019 14:38:23 org.springframework.context.ApplicationContextException: Failed to start bean 'outputBindingLifecycle'; nested exception is org.springframework.beans.factory.BeanCreationException: Error creating bean with name 'rabbitMessageChannelBinder' defined in org.springframework.cloud.stream.binder.rabbit.config.RabbitMessageChannelBinderConfiguration: Bean instantiation via factory method failed; nested exception is org.springframework.beans.BeanInstantiationException: Failed to instantiate [org.springframework.cloud.stream.binder.rabbit.RabbitMessageChannelBinder]: Factory method 'rabbitMessageChannelBinder' threw exception; nested exception is java.lang.NoClassDefFoundError: org/springframework/amqp/rabbit/core/support/BatchingStrategy
21-May-2019 14:38:23         at io.spring.cloud.BatchEventsApplicationTests.testExecution(BatchEventsApplicationTests.java:49)
21-May-2019 14:38:23 Caused by: org.springframework.beans.factory.BeanCreationException: Error creating bean with name 'rabbitMessageChannelBinder' defined in org.springframework.cloud.stream.binder.rabbit.config.RabbitMessageChannelBinderConfiguration: Bean instantiation via factory method failed; nested exception is org.springframework.beans.BeanInstantiationException: Failed to instantiate [org.springframework.cloud.stream.binder.rabbit.RabbitMessageChannelBinder]: Factory method 'rabbitMessageChannelBinder' threw exception; nested exception is java.lang.NoClassDefFoundError: org/springframework/amqp/rabbit/core/support/BatchingStrategy
21-May-2019 14:38:23         at io.spring.cloud.BatchEventsApplicationTests.testExecution(BatchEventsApplicationTests.java:49)
21-May-2019 14:38:23 Caused by: org.springframework.beans.BeanInstantiationException: Failed to instantiate [org.springframework.cloud.stream.binder.rabbit.RabbitMessageChannelBinder]: Factory method 'rabbitMessageChannelBinder' threw exception; nested exception is java.lang.NoClassDefFoundError: org/springframework/amqp/rabbit/core/support/BatchingStrategy
21-May-2019 14:38:23         at io.spring.cloud.BatchEventsApplicationTests.testExecution(BatchEventsApplicationTests.java:49)
21-May-2019 14:38:23 Caused by: java.lang.NoClassDefFoundError: org/springframework/amqp/rabbit/core/support/BatchingStrategy
21-May-2019 14:38:23         at io.spring.cloud.BatchEventsApplicationTests.testExecution(BatchEventsApplicationTests.java:49)
21-May-2019 14:38:23 Caused by: java.lang.ClassNotFoundException: org.springframework.amqp.rabbit.core.support.BatchingStrategy
21-May-2019 14:38:23         at io.spring.cloud.BatchEventsApplicationTests.testExecution(BatchEventsApplicationTests.java:49)
21-May-2019 14:38:23
21-May-2019 14:38:23 2019-05-21 14:38:23.712  INFO 9521 --- [       Thread-1] o.s.i.endpoint.EventDrivenConsumer       : Removing {logging-channel-adapter:_org.springframework.integration.errorLogger} as a subscriber to the 'errorChannel' channel
21-May-2019 14:38:23 2019-05-21 14:38:23.712  INFO 9521 --- [       Thread-1] o.s.i.channel.PublishSubscribeChannel    : Channel 'batchEvents.errorChannel' has 0 subscriber(s).
21-May-2019 14:38:23 2019-05-21 14:38:23.712  INFO 9521 --- [       Thread-1] o.s.i.endpoint.EventDrivenConsumer       : stopped _org.springframework.integration.errorLogger
21-May-2019 14:38:23 2019-05-21 14:38:23.712  INFO 9521 --- [       Thread-1] o.s.s.c.ThreadPoolTaskScheduler          : Shutting down ExecutorService 'taskScheduler'
21-May-2019 14:38:24 [INFO]
21-May-2019 14:38:24 [INFO] Results:
21-May-2019 14:38:24 [INFO]
21-May-2019 14:38:24 [ERROR] Errors:
21-May-2019 14:38:24 [ERROR]   BatchEventsApplicationTests.testExecution:49 » ApplicationContext Failed to st...
21-May-2019 14:38:24 [INFO]
21-May-2019 14:38:24 [ERROR] Tests run: 1, Failures: 0, Errors: 1, Skipped: 0
21-May-2019 14:38:24 [INFO]
21-May-2019 14:38:24 [INFO]
21-May-2019 14:38:24 [INFO] ------------------------------------------------------------------------
21-May-2019 14:38:24 [INFO] Skipping Spring Cloud Task Build
21-May-2019 14:38:24 [INFO] This project has been banned from the build due to previous failures.
21-May-2019 14:38:24 [INFO] ------------------------------------------------------------------------
21-May-2019 14:38:24 [INFO] ------------------------------------------------------------------------
21-May-2019 14:38:24 [INFO] Reactor Summary:
21-May-2019 14:38:24 [INFO]
21-May-2019 14:38:24 [INFO] Spring Cloud Task Dependencies ..................... SUCCESS [  0.112 s]
21-May-2019 14:38:24 [INFO] Spring Cloud Task Build ............................ SUCCESS [01:05 min]
21-May-2019 14:38:24 [INFO] Spring Cloud Task Core ............................. SUCCESS [ 26.752 s]
21-May-2019 14:38:24 [INFO] Spring Cloud Task Batch ............................ SUCCESS [01:09 min]
21-May-2019 14:38:24 [INFO] Spring Cloud Task Stream ........................... SUCCESS [ 23.903 s]
21-May-2019 14:38:24 [INFO] Spring Cloud Task Starter .......................... SUCCESS [ 13.357 s]
21-May-2019 14:38:24 [INFO] Timestamp Task ..................................... SUCCESS [  9.263 s]
21-May-2019 14:38:24 [INFO] Batch Job Sample Application ....................... SUCCESS [  4.413 s]
21-May-2019 14:38:24 [INFO] Task Sink Sample Application ....................... SUCCESS [  4.551 s]
21-May-2019 14:38:24 [INFO] Task Processor Sample Application .................. SUCCESS [  4.520 s]
21-May-2019 14:38:24 [INFO] Partitioned Batch Job .............................. SUCCESS [  1.208 s]
21-May-2019 14:38:24 [INFO] Task Events ........................................ SUCCESS [  0.937 s]
21-May-2019 14:38:24 [INFO] Batch Events Sample Application .................... FAILURE [  3.957 s]
21-May-2019 14:38:24 [INFO] Spring Cloud Task JPA Sample Application ........... SKIPPED
21-May-2019 14:38:24 [INFO] Spring Cloud Task Multiple DataSources Application . SKIPPED
21-May-2019 14:38:24 [INFO] Spring Cloud Task Samples .......................... SKIPPED
21-May-2019 14:38:24 [INFO] Spring Cloud Task Integration Tests ................ SKIPPED
21-May-2019 14:38:24 [INFO] Spring Cloud Task Docs ............................. SKIPPED
21-May-2019 14:38:24 [INFO] ------------------------------------------------------------------------
21-May-2019 14:38:24 [INFO] BUILD FAILURE
21-May-2019 14:38:24 [INFO] ------------------------------------------------------------------------
21-May-2019 14:38:24 [INFO] Total time: 03:57 min
21-May-2019 14:38:24 [INFO] Finished at: 2019-05-21T14:38:24Z
21-May-2019 14:38:25 [INFO] Final Memory: 532M/1476M
21-May-2019 14:38:25 [INFO] ------------------------------------------------------------------------
21-May-2019 14:38:25 [ERROR] Failed to execute goal org.apache.maven.plugins:maven-surefire-plugin:2.22.2:test (default-test) on project batch-events: There are test failures.
21-May-2019 14:38:25 [ERROR]
21-May-2019 14:38:25 [ERROR] Please refer to /opt/bamboo-home/xml-data/build-dir/SCT-STASK-JOB1/spring-cloud-task-samples/batch-events/target/surefire-reports for the individual test results.
21-May-2019 14:38:25 [ERROR] Please refer to dump files (if any exist) [date].dump, [date]-jvmRun[N].dump and [date].dumpstream.
21-May-2019 14:38:25 [ERROR] -> [Help 1]
21-May-2019 14:38:25 [ERROR]
21-May-2019 14:38:25 [ERROR] To see the full stack trace of the errors, re-run Maven with the -e switch.
21-May-2019 14:38:25 [ERROR] Re-run Maven using the -X switch to enable full debug logging.
21-May-2019 14:38:25 [ERROR]
21-May-2019 14:38:25 [ERROR] For more information about the errors and possible solutions, please read the following articles:
21-May-2019 14:38:25 [ERROR] [Help 1] http://cwiki.apache.org/confluence/display/MAVEN/MojoFailureException
21-May-2019 14:38:25 [ERROR]
21-May-2019 14:38:25 [ERROR] After correcting the problems, you can resume the build with the command
21-May-2019 14:38:25 [ERROR]   mvn <goals> -rf :batch-events
21-May-2019 14:38:25
21-May-2019 14:38:25 Failing task since return code of [/opt/jdk-8/bin/java -cp /opt/maven-3.5/boot/plexus-classworlds-2.5.2.jar -Dclassworlds.conf=/tmp/artifactoryM28105075443178648851conf -DbuildInfoConfig.propertiesFile=/tmp/buildInfo967715233316879011.properties -Xmx2048m -XX:MaxPermSize=2048m -Dmaven.home=/opt/maven-3.5 -Dmaven.multiModuleProjectDirectory=/opt/bamboo-home/xml-data/build-dir/SCT-STASK-JOB1 org.codehaus.plexus.classworlds.launcher.Launcher clean install -Pfull,skipIntegrationTests javadoc:aggregate -Dartifactory.publish.password=********] was 1 while expected 0
21-May-2019 14:38:25 Parsing test results under /opt/bamboo-home/xml-data/build-dir/SCT-STASK-JOB1...
21-May-2019 14:38:25 Finished task 'Build and publish Spring Cloud Task Modules' with result: Failed
21-May-2019 14:38:25 Running post build plugin 'Docker Container Cleanup'
21-May-2019 14:38:25 Running post build plugin 'NCover Results Collector'
21-May-2019 14:38:25 Running post build plugin 'Artifactory Release Management Staging'
21-May-2019 14:38:25 Running post build plugin 'Artifactory Build Info Copier'
21-May-2019 14:38:25 Running post build plugin 'Artifactory Gradle Properties Info Copier'
21-May-2019 14:38:25 Running post build plugin 'Clover Results Collector'
21-May-2019 14:38:25 Running post build plugin 'npm Cache Cleanup'
21-May-2019 14:38:25 Running post build plugin 'Artifact Copier'
21-May-2019 14:38:25 Publishing an artifact: Test Results
21-May-2019 14:38:25 Finished publishing of artifact Shared artifact: [Test Results], pattern: [**/target/surefire-reports/**/*.*] in 118.6 ms
21-May-2019 14:38:25 Successfully removed working directory at '/opt/bamboo-home/xml-data/build-dir/SCT-STASK-JOB1'
21-May-2019 14:38:25 Finalising the build...
21-May-2019 14:38:25 Stopping timer.
21-May-2019 14:38:25 Build SCT-STASK-JOB1-479 completed.
21-May-2019 14:38:25 Running on server: post build plugin 'NCover Results Collector'
21-May-2019 14:38:25 Running on server: post build plugin 'Build Hanging Detection Configuration'
21-May-2019 14:38:25 Running on server: post build plugin 'Clover Delta Calculator'
21-May-2019 14:38:25 Running on server: post build plugin 'Maven Dependencies Postprocessor'
21-May-2019 14:38:25 All post build plugins have finished
21-May-2019 14:38:25 Generating build results summary...
21-May-2019 14:38:26 Saving build results to disk...
21-May-2019 14:38:26 Logging substituted variables...
21-May-2019 14:38:26 Indexing build results...
21-May-2019 14:38:26 Finished building SCT-STASK-JOB1-479.