Build #479

Builds the Spring Cloud Task project

Build: #479 failed

Job: Build Spring Cloud Task Project failed

Stages & jobs

  1. Default Stage

Test results

  • 329 tests in total
  • 1 test failed
  • 1 minute taken in total.

Build 479 has the following 1 errors:There were no new test failures since the previous build.

Existing test failures 1
Status Test Failing since Duration
org.springframework.context.ApplicationContextException: Failed to start bean 'outputBindingLifecycle'; nested exception is org.springframework.beans.factory.BeanCreationException: Error creating bean with name 'rabbitMessageChannelBinder' defined in org.springframework.cloud.stream.binder.rabbit.config.RabbitMessageChannelBinderConfiguration: Bean instantiation via factory method failed; nested exception is org.springframework.beans.BeanInstantiationException: Failed to instantiate [org.springframework.cloud.stream.binder.rabbit.RabbitMessageChannelBinder]: Factory method 'rabbitMessageChannelBinder' threw exception; nested exception is java.lang.NoClassDefFoundError: org/springframework/amqp/rabbit/core/support/BatchingStrategy
	at io.spring.cloud.BatchEventsApplicationTests.testExecution(BatchEventsApplicationTests.java:49)
Caused by: org.springframework.beans.factory.BeanCreationException: Error creating bean with name 'rabbitMessageChannelBinder' defined in org.springframework.cloud.stream.binder.rabbit.config.RabbitMessageChannelBinderConfiguration: Bean instantiation via factory method failed; nested exception is org.springframework.beans.BeanInstantiationException: Failed to instantiate [org.springframework.cloud.stream.binder.rabbit.RabbitMessageChannelBinder]: Factory method 'rabbitMessageChannelBinder' threw exception; nested exception is java.lang.NoClassDefFoundError: org/springframework/amqp/rabbit/core/support/BatchingStrategy
	at io.spring.cloud.BatchEventsApplicationTests.testExecution(BatchEventsApplicationTests.java:49)
Caused by: org.springframework.beans.BeanInstantiationException: Failed to instantiate [org.springframework.cloud.stream.binder.rabbit.RabbitMessageChannelBinder]: Factory method 'rabbitMessageChannelBinder' threw exception; nested exception is java.lang.NoClassDefFoundError: org/springframework/amqp/rabbit/core/support/BatchingStrategy
	at io.spring.cloud.BatchEventsApplicationTests.testExecution(BatchEventsApplicationTests.java:49)
Caused by: java.lang.NoClassDefFoundError: org/springframework/amqp/rabbit/core/support/BatchingStrategy
	at io.spring.cloud.BatchEventsApplicationTests.testExecution(BatchEventsApplicationTests.java:49)
(2 more lines...)