Build #493

Builds the Spring Cloud Task project

Build: #493 failed

Job: Build Spring Cloud Task Project failed

Stages & jobs

  1. Default Stage

Build log

The build generated 16,907 lines of output.The output is too long and has been truncated to the last 1,000 lines. Download or view full build log

17-Jun-2019 03:40:52         at org.springframework.beans.factory.support.AbstractAutowireCapableBeanFactory.createBean(AbstractAutowireCapableBeanFactory.java:516) ~[spring-beans-5.2.0.M3.jar:5.2.0.M3]
17-Jun-2019 03:40:52         at org.springframework.beans.factory.support.AbstractBeanFactory.lambda$doGetBean$0(AbstractBeanFactory.java:320) ~[spring-beans-5.2.0.M3.jar:5.2.0.M3]
17-Jun-2019 03:40:52         at org.springframework.beans.factory.support.DefaultSingletonBeanRegistry.getSingleton(DefaultSingletonBeanRegistry.java:222) ~[spring-beans-5.2.0.M3.jar:5.2.0.M3]
17-Jun-2019 03:40:52         at org.springframework.beans.factory.support.AbstractBeanFactory.doGetBean(AbstractBeanFactory.java:318) ~[spring-beans-5.2.0.M3.jar:5.2.0.M3]
17-Jun-2019 03:40:52         at org.springframework.beans.factory.support.AbstractBeanFactory.getBean(AbstractBeanFactory.java:199) ~[spring-beans-5.2.0.M3.jar:5.2.0.M3]
17-Jun-2019 03:40:52         at org.springframework.beans.factory.support.ConstructorResolver.instantiateUsingFactoryMethod(ConstructorResolver.java:393) ~[spring-beans-5.2.0.M3.jar:5.2.0.M3]
17-Jun-2019 03:40:52         at org.springframework.beans.factory.support.AbstractAutowireCapableBeanFactory.instantiateUsingFactoryMethod(AbstractAutowireCapableBeanFactory.java:1326) ~[spring-beans-5.2.0.M3.jar:5.2.0.M3]
17-Jun-2019 03:40:52         at org.springframework.beans.factory.support.AbstractAutowireCapableBeanFactory.createBeanInstance(AbstractAutowireCapableBeanFactory.java:1165) ~[spring-beans-5.2.0.M3.jar:5.2.0.M3]
17-Jun-2019 03:40:52         at org.springframework.beans.factory.support.AbstractAutowireCapableBeanFactory.doCreateBean(AbstractAutowireCapableBeanFactory.java:556) ~[spring-beans-5.2.0.M3.jar:5.2.0.M3]
17-Jun-2019 03:40:52         at org.springframework.beans.factory.support.AbstractAutowireCapableBeanFactory.createBean(AbstractAutowireCapableBeanFactory.java:516) ~[spring-beans-5.2.0.M3.jar:5.2.0.M3]
17-Jun-2019 03:40:52         at org.springframework.beans.factory.support.AbstractBeanFactory.lambda$doGetBean$0(AbstractBeanFactory.java:320) ~[spring-beans-5.2.0.M3.jar:5.2.0.M3]
17-Jun-2019 03:40:52         at org.springframework.beans.factory.support.DefaultSingletonBeanRegistry.getSingleton(DefaultSingletonBeanRegistry.java:222) ~[spring-beans-5.2.0.M3.jar:5.2.0.M3]
17-Jun-2019 03:40:52         at org.springframework.beans.factory.support.AbstractBeanFactory.doGetBean(AbstractBeanFactory.java:318) ~[spring-beans-5.2.0.M3.jar:5.2.0.M3]
17-Jun-2019 03:40:52         at org.springframework.beans.factory.support.AbstractBeanFactory.getBean(AbstractBeanFactory.java:199) ~[spring-beans-5.2.0.M3.jar:5.2.0.M3]
17-Jun-2019 03:40:52         at org.springframework.beans.factory.support.DefaultListableBeanFactory.preInstantiateSingletons(DefaultListableBeanFactory.java:870) ~[spring-beans-5.2.0.M3.jar:5.2.0.M3]
17-Jun-2019 03:40:52         at org.springframework.context.support.AbstractApplicationContext.finishBeanFactoryInitialization(AbstractApplicationContext.java:877) ~[spring-context-5.2.0.M3.jar:5.2.0.M3]
17-Jun-2019 03:40:52         at org.springframework.context.support.AbstractApplicationContext.refresh(AbstractApplicationContext.java:549) ~[spring-context-5.2.0.M3.jar:5.2.0.M3]
17-Jun-2019 03:40:52         at org.springframework.boot.SpringApplication.refresh(SpringApplication.java:748) ~[spring-boot-2.2.0.BUILD-SNAPSHOT.jar:2.2.0.BUILD-SNAPSHOT]
17-Jun-2019 03:40:52         at org.springframework.boot.SpringApplication.refreshContext(SpringApplication.java:395) ~[spring-boot-2.2.0.BUILD-SNAPSHOT.jar:2.2.0.BUILD-SNAPSHOT]
17-Jun-2019 03:40:52         at org.springframework.boot.SpringApplication.run(SpringApplication.java:314) ~[spring-boot-2.2.0.BUILD-SNAPSHOT.jar:2.2.0.BUILD-SNAPSHOT]
17-Jun-2019 03:40:52         at org.springframework.boot.test.context.SpringBootContextLoader.loadContext(SpringBootContextLoader.java:124) [spring-boot-test-2.2.0.BUILD-SNAPSHOT.jar:2.2.0.BUILD-SNAPSHOT]
17-Jun-2019 03:40:52         at org.springframework.test.context.cache.DefaultCacheAwareContextLoaderDelegate.loadContextInternal(DefaultCacheAwareContextLoaderDelegate.java:99) [spring-test-5.2.0.M3.jar:5.2.0.M3]
17-Jun-2019 03:40:52         at org.springframework.test.context.cache.DefaultCacheAwareContextLoaderDelegate.loadContext(DefaultCacheAwareContextLoaderDelegate.java:124) [spring-test-5.2.0.M3.jar:5.2.0.M3]
17-Jun-2019 03:40:52         at org.springframework.test.context.support.DefaultTestContext.getApplicationContext(DefaultTestContext.java:122) [spring-test-5.2.0.M3.jar:5.2.0.M3]
17-Jun-2019 03:40:52         at org.springframework.test.context.support.DependencyInjectionTestExecutionListener.injectDependencies(DependencyInjectionTestExecutionListener.java:118) [spring-test-5.2.0.M3.jar:5.2.0.M3]
17-Jun-2019 03:40:52         at org.springframework.test.context.support.DependencyInjectionTestExecutionListener.prepareTestInstance(DependencyInjectionTestExecutionListener.java:83) [spring-test-5.2.0.M3.jar:5.2.0.M3]
17-Jun-2019 03:40:52         at org.springframework.boot.test.autoconfigure.SpringBootDependencyInjectionTestExecutionListener.prepareTestInstance(SpringBootDependencyInjectionTestExecutionListener.java:43) [spring-boot-test-autoconfigure-2.2.0.BUILD-SNAPSHOT.jar:2.2.0.BUILD-SNAPSHOT]
17-Jun-2019 03:40:52         at org.springframework.test.context.TestContextManager.prepareTestInstance(TestContextManager.java:244) [spring-test-5.2.0.M3.jar:5.2.0.M3]
17-Jun-2019 03:40:52         at org.springframework.test.context.junit4.SpringJUnit4ClassRunner.createTest(SpringJUnit4ClassRunner.java:227) [spring-test-5.2.0.M3.jar:5.2.0.M3]
17-Jun-2019 03:40:52         at org.springframework.test.context.junit4.SpringJUnit4ClassRunner$1.runReflectiveCall(SpringJUnit4ClassRunner.java:289) [spring-test-5.2.0.M3.jar:5.2.0.M3]
17-Jun-2019 03:40:52         at org.junit.internal.runners.model.ReflectiveCallable.run(ReflectiveCallable.java:12) [junit-4.12.jar:4.12]
17-Jun-2019 03:40:52         at org.springframework.test.context.junit4.SpringJUnit4ClassRunner.methodBlock(SpringJUnit4ClassRunner.java:291) [spring-test-5.2.0.M3.jar:5.2.0.M3]
17-Jun-2019 03:40:52         at org.springframework.test.context.junit4.SpringJUnit4ClassRunner.runChild(SpringJUnit4ClassRunner.java:246) [spring-test-5.2.0.M3.jar:5.2.0.M3]
17-Jun-2019 03:40:52         at org.springframework.test.context.junit4.SpringJUnit4ClassRunner.runChild(SpringJUnit4ClassRunner.java:97) [spring-test-5.2.0.M3.jar:5.2.0.M3]
17-Jun-2019 03:40:52         at org.junit.runners.ParentRunner$3.run(ParentRunner.java:290) [junit-4.12.jar:4.12]
17-Jun-2019 03:40:52         at org.junit.runners.ParentRunner$1.schedule(ParentRunner.java:71) [junit-4.12.jar:4.12]
17-Jun-2019 03:40:52         at org.junit.runners.ParentRunner.runChildren(ParentRunner.java:288) [junit-4.12.jar:4.12]
17-Jun-2019 03:40:52         at org.junit.runners.ParentRunner.access$000(ParentRunner.java:58) [junit-4.12.jar:4.12]
17-Jun-2019 03:40:52         at org.junit.runners.ParentRunner$2.evaluate(ParentRunner.java:268) [junit-4.12.jar:4.12]
17-Jun-2019 03:40:52         at org.springframework.test.context.junit4.statements.RunBeforeTestClassCallbacks.evaluate(RunBeforeTestClassCallbacks.java:61) [spring-test-5.2.0.M3.jar:5.2.0.M3]
17-Jun-2019 03:40:52         at org.springframework.test.context.junit4.statements.RunAfterTestClassCallbacks.evaluate(RunAfterTestClassCallbacks.java:70) [spring-test-5.2.0.M3.jar:5.2.0.M3]
17-Jun-2019 03:40:52         at org.junit.runners.ParentRunner.run(ParentRunner.java:363) [junit-4.12.jar:4.12]
17-Jun-2019 03:40:52         at org.springframework.test.context.junit4.SpringJUnit4ClassRunner.run(SpringJUnit4ClassRunner.java:190) [spring-test-5.2.0.M3.jar:5.2.0.M3]
17-Jun-2019 03:40:52         at org.apache.maven.surefire.junit4.JUnit4Provider.execute(JUnit4Provider.java:252) [surefire-junit4-2.12.4.jar:2.12.4]
17-Jun-2019 03:40:52         at org.apache.maven.surefire.junit4.JUnit4Provider.executeTestSet(JUnit4Provider.java:141) [surefire-junit4-2.12.4.jar:2.12.4]
17-Jun-2019 03:40:52         at org.apache.maven.surefire.junit4.JUnit4Provider.invoke(JUnit4Provider.java:112) [surefire-junit4-2.12.4.jar:2.12.4]
17-Jun-2019 03:40:52         at sun.reflect.NativeMethodAccessorImpl.invoke0(Native Method) ~[na:1.8.0_212]
17-Jun-2019 03:40:52         at sun.reflect.NativeMethodAccessorImpl.invoke(NativeMethodAccessorImpl.java:62) ~[na:1.8.0_212]
17-Jun-2019 03:40:52         at sun.reflect.DelegatingMethodAccessorImpl.invoke(DelegatingMethodAccessorImpl.java:43) ~[na:1.8.0_212]
17-Jun-2019 03:40:52         at java.lang.reflect.Method.invoke(Method.java:498) ~[na:1.8.0_212]
17-Jun-2019 03:40:52         at org.apache.maven.surefire.util.ReflectionUtils.invokeMethodWithArray(ReflectionUtils.java:189) [surefire-api-2.12.4.jar:2.12.4]
17-Jun-2019 03:40:52         at org.apache.maven.surefire.booter.ProviderFactory$ProviderProxy.invoke(ProviderFactory.java:165) [surefire-booter-2.12.4.jar:2.12.4]
17-Jun-2019 03:40:52         at org.apache.maven.surefire.booter.ProviderFactory.invokeProvider(ProviderFactory.java:85) [surefire-booter-2.12.4.jar:2.12.4]
17-Jun-2019 03:40:52         at org.apache.maven.surefire.booter.ForkedBooter.runSuitesInProcess(ForkedBooter.java:115) [surefire-booter-2.12.4.jar:2.12.4]
17-Jun-2019 03:40:52         at org.apache.maven.surefire.booter.ForkedBooter.main(ForkedBooter.java:75) [surefire-booter-2.12.4.jar:2.12.4]
17-Jun-2019 03:40:52 Caused by: java.lang.NoClassDefFoundError: org/springframework/integration/endpoint/Pausable
17-Jun-2019 03:40:52         at java.lang.ClassLoader.defineClass1(Native Method) ~[na:1.8.0_212]
17-Jun-2019 03:40:52         at java.lang.ClassLoader.defineClass(ClassLoader.java:763) ~[na:1.8.0_212]
17-Jun-2019 03:40:52         at java.security.SecureClassLoader.defineClass(SecureClassLoader.java:142) ~[na:1.8.0_212]
17-Jun-2019 03:40:52         at java.net.URLClassLoader.defineClass(URLClassLoader.java:468) ~[na:1.8.0_212]
17-Jun-2019 03:40:52         at java.net.URLClassLoader.access$100(URLClassLoader.java:74) ~[na:1.8.0_212]
17-Jun-2019 03:40:52         at java.net.URLClassLoader$1.run(URLClassLoader.java:369) ~[na:1.8.0_212]
17-Jun-2019 03:40:52         at java.net.URLClassLoader$1.run(URLClassLoader.java:363) ~[na:1.8.0_212]
17-Jun-2019 03:40:52         at java.security.AccessController.doPrivileged(Native Method) ~[na:1.8.0_212]
17-Jun-2019 03:40:52         at java.net.URLClassLoader.findClass(URLClassLoader.java:362) ~[na:1.8.0_212]
17-Jun-2019 03:40:52         at java.lang.ClassLoader.loadClass(ClassLoader.java:424) ~[na:1.8.0_212]
17-Jun-2019 03:40:52         at sun.misc.Launcher$AppClassLoader.loadClass(Launcher.java:349) ~[na:1.8.0_212]
17-Jun-2019 03:40:52         at java.lang.ClassLoader.loadClass(ClassLoader.java:357) ~[na:1.8.0_212]
17-Jun-2019 03:40:52         at java.lang.Class.forName0(Native Method) ~[na:1.8.0_212]
17-Jun-2019 03:40:52         at java.lang.Class.forName(Class.java:348) ~[na:1.8.0_212]
17-Jun-2019 03:40:52         at sun.reflect.generics.factory.CoreReflectionFactory.makeNamedType(CoreReflectionFactory.java:114) ~[na:1.8.0_212]
17-Jun-2019 03:40:52         at sun.reflect.generics.visitor.Reifier.visitClassTypeSignature(Reifier.java:125) ~[na:1.8.0_212]
17-Jun-2019 03:40:52         at sun.reflect.generics.tree.ClassTypeSignature.accept(ClassTypeSignature.java:49) ~[na:1.8.0_212]
17-Jun-2019 03:40:52         at sun.reflect.generics.visitor.Reifier.reifyTypeArguments(Reifier.java:68) ~[na:1.8.0_212]
17-Jun-2019 03:40:52         at sun.reflect.generics.visitor.Reifier.visitClassTypeSignature(Reifier.java:138) ~[na:1.8.0_212]
17-Jun-2019 03:40:52         at sun.reflect.generics.tree.ClassTypeSignature.accept(ClassTypeSignature.java:49) ~[na:1.8.0_212]
17-Jun-2019 03:40:52         at sun.reflect.generics.repository.MethodRepository.getReturnType(MethodRepository.java:68) ~[na:1.8.0_212]
17-Jun-2019 03:40:52         at java.lang.reflect.Method.getGenericReturnType(Method.java:255) ~[na:1.8.0_212]
17-Jun-2019 03:40:52         at java.lang.reflect.Method.specificToGenericStringHeader(Method.java:420) ~[na:1.8.0_212]
17-Jun-2019 03:40:52         at java.lang.reflect.Executable.sharedToGenericString(Executable.java:163) ~[na:1.8.0_212]
17-Jun-2019 03:40:52         at java.lang.reflect.Method.toGenericString(Method.java:415) ~[na:1.8.0_212]
17-Jun-2019 03:40:52         at java.beans.MethodRef.set(MethodRef.java:46) ~[na:1.8.0_212]
17-Jun-2019 03:40:52         at java.beans.MethodDescriptor.setMethod(MethodDescriptor.java:117) ~[na:1.8.0_212]
17-Jun-2019 03:40:52         at java.beans.MethodDescriptor.<init>(MethodDescriptor.java:72) ~[na:1.8.0_212]
17-Jun-2019 03:40:52         at java.beans.MethodDescriptor.<init>(MethodDescriptor.java:56) ~[na:1.8.0_212]
17-Jun-2019 03:40:52         at java.beans.Introspector.getTargetMethodInfo(Introspector.java:1205) ~[na:1.8.0_212]
17-Jun-2019 03:40:52         at java.beans.Introspector.getBeanInfo(Introspector.java:426) ~[na:1.8.0_212]
17-Jun-2019 03:40:52         at java.beans.Introspector.getBeanInfo(Introspector.java:173) ~[na:1.8.0_212]
17-Jun-2019 03:40:52         at org.springframework.beans.CachedIntrospectionResults.getBeanInfo(CachedIntrospectionResults.java:249) ~[spring-beans-5.2.0.M3.jar:5.2.0.M3]
17-Jun-2019 03:40:52         at org.springframework.beans.CachedIntrospectionResults.<init>(CachedIntrospectionResults.java:273) ~[spring-beans-5.2.0.M3.jar:5.2.0.M3]
17-Jun-2019 03:40:52         at org.springframework.beans.CachedIntrospectionResults.forClass(CachedIntrospectionResults.java:177) ~[spring-beans-5.2.0.M3.jar:5.2.0.M3]
17-Jun-2019 03:40:52         at org.springframework.beans.BeanWrapperImpl.getCachedIntrospectionResults(BeanWrapperImpl.java:174) ~[spring-beans-5.2.0.M3.jar:5.2.0.M3]
17-Jun-2019 03:40:52         at org.springframework.beans.BeanWrapperImpl.getPropertyDescriptors(BeanWrapperImpl.java:248) ~[spring-beans-5.2.0.M3.jar:5.2.0.M3]
17-Jun-2019 03:40:52         at org.springframework.beans.factory.support.AbstractAutowireCapableBeanFactory.filterPropertyDescriptorsForDependencyCheck(AbstractAutowireCapableBeanFactory.java:1581) ~[spring-beans-5.2.0.M3.jar:5.2.0.M3]
17-Jun-2019 03:40:52         at org.springframework.beans.factory.support.AbstractAutowireCapableBeanFactory.filterPropertyDescriptorsForDependencyCheck(AbstractAutowireCapableBeanFactory.java:1561) ~[spring-beans-5.2.0.M3.jar:5.2.0.M3]
17-Jun-2019 03:40:52         at org.springframework.beans.factory.support.AbstractAutowireCapableBeanFactory.populateBean(AbstractAutowireCapableBeanFactory.java:1420) ~[spring-beans-5.2.0.M3.jar:5.2.0.M3]
17-Jun-2019 03:40:52         at org.springframework.beans.factory.support.AbstractAutowireCapableBeanFactory.doCreateBean(AbstractAutowireCapableBeanFactory.java:593) ~[spring-beans-5.2.0.M3.jar:5.2.0.M3]
17-Jun-2019 03:40:52         ... 55 common frames omitted
17-Jun-2019 03:40:52 Caused by: java.lang.ClassNotFoundException: org.springframework.integration.endpoint.Pausable
17-Jun-2019 03:40:52         at java.net.URLClassLoader.findClass(URLClassLoader.java:382) ~[na:1.8.0_212]
17-Jun-2019 03:40:52         at java.lang.ClassLoader.loadClass(ClassLoader.java:424) ~[na:1.8.0_212]
17-Jun-2019 03:40:52         at sun.misc.Launcher$AppClassLoader.loadClass(Launcher.java:349) ~[na:1.8.0_212]
17-Jun-2019 03:40:52         at java.lang.ClassLoader.loadClass(ClassLoader.java:357) ~[na:1.8.0_212]
17-Jun-2019 03:40:52         ... 96 common frames omitted
17-Jun-2019 03:40:52
17-Jun-2019 03:40:52
17-Jun-2019 03:40:52   .   ____          _            __ _ _
17-Jun-2019 03:40:52 /\\ / ___'_ __ _ _(_)_ __  __ _ \ \ \ \
17-Jun-2019 03:40:52 ( ( )\___ | '_ | '_| | '_ \/ _` | \ \ \ \
17-Jun-2019 03:40:52 \\/  ___)| |_)| | | | | || (_| |  ) ) ) )
17-Jun-2019 03:40:52   '  |____| .__|_| |_|_| |_\__, | / / / /
17-Jun-2019 03:40:52 =========|_|==============|___/=/_/_/_/
17-Jun-2019 03:40:52 :: Spring Boot ::  (v2.2.0.BUILD-SNAPSHOT)
17-Jun-2019 03:40:52
17-Jun-2019 03:40:52 2019-06-17 03:40:52.525  INFO 31187 --- [           main] o.s.c.t.launcher.TaskLauncherSinkTests   : Starting TaskLauncherSinkTests on bamboo-16 with PID 31187 (started by bamboo in /opt/bamboo-home/xml-data/build-dir/SCT-STASK-JOB1/spring-cloud-task-stream)
17-Jun-2019 03:40:52 2019-06-17 03:40:52.525  INFO 31187 --- [           main] o.s.c.t.launcher.TaskLauncherSinkTests   : No active profile set, falling back to default profiles: default
17-Jun-2019 03:40:52 2019-06-17 03:40:52.614  INFO 31187 --- [           main] o.s.c.a.ConfigurationClassEnhancer       : @Bean method BinderFactoryAutoConfiguration.implicitFunctionBinder is non-static and returns an object assignable to Spring's BeanFactoryPostProcessor interface. This will result in a failure to process annotations such as @Autowired, @Resource and @PostConstruct within the method's declaring @Configuration class. Add the 'static' modifier to this method to avoid these container lifecycle issues; see @Bean javadoc for complete details.
17-Jun-2019 03:40:52 2019-06-17 03:40:52.615  INFO 31187 --- [           main] faultConfiguringBeanFactoryPostProcessor : No bean named 'errorChannel' has been explicitly defined. Therefore, a default PublishSubscribeChannel will be created.
17-Jun-2019 03:40:52 2019-06-17 03:40:52.615  INFO 31187 --- [           main] faultConfiguringBeanFactoryPostProcessor : No bean named 'taskScheduler' has been explicitly defined. Therefore, a default ThreadPoolTaskScheduler will be created.
17-Jun-2019 03:40:52 2019-06-17 03:40:52.616  INFO 31187 --- [           main] faultConfiguringBeanFactoryPostProcessor : No bean named 'integrationHeaderChannelRegistry' has been explicitly defined. Therefore, a default DefaultHeaderChannelRegistry will be created.
17-Jun-2019 03:40:52 2019-06-17 03:40:52.623  INFO 31187 --- [           main] trationDelegate$BeanPostProcessorChecker : Bean 'integrationChannelResolver' of type [org.springframework.integration.support.channel.BeanFactoryChannelResolver] is not eligible for getting processed by all BeanPostProcessors (for example: not eligible for auto-proxying)
17-Jun-2019 03:40:52 2019-06-17 03:40:52.625  INFO 31187 --- [           main] trationDelegate$BeanPostProcessorChecker : Bean 'org.springframework.transaction.annotation.ProxyTransactionManagementConfiguration' of type [org.springframework.transaction.annotation.ProxyTransactionManagementConfiguration$$EnhancerBySpringCGLIB$$e6f6edc] is not eligible for getting processed by all BeanPostProcessors (for example: not eligible for auto-proxying)
17-Jun-2019 03:40:52 2019-06-17 03:40:52.627  INFO 31187 --- [           main] trationDelegate$BeanPostProcessorChecker : Bean 'integrationDisposableAutoCreatedBeans' of type [org.springframework.integration.config.annotation.Disposables] is not eligible for getting processed by all BeanPostProcessors (for example: not eligible for auto-proxying)
17-Jun-2019 03:40:52 2019-06-17 03:40:52.632  INFO 31187 --- [           main] trationDelegate$BeanPostProcessorChecker : Bean 'org.springframework.integration.config.IntegrationManagementConfiguration' of type [org.springframework.integration.config.IntegrationManagementConfiguration$$EnhancerBySpringCGLIB$$79612a0b] is not eligible for getting processed by all BeanPostProcessors (for example: not eligible for auto-proxying)
17-Jun-2019 03:40:52 2019-06-17 03:40:52.700  WARN 31187 --- [           main] s.c.a.AnnotationConfigApplicationContext : Exception encountered during context initialization - cancelling refresh attempt: org.springframework.beans.factory.BeanCreationException: Error creating bean with name 'org.springframework.cloud.stream.messaging.Sink': Initialization of bean failed; nested exception is java.lang.NoClassDefFoundError: org/springframework/integration/endpoint/Pausable
17-Jun-2019 03:40:52 2019-06-17 03:40:52.702  INFO 31187 --- [           main] ConditionEvaluationReportLoggingListener :
17-Jun-2019 03:40:52
17-Jun-2019 03:40:52 Error starting ApplicationContext. To display the conditions report re-run your application with 'debug' enabled.
17-Jun-2019 03:40:52 2019-06-17 03:40:52.703 ERROR 31187 --- [           main] o.s.boot.SpringApplication               : Application run failed
17-Jun-2019 03:40:52
17-Jun-2019 03:40:52 org.springframework.beans.factory.BeanCreationException: Error creating bean with name 'org.springframework.cloud.stream.messaging.Sink': Initialization of bean failed; nested exception is java.lang.NoClassDefFoundError: org/springframework/integration/endpoint/Pausable
17-Jun-2019 03:40:52         at org.springframework.beans.factory.support.AbstractAutowireCapableBeanFactory.doCreateBean(AbstractAutowireCapableBeanFactory.java:602) ~[spring-beans-5.2.0.M3.jar:5.2.0.M3]
17-Jun-2019 03:40:52         at org.springframework.beans.factory.support.AbstractAutowireCapableBeanFactory.createBean(AbstractAutowireCapableBeanFactory.java:516) ~[spring-beans-5.2.0.M3.jar:5.2.0.M3]
17-Jun-2019 03:40:52         at org.springframework.beans.factory.support.AbstractBeanFactory.lambda$doGetBean$0(AbstractBeanFactory.java:320) ~[spring-beans-5.2.0.M3.jar:5.2.0.M3]
17-Jun-2019 03:40:52         at org.springframework.beans.factory.support.DefaultSingletonBeanRegistry.getSingleton(DefaultSingletonBeanRegistry.java:222) ~[spring-beans-5.2.0.M3.jar:5.2.0.M3]
17-Jun-2019 03:40:52         at org.springframework.beans.factory.support.AbstractBeanFactory.doGetBean(AbstractBeanFactory.java:318) ~[spring-beans-5.2.0.M3.jar:5.2.0.M3]
17-Jun-2019 03:40:52         at org.springframework.beans.factory.support.AbstractBeanFactory.getBean(AbstractBeanFactory.java:199) ~[spring-beans-5.2.0.M3.jar:5.2.0.M3]
17-Jun-2019 03:40:52         at org.springframework.beans.factory.support.ConstructorResolver.instantiateUsingFactoryMethod(ConstructorResolver.java:393) ~[spring-beans-5.2.0.M3.jar:5.2.0.M3]
17-Jun-2019 03:40:52         at org.springframework.beans.factory.support.AbstractAutowireCapableBeanFactory.instantiateUsingFactoryMethod(AbstractAutowireCapableBeanFactory.java:1326) ~[spring-beans-5.2.0.M3.jar:5.2.0.M3]
17-Jun-2019 03:40:52         at org.springframework.beans.factory.support.AbstractAutowireCapableBeanFactory.createBeanInstance(AbstractAutowireCapableBeanFactory.java:1165) ~[spring-beans-5.2.0.M3.jar:5.2.0.M3]
17-Jun-2019 03:40:52         at org.springframework.beans.factory.support.AbstractAutowireCapableBeanFactory.doCreateBean(AbstractAutowireCapableBeanFactory.java:556) ~[spring-beans-5.2.0.M3.jar:5.2.0.M3]
17-Jun-2019 03:40:52         at org.springframework.beans.factory.support.AbstractAutowireCapableBeanFactory.createBean(AbstractAutowireCapableBeanFactory.java:516) ~[spring-beans-5.2.0.M3.jar:5.2.0.M3]
17-Jun-2019 03:40:52         at org.springframework.beans.factory.support.AbstractBeanFactory.lambda$doGetBean$0(AbstractBeanFactory.java:320) ~[spring-beans-5.2.0.M3.jar:5.2.0.M3]
17-Jun-2019 03:40:52         at org.springframework.beans.factory.support.DefaultSingletonBeanRegistry.getSingleton(DefaultSingletonBeanRegistry.java:222) ~[spring-beans-5.2.0.M3.jar:5.2.0.M3]
17-Jun-2019 03:40:52         at org.springframework.beans.factory.support.AbstractBeanFactory.doGetBean(AbstractBeanFactory.java:318) ~[spring-beans-5.2.0.M3.jar:5.2.0.M3]
17-Jun-2019 03:40:52         at org.springframework.beans.factory.support.AbstractBeanFactory.getBean(AbstractBeanFactory.java:199) ~[spring-beans-5.2.0.M3.jar:5.2.0.M3]
17-Jun-2019 03:40:52         at org.springframework.beans.factory.support.DefaultListableBeanFactory.preInstantiateSingletons(DefaultListableBeanFactory.java:870) ~[spring-beans-5.2.0.M3.jar:5.2.0.M3]
17-Jun-2019 03:40:52         at org.springframework.context.support.AbstractApplicationContext.finishBeanFactoryInitialization(AbstractApplicationContext.java:877) ~[spring-context-5.2.0.M3.jar:5.2.0.M3]
17-Jun-2019 03:40:52         at org.springframework.context.support.AbstractApplicationContext.refresh(AbstractApplicationContext.java:549) ~[spring-context-5.2.0.M3.jar:5.2.0.M3]
17-Jun-2019 03:40:52         at org.springframework.boot.SpringApplication.refresh(SpringApplication.java:748) ~[spring-boot-2.2.0.BUILD-SNAPSHOT.jar:2.2.0.BUILD-SNAPSHOT]
17-Jun-2019 03:40:52         at org.springframework.boot.SpringApplication.refreshContext(SpringApplication.java:395) ~[spring-boot-2.2.0.BUILD-SNAPSHOT.jar:2.2.0.BUILD-SNAPSHOT]
17-Jun-2019 03:40:52         at org.springframework.boot.SpringApplication.run(SpringApplication.java:314) ~[spring-boot-2.2.0.BUILD-SNAPSHOT.jar:2.2.0.BUILD-SNAPSHOT]
17-Jun-2019 03:40:52         at org.springframework.boot.test.context.SpringBootContextLoader.loadContext(SpringBootContextLoader.java:124) [spring-boot-test-2.2.0.BUILD-SNAPSHOT.jar:2.2.0.BUILD-SNAPSHOT]
17-Jun-2019 03:40:52         at org.springframework.test.context.cache.DefaultCacheAwareContextLoaderDelegate.loadContextInternal(DefaultCacheAwareContextLoaderDelegate.java:99) [spring-test-5.2.0.M3.jar:5.2.0.M3]
17-Jun-2019 03:40:52         at org.springframework.test.context.cache.DefaultCacheAwareContextLoaderDelegate.loadContext(DefaultCacheAwareContextLoaderDelegate.java:124) [spring-test-5.2.0.M3.jar:5.2.0.M3]
17-Jun-2019 03:40:52         at org.springframework.test.context.support.DefaultTestContext.getApplicationContext(DefaultTestContext.java:122) [spring-test-5.2.0.M3.jar:5.2.0.M3]
17-Jun-2019 03:40:52         at org.springframework.boot.test.autoconfigure.SpringBootDependencyInjectionTestExecutionListener.outputConditionEvaluationReport(SpringBootDependencyInjectionTestExecutionListener.java:53) [spring-boot-test-autoconfigure-2.2.0.BUILD-SNAPSHOT.jar:2.2.0.BUILD-SNAPSHOT]
17-Jun-2019 03:40:52         at org.springframework.boot.test.autoconfigure.SpringBootDependencyInjectionTestExecutionListener.prepareTestInstance(SpringBootDependencyInjectionTestExecutionListener.java:46) [spring-boot-test-autoconfigure-2.2.0.BUILD-SNAPSHOT.jar:2.2.0.BUILD-SNAPSHOT]
17-Jun-2019 03:40:52         at org.springframework.test.context.TestContextManager.prepareTestInstance(TestContextManager.java:244) [spring-test-5.2.0.M3.jar:5.2.0.M3]
17-Jun-2019 03:40:52         at org.springframework.test.context.junit4.SpringJUnit4ClassRunner.createTest(SpringJUnit4ClassRunner.java:227) [spring-test-5.2.0.M3.jar:5.2.0.M3]
17-Jun-2019 03:40:52         at org.springframework.test.context.junit4.SpringJUnit4ClassRunner$1.runReflectiveCall(SpringJUnit4ClassRunner.java:289) [spring-test-5.2.0.M3.jar:5.2.0.M3]
17-Jun-2019 03:40:52         at org.junit.internal.runners.model.ReflectiveCallable.run(ReflectiveCallable.java:12) [junit-4.12.jar:4.12]
17-Jun-2019 03:40:52         at org.springframework.test.context.junit4.SpringJUnit4ClassRunner.methodBlock(SpringJUnit4ClassRunner.java:291) [spring-test-5.2.0.M3.jar:5.2.0.M3]
17-Jun-2019 03:40:52         at org.springframework.test.context.junit4.SpringJUnit4ClassRunner.runChild(SpringJUnit4ClassRunner.java:246) [spring-test-5.2.0.M3.jar:5.2.0.M3]
17-Jun-2019 03:40:52         at org.springframework.test.context.junit4.SpringJUnit4ClassRunner.runChild(SpringJUnit4ClassRunner.java:97) [spring-test-5.2.0.M3.jar:5.2.0.M3]
17-Jun-2019 03:40:52         at org.junit.runners.ParentRunner$3.run(ParentRunner.java:290) [junit-4.12.jar:4.12]
17-Jun-2019 03:40:52         at org.junit.runners.ParentRunner$1.schedule(ParentRunner.java:71) [junit-4.12.jar:4.12]
17-Jun-2019 03:40:52         at org.junit.runners.ParentRunner.runChildren(ParentRunner.java:288) [junit-4.12.jar:4.12]
17-Jun-2019 03:40:52         at org.junit.runners.ParentRunner.access$000(ParentRunner.java:58) [junit-4.12.jar:4.12]
17-Jun-2019 03:40:52         at org.junit.runners.ParentRunner$2.evaluate(ParentRunner.java:268) [junit-4.12.jar:4.12]
17-Jun-2019 03:40:52         at org.springframework.test.context.junit4.statements.RunBeforeTestClassCallbacks.evaluate(RunBeforeTestClassCallbacks.java:61) [spring-test-5.2.0.M3.jar:5.2.0.M3]
17-Jun-2019 03:40:52         at org.springframework.test.context.junit4.statements.RunAfterTestClassCallbacks.evaluate(RunAfterTestClassCallbacks.java:70) [spring-test-5.2.0.M3.jar:5.2.0.M3]
17-Jun-2019 03:40:52         at org.junit.runners.ParentRunner.run(ParentRunner.java:363) [junit-4.12.jar:4.12]
17-Jun-2019 03:40:52         at org.springframework.test.context.junit4.SpringJUnit4ClassRunner.run(SpringJUnit4ClassRunner.java:190) [spring-test-5.2.0.M3.jar:5.2.0.M3]
17-Jun-2019 03:40:52         at org.apache.maven.surefire.junit4.JUnit4Provider.execute(JUnit4Provider.java:252) [surefire-junit4-2.12.4.jar:2.12.4]
17-Jun-2019 03:40:52         at org.apache.maven.surefire.junit4.JUnit4Provider.executeTestSet(JUnit4Provider.java:141) [surefire-junit4-2.12.4.jar:2.12.4]
17-Jun-2019 03:40:52         at org.apache.maven.surefire.junit4.JUnit4Provider.invoke(JUnit4Provider.java:112) [surefire-junit4-2.12.4.jar:2.12.4]
17-Jun-2019 03:40:52         at sun.reflect.NativeMethodAccessorImpl.invoke0(Native Method) ~[na:1.8.0_212]
17-Jun-2019 03:40:52         at sun.reflect.NativeMethodAccessorImpl.invoke(NativeMethodAccessorImpl.java:62) ~[na:1.8.0_212]
17-Jun-2019 03:40:52         at sun.reflect.DelegatingMethodAccessorImpl.invoke(DelegatingMethodAccessorImpl.java:43) ~[na:1.8.0_212]
17-Jun-2019 03:40:52         at java.lang.reflect.Method.invoke(Method.java:498) ~[na:1.8.0_212]
17-Jun-2019 03:40:52         at org.apache.maven.surefire.util.ReflectionUtils.invokeMethodWithArray(ReflectionUtils.java:189) [surefire-api-2.12.4.jar:2.12.4]
17-Jun-2019 03:40:52         at org.apache.maven.surefire.booter.ProviderFactory$ProviderProxy.invoke(ProviderFactory.java:165) [surefire-booter-2.12.4.jar:2.12.4]
17-Jun-2019 03:40:52         at org.apache.maven.surefire.booter.ProviderFactory.invokeProvider(ProviderFactory.java:85) [surefire-booter-2.12.4.jar:2.12.4]
17-Jun-2019 03:40:52         at org.apache.maven.surefire.booter.ForkedBooter.runSuitesInProcess(ForkedBooter.java:115) [surefire-booter-2.12.4.jar:2.12.4]
17-Jun-2019 03:40:52         at org.apache.maven.surefire.booter.ForkedBooter.main(ForkedBooter.java:75) [surefire-booter-2.12.4.jar:2.12.4]
17-Jun-2019 03:40:52 Caused by: java.lang.NoClassDefFoundError: org/springframework/integration/endpoint/Pausable
17-Jun-2019 03:40:52         at java.lang.ClassLoader.defineClass1(Native Method) ~[na:1.8.0_212]
17-Jun-2019 03:40:52         at java.lang.ClassLoader.defineClass(ClassLoader.java:763) ~[na:1.8.0_212]
17-Jun-2019 03:40:52         at java.security.SecureClassLoader.defineClass(SecureClassLoader.java:142) ~[na:1.8.0_212]
17-Jun-2019 03:40:52         at java.net.URLClassLoader.defineClass(URLClassLoader.java:468) ~[na:1.8.0_212]
17-Jun-2019 03:40:52         at java.net.URLClassLoader.access$100(URLClassLoader.java:74) ~[na:1.8.0_212]
17-Jun-2019 03:40:52         at java.net.URLClassLoader$1.run(URLClassLoader.java:369) ~[na:1.8.0_212]
17-Jun-2019 03:40:52         at java.net.URLClassLoader$1.run(URLClassLoader.java:363) ~[na:1.8.0_212]
17-Jun-2019 03:40:52         at java.security.AccessController.doPrivileged(Native Method) ~[na:1.8.0_212]
17-Jun-2019 03:40:52         at java.net.URLClassLoader.findClass(URLClassLoader.java:362) ~[na:1.8.0_212]
17-Jun-2019 03:40:52         at java.lang.ClassLoader.loadClass(ClassLoader.java:424) ~[na:1.8.0_212]
17-Jun-2019 03:40:52         at sun.misc.Launcher$AppClassLoader.loadClass(Launcher.java:349) ~[na:1.8.0_212]
17-Jun-2019 03:40:52         at java.lang.ClassLoader.loadClass(ClassLoader.java:357) ~[na:1.8.0_212]
17-Jun-2019 03:40:52         at java.lang.Class.forName0(Native Method) ~[na:1.8.0_212]
17-Jun-2019 03:40:52         at java.lang.Class.forName(Class.java:348) ~[na:1.8.0_212]
17-Jun-2019 03:40:52         at sun.reflect.generics.factory.CoreReflectionFactory.makeNamedType(CoreReflectionFactory.java:114) ~[na:1.8.0_212]
17-Jun-2019 03:40:52         at sun.reflect.generics.visitor.Reifier.visitClassTypeSignature(Reifier.java:125) ~[na:1.8.0_212]
17-Jun-2019 03:40:52         at sun.reflect.generics.tree.ClassTypeSignature.accept(ClassTypeSignature.java:49) ~[na:1.8.0_212]
17-Jun-2019 03:40:52         at sun.reflect.generics.visitor.Reifier.reifyTypeArguments(Reifier.java:68) ~[na:1.8.0_212]
17-Jun-2019 03:40:52         at sun.reflect.generics.visitor.Reifier.visitClassTypeSignature(Reifier.java:138) ~[na:1.8.0_212]
17-Jun-2019 03:40:52         at sun.reflect.generics.tree.ClassTypeSignature.accept(ClassTypeSignature.java:49) ~[na:1.8.0_212]
17-Jun-2019 03:40:52         at sun.reflect.generics.repository.MethodRepository.getReturnType(MethodRepository.java:68) ~[na:1.8.0_212]
17-Jun-2019 03:40:52         at java.lang.reflect.Method.getGenericReturnType(Method.java:255) ~[na:1.8.0_212]
17-Jun-2019 03:40:52         at java.lang.reflect.Method.specificToGenericStringHeader(Method.java:420) ~[na:1.8.0_212]
17-Jun-2019 03:40:52         at java.lang.reflect.Executable.sharedToGenericString(Executable.java:163) ~[na:1.8.0_212]
17-Jun-2019 03:40:52         at java.lang.reflect.Method.toGenericString(Method.java:415) ~[na:1.8.0_212]
17-Jun-2019 03:40:52         at java.beans.MethodRef.set(MethodRef.java:46) ~[na:1.8.0_212]
17-Jun-2019 03:40:52         at java.beans.MethodDescriptor.setMethod(MethodDescriptor.java:117) ~[na:1.8.0_212]
17-Jun-2019 03:40:52         at java.beans.MethodDescriptor.<init>(MethodDescriptor.java:72) ~[na:1.8.0_212]
17-Jun-2019 03:40:52         at java.beans.MethodDescriptor.<init>(MethodDescriptor.java:56) ~[na:1.8.0_212]
17-Jun-2019 03:40:52         at java.beans.Introspector.getTargetMethodInfo(Introspector.java:1205) ~[na:1.8.0_212]
17-Jun-2019 03:40:52         at java.beans.Introspector.getBeanInfo(Introspector.java:426) ~[na:1.8.0_212]
17-Jun-2019 03:40:52         at java.beans.Introspector.getBeanInfo(Introspector.java:173) ~[na:1.8.0_212]
17-Jun-2019 03:40:52         at org.springframework.beans.CachedIntrospectionResults.getBeanInfo(CachedIntrospectionResults.java:249) ~[spring-beans-5.2.0.M3.jar:5.2.0.M3]
17-Jun-2019 03:40:52         at org.springframework.beans.CachedIntrospectionResults.<init>(CachedIntrospectionResults.java:273) ~[spring-beans-5.2.0.M3.jar:5.2.0.M3]
17-Jun-2019 03:40:52         at org.springframework.beans.CachedIntrospectionResults.forClass(CachedIntrospectionResults.java:177) ~[spring-beans-5.2.0.M3.jar:5.2.0.M3]
17-Jun-2019 03:40:52         at org.springframework.beans.BeanWrapperImpl.getCachedIntrospectionResults(BeanWrapperImpl.java:174) ~[spring-beans-5.2.0.M3.jar:5.2.0.M3]
17-Jun-2019 03:40:52         at org.springframework.beans.BeanWrapperImpl.getPropertyDescriptors(BeanWrapperImpl.java:248) ~[spring-beans-5.2.0.M3.jar:5.2.0.M3]
17-Jun-2019 03:40:52         at org.springframework.beans.factory.support.AbstractAutowireCapableBeanFactory.filterPropertyDescriptorsForDependencyCheck(AbstractAutowireCapableBeanFactory.java:1581) ~[spring-beans-5.2.0.M3.jar:5.2.0.M3]
17-Jun-2019 03:40:52         at org.springframework.beans.factory.support.AbstractAutowireCapableBeanFactory.filterPropertyDescriptorsForDependencyCheck(AbstractAutowireCapableBeanFactory.java:1561) ~[spring-beans-5.2.0.M3.jar:5.2.0.M3]
17-Jun-2019 03:40:52         at org.springframework.beans.factory.support.AbstractAutowireCapableBeanFactory.populateBean(AbstractAutowireCapableBeanFactory.java:1420) ~[spring-beans-5.2.0.M3.jar:5.2.0.M3]
17-Jun-2019 03:40:52         at org.springframework.beans.factory.support.AbstractAutowireCapableBeanFactory.doCreateBean(AbstractAutowireCapableBeanFactory.java:593) ~[spring-beans-5.2.0.M3.jar:5.2.0.M3]
17-Jun-2019 03:40:52         ... 54 common frames omitted
17-Jun-2019 03:40:52 Caused by: java.lang.ClassNotFoundException: org.springframework.integration.endpoint.Pausable
17-Jun-2019 03:40:52         at java.net.URLClassLoader.findClass(URLClassLoader.java:382) ~[na:1.8.0_212]
17-Jun-2019 03:40:52         at java.lang.ClassLoader.loadClass(ClassLoader.java:424) ~[na:1.8.0_212]
17-Jun-2019 03:40:52         at sun.misc.Launcher$AppClassLoader.loadClass(Launcher.java:349) ~[na:1.8.0_212]
17-Jun-2019 03:40:52         at java.lang.ClassLoader.loadClass(ClassLoader.java:357) ~[na:1.8.0_212]
17-Jun-2019 03:40:52         ... 95 common frames omitted
17-Jun-2019 03:40:52
17-Jun-2019 03:40:52 2019-06-17 03:40:52.704 ERROR 31187 --- [           main] o.s.test.context.TestContextManager      : Caught exception while allowing TestExecutionListener [org.springframework.boot.test.autoconfigure.SpringBootDependencyInjectionTestExecutionListener@33580d49] to prepare test instance [org.springframework.cloud.task.launcher.TaskLauncherSinkTests@60f7d923]
17-Jun-2019 03:40:52
17-Jun-2019 03:40:52 java.lang.IllegalStateException: Failed to load ApplicationContext
17-Jun-2019 03:40:52         at org.springframework.test.context.cache.DefaultCacheAwareContextLoaderDelegate.loadContext(DefaultCacheAwareContextLoaderDelegate.java:132) ~[spring-test-5.2.0.M3.jar:5.2.0.M3]
17-Jun-2019 03:40:52         at org.springframework.test.context.support.DefaultTestContext.getApplicationContext(DefaultTestContext.java:122) ~[spring-test-5.2.0.M3.jar:5.2.0.M3]
17-Jun-2019 03:40:52         at org.springframework.test.context.support.DependencyInjectionTestExecutionListener.injectDependencies(DependencyInjectionTestExecutionListener.java:118) ~[spring-test-5.2.0.M3.jar:5.2.0.M3]
17-Jun-2019 03:40:52         at org.springframework.test.context.support.DependencyInjectionTestExecutionListener.prepareTestInstance(DependencyInjectionTestExecutionListener.java:83) ~[spring-test-5.2.0.M3.jar:5.2.0.M3]
17-Jun-2019 03:40:52         at org.springframework.boot.test.autoconfigure.SpringBootDependencyInjectionTestExecutionListener.prepareTestInstance(SpringBootDependencyInjectionTestExecutionListener.java:43) ~[spring-boot-test-autoconfigure-2.2.0.BUILD-SNAPSHOT.jar:2.2.0.BUILD-SNAPSHOT]
17-Jun-2019 03:40:52         at org.springframework.test.context.TestContextManager.prepareTestInstance(TestContextManager.java:244) ~[spring-test-5.2.0.M3.jar:5.2.0.M3]
17-Jun-2019 03:40:52         at org.springframework.test.context.junit4.SpringJUnit4ClassRunner.createTest(SpringJUnit4ClassRunner.java:227) [spring-test-5.2.0.M3.jar:5.2.0.M3]
17-Jun-2019 03:40:52         at org.springframework.test.context.junit4.SpringJUnit4ClassRunner$1.runReflectiveCall(SpringJUnit4ClassRunner.java:289) [spring-test-5.2.0.M3.jar:5.2.0.M3]
17-Jun-2019 03:40:52         at org.junit.internal.runners.model.ReflectiveCallable.run(ReflectiveCallable.java:12) [junit-4.12.jar:4.12]
17-Jun-2019 03:40:52         at org.springframework.test.context.junit4.SpringJUnit4ClassRunner.methodBlock(SpringJUnit4ClassRunner.java:291) [spring-test-5.2.0.M3.jar:5.2.0.M3]
17-Jun-2019 03:40:52         at org.springframework.test.context.junit4.SpringJUnit4ClassRunner.runChild(SpringJUnit4ClassRunner.java:246) [spring-test-5.2.0.M3.jar:5.2.0.M3]
17-Jun-2019 03:40:52         at org.springframework.test.context.junit4.SpringJUnit4ClassRunner.runChild(SpringJUnit4ClassRunner.java:97) [spring-test-5.2.0.M3.jar:5.2.0.M3]
17-Jun-2019 03:40:52         at org.junit.runners.ParentRunner$3.run(ParentRunner.java:290) [junit-4.12.jar:4.12]
17-Jun-2019 03:40:52         at org.junit.runners.ParentRunner$1.schedule(ParentRunner.java:71) [junit-4.12.jar:4.12]
17-Jun-2019 03:40:52         at org.junit.runners.ParentRunner.runChildren(ParentRunner.java:288) [junit-4.12.jar:4.12]
17-Jun-2019 03:40:52         at org.junit.runners.ParentRunner.access$000(ParentRunner.java:58) [junit-4.12.jar:4.12]
17-Jun-2019 03:40:52         at org.junit.runners.ParentRunner$2.evaluate(ParentRunner.java:268) [junit-4.12.jar:4.12]
17-Jun-2019 03:40:52         at org.springframework.test.context.junit4.statements.RunBeforeTestClassCallbacks.evaluate(RunBeforeTestClassCallbacks.java:61) [spring-test-5.2.0.M3.jar:5.2.0.M3]
17-Jun-2019 03:40:52         at org.springframework.test.context.junit4.statements.RunAfterTestClassCallbacks.evaluate(RunAfterTestClassCallbacks.java:70) [spring-test-5.2.0.M3.jar:5.2.0.M3]
17-Jun-2019 03:40:52         at org.junit.runners.ParentRunner.run(ParentRunner.java:363) [junit-4.12.jar:4.12]
17-Jun-2019 03:40:52         at org.springframework.test.context.junit4.SpringJUnit4ClassRunner.run(SpringJUnit4ClassRunner.java:190) [spring-test-5.2.0.M3.jar:5.2.0.M3]
17-Jun-2019 03:40:52         at org.apache.maven.surefire.junit4.JUnit4Provider.execute(JUnit4Provider.java:252) [surefire-junit4-2.12.4.jar:2.12.4]
17-Jun-2019 03:40:52         at org.apache.maven.surefire.junit4.JUnit4Provider.executeTestSet(JUnit4Provider.java:141) [surefire-junit4-2.12.4.jar:2.12.4]
17-Jun-2019 03:40:52         at org.apache.maven.surefire.junit4.JUnit4Provider.invoke(JUnit4Provider.java:112) [surefire-junit4-2.12.4.jar:2.12.4]
17-Jun-2019 03:40:52         at sun.reflect.NativeMethodAccessorImpl.invoke0(Native Method) ~[na:1.8.0_212]
17-Jun-2019 03:40:52         at sun.reflect.NativeMethodAccessorImpl.invoke(NativeMethodAccessorImpl.java:62) ~[na:1.8.0_212]
17-Jun-2019 03:40:52         at sun.reflect.DelegatingMethodAccessorImpl.invoke(DelegatingMethodAccessorImpl.java:43) ~[na:1.8.0_212]
17-Jun-2019 03:40:52         at java.lang.reflect.Method.invoke(Method.java:498) ~[na:1.8.0_212]
17-Jun-2019 03:40:52         at org.apache.maven.surefire.util.ReflectionUtils.invokeMethodWithArray(ReflectionUtils.java:189) [surefire-api-2.12.4.jar:2.12.4]
17-Jun-2019 03:40:52         at org.apache.maven.surefire.booter.ProviderFactory$ProviderProxy.invoke(ProviderFactory.java:165) [surefire-booter-2.12.4.jar:2.12.4]
17-Jun-2019 03:40:52         at org.apache.maven.surefire.booter.ProviderFactory.invokeProvider(ProviderFactory.java:85) [surefire-booter-2.12.4.jar:2.12.4]
17-Jun-2019 03:40:52         at org.apache.maven.surefire.booter.ForkedBooter.runSuitesInProcess(ForkedBooter.java:115) [surefire-booter-2.12.4.jar:2.12.4]
17-Jun-2019 03:40:52         at org.apache.maven.surefire.booter.ForkedBooter.main(ForkedBooter.java:75) [surefire-booter-2.12.4.jar:2.12.4]
17-Jun-2019 03:40:52 Caused by: org.springframework.beans.factory.BeanCreationException: Error creating bean with name 'org.springframework.cloud.stream.messaging.Sink': Initialization of bean failed; nested exception is java.lang.NoClassDefFoundError: org/springframework/integration/endpoint/Pausable
17-Jun-2019 03:40:52         at org.springframework.beans.factory.support.AbstractAutowireCapableBeanFactory.doCreateBean(AbstractAutowireCapableBeanFactory.java:602) ~[spring-beans-5.2.0.M3.jar:5.2.0.M3]
17-Jun-2019 03:40:52         at org.springframework.beans.factory.support.AbstractAutowireCapableBeanFactory.createBean(AbstractAutowireCapableBeanFactory.java:516) ~[spring-beans-5.2.0.M3.jar:5.2.0.M3]
17-Jun-2019 03:40:52         at org.springframework.beans.factory.support.AbstractBeanFactory.lambda$doGetBean$0(AbstractBeanFactory.java:320) ~[spring-beans-5.2.0.M3.jar:5.2.0.M3]
17-Jun-2019 03:40:52         at org.springframework.beans.factory.support.DefaultSingletonBeanRegistry.getSingleton(DefaultSingletonBeanRegistry.java:222) ~[spring-beans-5.2.0.M3.jar:5.2.0.M3]
17-Jun-2019 03:40:52         at org.springframework.beans.factory.support.AbstractBeanFactory.doGetBean(AbstractBeanFactory.java:318) ~[spring-beans-5.2.0.M3.jar:5.2.0.M3]
17-Jun-2019 03:40:52         at org.springframework.beans.factory.support.AbstractBeanFactory.getBean(AbstractBeanFactory.java:199) ~[spring-beans-5.2.0.M3.jar:5.2.0.M3]
17-Jun-2019 03:40:52         at org.springframework.beans.factory.support.ConstructorResolver.instantiateUsingFactoryMethod(ConstructorResolver.java:393) ~[spring-beans-5.2.0.M3.jar:5.2.0.M3]
17-Jun-2019 03:40:52         at org.springframework.beans.factory.support.AbstractAutowireCapableBeanFactory.instantiateUsingFactoryMethod(AbstractAutowireCapableBeanFactory.java:1326) ~[spring-beans-5.2.0.M3.jar:5.2.0.M3]
17-Jun-2019 03:40:52         at org.springframework.beans.factory.support.AbstractAutowireCapableBeanFactory.createBeanInstance(AbstractAutowireCapableBeanFactory.java:1165) ~[spring-beans-5.2.0.M3.jar:5.2.0.M3]
17-Jun-2019 03:40:52         at org.springframework.beans.factory.support.AbstractAutowireCapableBeanFactory.doCreateBean(AbstractAutowireCapableBeanFactory.java:556) ~[spring-beans-5.2.0.M3.jar:5.2.0.M3]
17-Jun-2019 03:40:52         at org.springframework.beans.factory.support.AbstractAutowireCapableBeanFactory.createBean(AbstractAutowireCapableBeanFactory.java:516) ~[spring-beans-5.2.0.M3.jar:5.2.0.M3]
17-Jun-2019 03:40:52         at org.springframework.beans.factory.support.AbstractBeanFactory.lambda$doGetBean$0(AbstractBeanFactory.java:320) ~[spring-beans-5.2.0.M3.jar:5.2.0.M3]
17-Jun-2019 03:40:52         at org.springframework.beans.factory.support.DefaultSingletonBeanRegistry.getSingleton(DefaultSingletonBeanRegistry.java:222) ~[spring-beans-5.2.0.M3.jar:5.2.0.M3]
17-Jun-2019 03:40:52         at org.springframework.beans.factory.support.AbstractBeanFactory.doGetBean(AbstractBeanFactory.java:318) ~[spring-beans-5.2.0.M3.jar:5.2.0.M3]
17-Jun-2019 03:40:52         at org.springframework.beans.factory.support.AbstractBeanFactory.getBean(AbstractBeanFactory.java:199) ~[spring-beans-5.2.0.M3.jar:5.2.0.M3]
17-Jun-2019 03:40:52         at org.springframework.beans.factory.support.DefaultListableBeanFactory.preInstantiateSingletons(DefaultListableBeanFactory.java:870) ~[spring-beans-5.2.0.M3.jar:5.2.0.M3]
17-Jun-2019 03:40:52         at org.springframework.context.support.AbstractApplicationContext.finishBeanFactoryInitialization(AbstractApplicationContext.java:877) ~[spring-context-5.2.0.M3.jar:5.2.0.M3]
17-Jun-2019 03:40:52         at org.springframework.context.support.AbstractApplicationContext.refresh(AbstractApplicationContext.java:549) ~[spring-context-5.2.0.M3.jar:5.2.0.M3]
17-Jun-2019 03:40:52         at org.springframework.boot.SpringApplication.refresh(SpringApplication.java:748) ~[spring-boot-2.2.0.BUILD-SNAPSHOT.jar:2.2.0.BUILD-SNAPSHOT]
17-Jun-2019 03:40:52         at org.springframework.boot.SpringApplication.refreshContext(SpringApplication.java:395) ~[spring-boot-2.2.0.BUILD-SNAPSHOT.jar:2.2.0.BUILD-SNAPSHOT]
17-Jun-2019 03:40:52         at org.springframework.boot.SpringApplication.run(SpringApplication.java:314) ~[spring-boot-2.2.0.BUILD-SNAPSHOT.jar:2.2.0.BUILD-SNAPSHOT]
17-Jun-2019 03:40:52         at org.springframework.boot.test.context.SpringBootContextLoader.loadContext(SpringBootContextLoader.java:124) ~[spring-boot-test-2.2.0.BUILD-SNAPSHOT.jar:2.2.0.BUILD-SNAPSHOT]
17-Jun-2019 03:40:52         at org.springframework.test.context.cache.DefaultCacheAwareContextLoaderDelegate.loadContextInternal(DefaultCacheAwareContextLoaderDelegate.java:99) ~[spring-test-5.2.0.M3.jar:5.2.0.M3]
17-Jun-2019 03:40:52         at org.springframework.test.context.cache.DefaultCacheAwareContextLoaderDelegate.loadContext(DefaultCacheAwareContextLoaderDelegate.java:124) ~[spring-test-5.2.0.M3.jar:5.2.0.M3]
17-Jun-2019 03:40:52         ... 32 common frames omitted
17-Jun-2019 03:40:52 Caused by: java.lang.NoClassDefFoundError: org/springframework/integration/endpoint/Pausable
17-Jun-2019 03:40:52         at java.lang.ClassLoader.defineClass1(Native Method) ~[na:1.8.0_212]
17-Jun-2019 03:40:52         at java.lang.ClassLoader.defineClass(ClassLoader.java:763) ~[na:1.8.0_212]
17-Jun-2019 03:40:52         at java.security.SecureClassLoader.defineClass(SecureClassLoader.java:142) ~[na:1.8.0_212]
17-Jun-2019 03:40:52         at java.net.URLClassLoader.defineClass(URLClassLoader.java:468) ~[na:1.8.0_212]
17-Jun-2019 03:40:52         at java.net.URLClassLoader.access$100(URLClassLoader.java:74) ~[na:1.8.0_212]
17-Jun-2019 03:40:52         at java.net.URLClassLoader$1.run(URLClassLoader.java:369) ~[na:1.8.0_212]
17-Jun-2019 03:40:52         at java.net.URLClassLoader$1.run(URLClassLoader.java:363) ~[na:1.8.0_212]
17-Jun-2019 03:40:52         at java.security.AccessController.doPrivileged(Native Method) ~[na:1.8.0_212]
17-Jun-2019 03:40:52         at java.net.URLClassLoader.findClass(URLClassLoader.java:362) ~[na:1.8.0_212]
17-Jun-2019 03:40:52         at java.lang.ClassLoader.loadClass(ClassLoader.java:424) ~[na:1.8.0_212]
17-Jun-2019 03:40:52         at sun.misc.Launcher$AppClassLoader.loadClass(Launcher.java:349) ~[na:1.8.0_212]
17-Jun-2019 03:40:52         at java.lang.ClassLoader.loadClass(ClassLoader.java:357) ~[na:1.8.0_212]
17-Jun-2019 03:40:52         at java.lang.Class.forName0(Native Method) ~[na:1.8.0_212]
17-Jun-2019 03:40:52         at java.lang.Class.forName(Class.java:348) ~[na:1.8.0_212]
17-Jun-2019 03:40:52         at sun.reflect.generics.factory.CoreReflectionFactory.makeNamedType(CoreReflectionFactory.java:114) ~[na:1.8.0_212]
17-Jun-2019 03:40:52         at sun.reflect.generics.visitor.Reifier.visitClassTypeSignature(Reifier.java:125) ~[na:1.8.0_212]
17-Jun-2019 03:40:52         at sun.reflect.generics.tree.ClassTypeSignature.accept(ClassTypeSignature.java:49) ~[na:1.8.0_212]
17-Jun-2019 03:40:52         at sun.reflect.generics.visitor.Reifier.reifyTypeArguments(Reifier.java:68) ~[na:1.8.0_212]
17-Jun-2019 03:40:52         at sun.reflect.generics.visitor.Reifier.visitClassTypeSignature(Reifier.java:138) ~[na:1.8.0_212]
17-Jun-2019 03:40:52         at sun.reflect.generics.tree.ClassTypeSignature.accept(ClassTypeSignature.java:49) ~[na:1.8.0_212]
17-Jun-2019 03:40:52         at sun.reflect.generics.repository.MethodRepository.getReturnType(MethodRepository.java:68) ~[na:1.8.0_212]
17-Jun-2019 03:40:52         at java.lang.reflect.Method.getGenericReturnType(Method.java:255) ~[na:1.8.0_212]
17-Jun-2019 03:40:52         at java.lang.reflect.Method.specificToGenericStringHeader(Method.java:420) ~[na:1.8.0_212]
17-Jun-2019 03:40:52         at java.lang.reflect.Executable.sharedToGenericString(Executable.java:163) ~[na:1.8.0_212]
17-Jun-2019 03:40:52         at java.lang.reflect.Method.toGenericString(Method.java:415) ~[na:1.8.0_212]
17-Jun-2019 03:40:52         at java.beans.MethodRef.set(MethodRef.java:46) ~[na:1.8.0_212]
17-Jun-2019 03:40:52         at java.beans.MethodDescriptor.setMethod(MethodDescriptor.java:117) ~[na:1.8.0_212]
17-Jun-2019 03:40:52         at java.beans.MethodDescriptor.<init>(MethodDescriptor.java:72) ~[na:1.8.0_212]
17-Jun-2019 03:40:52         at java.beans.MethodDescriptor.<init>(MethodDescriptor.java:56) ~[na:1.8.0_212]
17-Jun-2019 03:40:52         at java.beans.Introspector.getTargetMethodInfo(Introspector.java:1205) ~[na:1.8.0_212]
17-Jun-2019 03:40:52         at java.beans.Introspector.getBeanInfo(Introspector.java:426) ~[na:1.8.0_212]
17-Jun-2019 03:40:52         at java.beans.Introspector.getBeanInfo(Introspector.java:173) ~[na:1.8.0_212]
17-Jun-2019 03:40:52         at org.springframework.beans.CachedIntrospectionResults.getBeanInfo(CachedIntrospectionResults.java:249) ~[spring-beans-5.2.0.M3.jar:5.2.0.M3]
17-Jun-2019 03:40:52         at org.springframework.beans.CachedIntrospectionResults.<init>(CachedIntrospectionResults.java:273) ~[spring-beans-5.2.0.M3.jar:5.2.0.M3]
17-Jun-2019 03:40:52         at org.springframework.beans.CachedIntrospectionResults.forClass(CachedIntrospectionResults.java:177) ~[spring-beans-5.2.0.M3.jar:5.2.0.M3]
17-Jun-2019 03:40:52         at org.springframework.beans.BeanWrapperImpl.getCachedIntrospectionResults(BeanWrapperImpl.java:174) ~[spring-beans-5.2.0.M3.jar:5.2.0.M3]
17-Jun-2019 03:40:52         at org.springframework.beans.BeanWrapperImpl.getPropertyDescriptors(BeanWrapperImpl.java:248) ~[spring-beans-5.2.0.M3.jar:5.2.0.M3]
17-Jun-2019 03:40:52         at org.springframework.beans.factory.support.AbstractAutowireCapableBeanFactory.filterPropertyDescriptorsForDependencyCheck(AbstractAutowireCapableBeanFactory.java:1581) ~[spring-beans-5.2.0.M3.jar:5.2.0.M3]
17-Jun-2019 03:40:52         at org.springframework.beans.factory.support.AbstractAutowireCapableBeanFactory.filterPropertyDescriptorsForDependencyCheck(AbstractAutowireCapableBeanFactory.java:1561) ~[spring-beans-5.2.0.M3.jar:5.2.0.M3]
17-Jun-2019 03:40:52         at org.springframework.beans.factory.support.AbstractAutowireCapableBeanFactory.populateBean(AbstractAutowireCapableBeanFactory.java:1420) ~[spring-beans-5.2.0.M3.jar:5.2.0.M3]
17-Jun-2019 03:40:52         at org.springframework.beans.factory.support.AbstractAutowireCapableBeanFactory.doCreateBean(AbstractAutowireCapableBeanFactory.java:593) ~[spring-beans-5.2.0.M3.jar:5.2.0.M3]
17-Jun-2019 03:40:52         ... 55 common frames omitted
17-Jun-2019 03:40:52 Caused by: java.lang.ClassNotFoundException: org.springframework.integration.endpoint.Pausable
17-Jun-2019 03:40:52         at java.net.URLClassLoader.findClass(URLClassLoader.java:382) ~[na:1.8.0_212]
17-Jun-2019 03:40:52         at java.lang.ClassLoader.loadClass(ClassLoader.java:424) ~[na:1.8.0_212]
17-Jun-2019 03:40:52         at sun.misc.Launcher$AppClassLoader.loadClass(Launcher.java:349) ~[na:1.8.0_212]
17-Jun-2019 03:40:52         at java.lang.ClassLoader.loadClass(ClassLoader.java:357) ~[na:1.8.0_212]
17-Jun-2019 03:40:52         ... 96 common frames omitted
17-Jun-2019 03:40:52
17-Jun-2019 03:40:52 Tests run: 5, Failures: 0, Errors: 5, Skipped: 0, Time elapsed: 2.471 sec <<< FAILURE!
17-Jun-2019 03:40:52 testNoRun(org.springframework.cloud.task.launcher.TaskLauncherSinkTests)  Time elapsed: 0.001 sec  <<< ERROR!
17-Jun-2019 03:40:52 java.lang.IllegalStateException: Failed to load ApplicationContext
17-Jun-2019 03:40:52         at org.springframework.test.context.cache.DefaultCacheAwareContextLoaderDelegate.loadContext(DefaultCacheAwareContextLoaderDelegate.java:132)
17-Jun-2019 03:40:52         at org.springframework.test.context.support.DefaultTestContext.getApplicationContext(DefaultTestContext.java:122)
17-Jun-2019 03:40:52         at org.springframework.test.context.support.DependencyInjectionTestExecutionListener.injectDependencies(DependencyInjectionTestExecutionListener.java:118)
17-Jun-2019 03:40:52         at org.springframework.test.context.support.DependencyInjectionTestExecutionListener.prepareTestInstance(DependencyInjectionTestExecutionListener.java:83)
17-Jun-2019 03:40:52         at org.springframework.boot.test.autoconfigure.SpringBootDependencyInjectionTestExecutionListener.prepareTestInstance(SpringBootDependencyInjectionTestExecutionListener.java:43)
17-Jun-2019 03:40:52         at org.springframework.test.context.TestContextManager.prepareTestInstance(TestContextManager.java:244)
17-Jun-2019 03:40:52         at org.springframework.test.context.junit4.SpringJUnit4ClassRunner.createTest(SpringJUnit4ClassRunner.java:227)
17-Jun-2019 03:40:52         at org.springframework.test.context.junit4.SpringJUnit4ClassRunner$1.runReflectiveCall(SpringJUnit4ClassRunner.java:289)
17-Jun-2019 03:40:52         at org.junit.internal.runners.model.ReflectiveCallable.run(ReflectiveCallable.java:12)
17-Jun-2019 03:40:52         at org.springframework.test.context.junit4.SpringJUnit4ClassRunner.methodBlock(SpringJUnit4ClassRunner.java:291)
17-Jun-2019 03:40:52         at org.springframework.test.context.junit4.SpringJUnit4ClassRunner.runChild(SpringJUnit4ClassRunner.java:246)
17-Jun-2019 03:40:52         at org.springframework.test.context.junit4.SpringJUnit4ClassRunner.runChild(SpringJUnit4ClassRunner.java:97)
17-Jun-2019 03:40:52         at org.junit.runners.ParentRunner$3.run(ParentRunner.java:290)
17-Jun-2019 03:40:52         at org.junit.runners.ParentRunner$1.schedule(ParentRunner.java:71)
17-Jun-2019 03:40:52         at org.junit.runners.ParentRunner.runChildren(ParentRunner.java:288)
17-Jun-2019 03:40:52         at org.junit.runners.ParentRunner.access$000(ParentRunner.java:58)
17-Jun-2019 03:40:52         at org.junit.runners.ParentRunner$2.evaluate(ParentRunner.java:268)
17-Jun-2019 03:40:52         at org.springframework.test.context.junit4.statements.RunBeforeTestClassCallbacks.evaluate(RunBeforeTestClassCallbacks.java:61)
17-Jun-2019 03:40:52         at org.springframework.test.context.junit4.statements.RunAfterTestClassCallbacks.evaluate(RunAfterTestClassCallbacks.java:70)
17-Jun-2019 03:40:52         at org.junit.runners.ParentRunner.run(ParentRunner.java:363)
17-Jun-2019 03:40:52         at org.springframework.test.context.junit4.SpringJUnit4ClassRunner.run(SpringJUnit4ClassRunner.java:190)
17-Jun-2019 03:40:52         at org.apache.maven.surefire.junit4.JUnit4Provider.execute(JUnit4Provider.java:252)
17-Jun-2019 03:40:52         at org.apache.maven.surefire.junit4.JUnit4Provider.executeTestSet(JUnit4Provider.java:141)
17-Jun-2019 03:40:52         at org.apache.maven.surefire.junit4.JUnit4Provider.invoke(JUnit4Provider.java:112)
17-Jun-2019 03:40:52         at sun.reflect.NativeMethodAccessorImpl.invoke0(Native Method)
17-Jun-2019 03:40:52         at sun.reflect.NativeMethodAccessorImpl.invoke(NativeMethodAccessorImpl.java:62)
17-Jun-2019 03:40:52         at sun.reflect.DelegatingMethodAccessorImpl.invoke(DelegatingMethodAccessorImpl.java:43)
17-Jun-2019 03:40:52         at java.lang.reflect.Method.invoke(Method.java:498)
17-Jun-2019 03:40:52         at org.apache.maven.surefire.util.ReflectionUtils.invokeMethodWithArray(ReflectionUtils.java:189)
17-Jun-2019 03:40:52         at org.apache.maven.surefire.booter.ProviderFactory$ProviderProxy.invoke(ProviderFactory.java:165)
17-Jun-2019 03:40:52         at org.apache.maven.surefire.booter.ProviderFactory.invokeProvider(ProviderFactory.java:85)
17-Jun-2019 03:40:52         at org.apache.maven.surefire.booter.ForkedBooter.runSuitesInProcess(ForkedBooter.java:115)
17-Jun-2019 03:40:52         at org.apache.maven.surefire.booter.ForkedBooter.main(ForkedBooter.java:75)
17-Jun-2019 03:40:52 Caused by: org.springframework.beans.factory.BeanCreationException: Error creating bean with name 'org.springframework.cloud.stream.messaging.Sink': Initialization of bean failed; nested exception is java.lang.NoClassDefFoundError: org/springframework/integration/endpoint/Pausable
17-Jun-2019 03:40:52         at org.springframework.beans.factory.support.AbstractAutowireCapableBeanFactory.doCreateBean(AbstractAutowireCapableBeanFactory.java:602)
17-Jun-2019 03:40:52         at org.springframework.beans.factory.support.AbstractAutowireCapableBeanFactory.createBean(AbstractAutowireCapableBeanFactory.java:516)
17-Jun-2019 03:40:52         at org.springframework.beans.factory.support.AbstractBeanFactory.lambda$doGetBean$0(AbstractBeanFactory.java:320)
17-Jun-2019 03:40:52         at org.springframework.beans.factory.support.DefaultSingletonBeanRegistry.getSingleton(DefaultSingletonBeanRegistry.java:222)
17-Jun-2019 03:40:52         at org.springframework.beans.factory.support.AbstractBeanFactory.doGetBean(AbstractBeanFactory.java:318)
17-Jun-2019 03:40:52         at org.springframework.beans.factory.support.AbstractBeanFactory.getBean(AbstractBeanFactory.java:199)
17-Jun-2019 03:40:52         at org.springframework.beans.factory.support.ConstructorResolver.instantiateUsingFactoryMethod(ConstructorResolver.java:393)
17-Jun-2019 03:40:52         at org.springframework.beans.factory.support.AbstractAutowireCapableBeanFactory.instantiateUsingFactoryMethod(AbstractAutowireCapableBeanFactory.java:1326)
17-Jun-2019 03:40:52         at org.springframework.beans.factory.support.AbstractAutowireCapableBeanFactory.createBeanInstance(AbstractAutowireCapableBeanFactory.java:1165)
17-Jun-2019 03:40:52         at org.springframework.beans.factory.support.AbstractAutowireCapableBeanFactory.doCreateBean(AbstractAutowireCapableBeanFactory.java:556)
17-Jun-2019 03:40:52         at org.springframework.beans.factory.support.AbstractAutowireCapableBeanFactory.createBean(AbstractAutowireCapableBeanFactory.java:516)
17-Jun-2019 03:40:52         at org.springframework.beans.factory.support.AbstractBeanFactory.lambda$doGetBean$0(AbstractBeanFactory.java:320)
17-Jun-2019 03:40:52         at org.springframework.beans.factory.support.DefaultSingletonBeanRegistry.getSingleton(DefaultSingletonBeanRegistry.java:222)
17-Jun-2019 03:40:52         at org.springframework.beans.factory.support.AbstractBeanFactory.doGetBean(AbstractBeanFactory.java:318)
17-Jun-2019 03:40:52         at org.springframework.beans.factory.support.AbstractBeanFactory.getBean(AbstractBeanFactory.java:199)
17-Jun-2019 03:40:52         at org.springframework.beans.factory.support.DefaultListableBeanFactory.preInstantiateSingletons(DefaultListableBeanFactory.java:870)
17-Jun-2019 03:40:52         at org.springframework.context.support.AbstractApplicationContext.finishBeanFactoryInitialization(AbstractApplicationContext.java:877)
17-Jun-2019 03:40:52         at org.springframework.context.support.AbstractApplicationContext.refresh(AbstractApplicationContext.java:549)
17-Jun-2019 03:40:52         at org.springframework.boot.SpringApplication.refresh(SpringApplication.java:748)
17-Jun-2019 03:40:52         at org.springframework.boot.SpringApplication.refreshContext(SpringApplication.java:395)
17-Jun-2019 03:40:52         at org.springframework.boot.SpringApplication.run(SpringApplication.java:314)
17-Jun-2019 03:40:52         at org.springframework.boot.test.context.SpringBootContextLoader.loadContext(SpringBootContextLoader.java:124)
17-Jun-2019 03:40:52         at org.springframework.test.context.cache.DefaultCacheAwareContextLoaderDelegate.loadContextInternal(DefaultCacheAwareContextLoaderDelegate.java:99)
17-Jun-2019 03:40:52         at org.springframework.test.context.cache.DefaultCacheAwareContextLoaderDelegate.loadContext(DefaultCacheAwareContextLoaderDelegate.java:124)
17-Jun-2019 03:40:52         ... 32 more
17-Jun-2019 03:40:52 Caused by: java.lang.NoClassDefFoundError: org/springframework/integration/endpoint/Pausable
17-Jun-2019 03:40:52         at java.lang.ClassLoader.defineClass1(Native Method)
17-Jun-2019 03:40:52         at java.lang.ClassLoader.defineClass(ClassLoader.java:763)
17-Jun-2019 03:40:52         at java.security.SecureClassLoader.defineClass(SecureClassLoader.java:142)
17-Jun-2019 03:40:52         at java.net.URLClassLoader.defineClass(URLClassLoader.java:468)
17-Jun-2019 03:40:52         at java.net.URLClassLoader.access$100(URLClassLoader.java:74)
17-Jun-2019 03:40:52         at java.net.URLClassLoader$1.run(URLClassLoader.java:369)
17-Jun-2019 03:40:52         at java.net.URLClassLoader$1.run(URLClassLoader.java:363)
17-Jun-2019 03:40:52         at java.security.AccessController.doPrivileged(Native Method)
17-Jun-2019 03:40:52         at java.net.URLClassLoader.findClass(URLClassLoader.java:362)
17-Jun-2019 03:40:52         at java.lang.ClassLoader.loadClass(ClassLoader.java:424)
17-Jun-2019 03:40:52         at sun.misc.Launcher$AppClassLoader.loadClass(Launcher.java:349)
17-Jun-2019 03:40:52         at java.lang.ClassLoader.loadClass(ClassLoader.java:357)
17-Jun-2019 03:40:52         at java.lang.Class.forName0(Native Method)
17-Jun-2019 03:40:52         at java.lang.Class.forName(Class.java:348)
17-Jun-2019 03:40:52         at sun.reflect.generics.factory.CoreReflectionFactory.makeNamedType(CoreReflectionFactory.java:114)
17-Jun-2019 03:40:52         at sun.reflect.generics.visitor.Reifier.visitClassTypeSignature(Reifier.java:125)
17-Jun-2019 03:40:52         at sun.reflect.generics.tree.ClassTypeSignature.accept(ClassTypeSignature.java:49)
17-Jun-2019 03:40:52         at sun.reflect.generics.visitor.Reifier.reifyTypeArguments(Reifier.java:68)
17-Jun-2019 03:40:52         at sun.reflect.generics.visitor.Reifier.visitClassTypeSignature(Reifier.java:138)
17-Jun-2019 03:40:52         at sun.reflect.generics.tree.ClassTypeSignature.accept(ClassTypeSignature.java:49)
17-Jun-2019 03:40:52         at sun.reflect.generics.repository.MethodRepository.getReturnType(MethodRepository.java:68)
17-Jun-2019 03:40:52         at java.lang.reflect.Method.getGenericReturnType(Method.java:255)
17-Jun-2019 03:40:52         at java.lang.reflect.Method.specificToGenericStringHeader(Method.java:420)
17-Jun-2019 03:40:52         at java.lang.reflect.Executable.sharedToGenericString(Executable.java:163)
17-Jun-2019 03:40:52         at java.lang.reflect.Method.toGenericString(Method.java:415)
17-Jun-2019 03:40:52         at java.beans.MethodRef.set(MethodRef.java:46)
17-Jun-2019 03:40:52         at java.beans.MethodDescriptor.setMethod(MethodDescriptor.java:117)
17-Jun-2019 03:40:52         at java.beans.MethodDescriptor.<init>(MethodDescriptor.java:72)
17-Jun-2019 03:40:52         at java.beans.MethodDescriptor.<init>(MethodDescriptor.java:56)
17-Jun-2019 03:40:52         at java.beans.Introspector.getTargetMethodInfo(Introspector.java:1205)
17-Jun-2019 03:40:52         at java.beans.Introspector.getBeanInfo(Introspector.java:426)
17-Jun-2019 03:40:52         at java.beans.Introspector.getBeanInfo(Introspector.java:173)
17-Jun-2019 03:40:52         at org.springframework.beans.CachedIntrospectionResults.getBeanInfo(CachedIntrospectionResults.java:249)
17-Jun-2019 03:40:52         at org.springframework.beans.CachedIntrospectionResults.<init>(CachedIntrospectionResults.java:273)
17-Jun-2019 03:40:52         at org.springframework.beans.CachedIntrospectionResults.forClass(CachedIntrospectionResults.java:177)
17-Jun-2019 03:40:52         at org.springframework.beans.BeanWrapperImpl.getCachedIntrospectionResults(BeanWrapperImpl.java:174)
17-Jun-2019 03:40:52         at org.springframework.beans.BeanWrapperImpl.getPropertyDescriptors(BeanWrapperImpl.java:248)
17-Jun-2019 03:40:52         at org.springframework.beans.factory.support.AbstractAutowireCapableBeanFactory.filterPropertyDescriptorsForDependencyCheck(AbstractAutowireCapableBeanFactory.java:1581)
17-Jun-2019 03:40:52         at org.springframework.beans.factory.support.AbstractAutowireCapableBeanFactory.filterPropertyDescriptorsForDependencyCheck(AbstractAutowireCapableBeanFactory.java:1561)
17-Jun-2019 03:40:52         at org.springframework.beans.factory.support.AbstractAutowireCapableBeanFactory.populateBean(AbstractAutowireCapableBeanFactory.java:1420)
17-Jun-2019 03:40:52         at org.springframework.beans.factory.support.AbstractAutowireCapableBeanFactory.doCreateBean(AbstractAutowireCapableBeanFactory.java:593)
17-Jun-2019 03:40:52         ... 55 more
17-Jun-2019 03:40:52 Caused by: java.lang.ClassNotFoundException: org.springframework.integration.endpoint.Pausable
17-Jun-2019 03:40:52         at java.net.URLClassLoader.findClass(URLClassLoader.java:382)
17-Jun-2019 03:40:52         at java.lang.ClassLoader.loadClass(ClassLoader.java:424)
17-Jun-2019 03:40:52         at sun.misc.Launcher$AppClassLoader.loadClass(Launcher.java:349)
17-Jun-2019 03:40:52         at java.lang.ClassLoader.loadClass(ClassLoader.java:357)
17-Jun-2019 03:40:52         ... 96 more
17-Jun-2019 03:40:52
17-Jun-2019 03:40:52 testSuccessWithAppName(org.springframework.cloud.task.launcher.TaskLauncherSinkTests)  Time elapsed: 0 sec  <<< ERROR!
17-Jun-2019 03:40:52 java.lang.IllegalStateException: Failed to load ApplicationContext
17-Jun-2019 03:40:52         at org.springframework.test.context.cache.DefaultCacheAwareContextLoaderDelegate.loadContext(DefaultCacheAwareContextLoaderDelegate.java:132)
17-Jun-2019 03:40:52         at org.springframework.test.context.support.DefaultTestContext.getApplicationContext(DefaultTestContext.java:122)
17-Jun-2019 03:40:52         at org.springframework.test.context.support.DependencyInjectionTestExecutionListener.injectDependencies(DependencyInjectionTestExecutionListener.java:118)
17-Jun-2019 03:40:52         at org.springframework.test.context.support.DependencyInjectionTestExecutionListener.prepareTestInstance(DependencyInjectionTestExecutionListener.java:83)
17-Jun-2019 03:40:52         at org.springframework.boot.test.autoconfigure.SpringBootDependencyInjectionTestExecutionListener.prepareTestInstance(SpringBootDependencyInjectionTestExecutionListener.java:43)
17-Jun-2019 03:40:52         at org.springframework.test.context.TestContextManager.prepareTestInstance(TestContextManager.java:244)
17-Jun-2019 03:40:52         at org.springframework.test.context.junit4.SpringJUnit4ClassRunner.createTest(SpringJUnit4ClassRunner.java:227)
17-Jun-2019 03:40:52         at org.springframework.test.context.junit4.SpringJUnit4ClassRunner$1.runReflectiveCall(SpringJUnit4ClassRunner.java:289)
17-Jun-2019 03:40:52         at org.junit.internal.runners.model.ReflectiveCallable.run(ReflectiveCallable.java:12)
17-Jun-2019 03:40:52         at org.springframework.test.context.junit4.SpringJUnit4ClassRunner.methodBlock(SpringJUnit4ClassRunner.java:291)
17-Jun-2019 03:40:52         at org.springframework.test.context.junit4.SpringJUnit4ClassRunner.runChild(SpringJUnit4ClassRunner.java:246)
17-Jun-2019 03:40:52         at org.springframework.test.context.junit4.SpringJUnit4ClassRunner.runChild(SpringJUnit4ClassRunner.java:97)
17-Jun-2019 03:40:52         at org.junit.runners.ParentRunner$3.run(ParentRunner.java:290)
17-Jun-2019 03:40:52         at org.junit.runners.ParentRunner$1.schedule(ParentRunner.java:71)
17-Jun-2019 03:40:52         at org.junit.runners.ParentRunner.runChildren(ParentRunner.java:288)
17-Jun-2019 03:40:52         at org.junit.runners.ParentRunner.access$000(ParentRunner.java:58)
17-Jun-2019 03:40:52         at org.junit.runners.ParentRunner$2.evaluate(ParentRunner.java:268)
17-Jun-2019 03:40:52         at org.springframework.test.context.junit4.statements.RunBeforeTestClassCallbacks.evaluate(RunBeforeTestClassCallbacks.java:61)
17-Jun-2019 03:40:52         at org.springframework.test.context.junit4.statements.RunAfterTestClassCallbacks.evaluate(RunAfterTestClassCallbacks.java:70)
17-Jun-2019 03:40:52         at org.junit.runners.ParentRunner.run(ParentRunner.java:363)
17-Jun-2019 03:40:52         at org.springframework.test.context.junit4.SpringJUnit4ClassRunner.run(SpringJUnit4ClassRunner.java:190)
17-Jun-2019 03:40:52         at org.apache.maven.surefire.junit4.JUnit4Provider.execute(JUnit4Provider.java:252)
17-Jun-2019 03:40:52         at org.apache.maven.surefire.junit4.JUnit4Provider.executeTestSet(JUnit4Provider.java:141)
17-Jun-2019 03:40:52         at org.apache.maven.surefire.junit4.JUnit4Provider.invoke(JUnit4Provider.java:112)
17-Jun-2019 03:40:52         at sun.reflect.NativeMethodAccessorImpl.invoke0(Native Method)
17-Jun-2019 03:40:52         at sun.reflect.NativeMethodAccessorImpl.invoke(NativeMethodAccessorImpl.java:62)
17-Jun-2019 03:40:52         at sun.reflect.DelegatingMethodAccessorImpl.invoke(DelegatingMethodAccessorImpl.java:43)
17-Jun-2019 03:40:52         at java.lang.reflect.Method.invoke(Method.java:498)
17-Jun-2019 03:40:52         at org.apache.maven.surefire.util.ReflectionUtils.invokeMethodWithArray(ReflectionUtils.java:189)
17-Jun-2019 03:40:52         at org.apache.maven.surefire.booter.ProviderFactory$ProviderProxy.invoke(ProviderFactory.java:165)
17-Jun-2019 03:40:52         at org.apache.maven.surefire.booter.ProviderFactory.invokeProvider(ProviderFactory.java:85)
17-Jun-2019 03:40:52         at org.apache.maven.surefire.booter.ForkedBooter.runSuitesInProcess(ForkedBooter.java:115)
17-Jun-2019 03:40:52         at org.apache.maven.surefire.booter.ForkedBooter.main(ForkedBooter.java:75)
17-Jun-2019 03:40:52 Caused by: org.springframework.beans.factory.BeanCreationException: Error creating bean with name 'org.springframework.cloud.stream.messaging.Sink': Initialization of bean failed; nested exception is java.lang.NoClassDefFoundError: org/springframework/integration/endpoint/Pausable
17-Jun-2019 03:40:52         at org.springframework.beans.factory.support.AbstractAutowireCapableBeanFactory.doCreateBean(AbstractAutowireCapableBeanFactory.java:602)
17-Jun-2019 03:40:52         at org.springframework.beans.factory.support.AbstractAutowireCapableBeanFactory.createBean(AbstractAutowireCapableBeanFactory.java:516)
17-Jun-2019 03:40:52         at org.springframework.beans.factory.support.AbstractBeanFactory.lambda$doGetBean$0(AbstractBeanFactory.java:320)
17-Jun-2019 03:40:52         at org.springframework.beans.factory.support.DefaultSingletonBeanRegistry.getSingleton(DefaultSingletonBeanRegistry.java:222)
17-Jun-2019 03:40:52         at org.springframework.beans.factory.support.AbstractBeanFactory.doGetBean(AbstractBeanFactory.java:318)
17-Jun-2019 03:40:52         at org.springframework.beans.factory.support.AbstractBeanFactory.getBean(AbstractBeanFactory.java:199)
17-Jun-2019 03:40:52         at org.springframework.beans.factory.support.ConstructorResolver.instantiateUsingFactoryMethod(ConstructorResolver.java:393)
17-Jun-2019 03:40:52         at org.springframework.beans.factory.support.AbstractAutowireCapableBeanFactory.instantiateUsingFactoryMethod(AbstractAutowireCapableBeanFactory.java:1326)
17-Jun-2019 03:40:52         at org.springframework.beans.factory.support.AbstractAutowireCapableBeanFactory.createBeanInstance(AbstractAutowireCapableBeanFactory.java:1165)
17-Jun-2019 03:40:52         at org.springframework.beans.factory.support.AbstractAutowireCapableBeanFactory.doCreateBean(AbstractAutowireCapableBeanFactory.java:556)
17-Jun-2019 03:40:52         at org.springframework.beans.factory.support.AbstractAutowireCapableBeanFactory.createBean(AbstractAutowireCapableBeanFactory.java:516)
17-Jun-2019 03:40:52         at org.springframework.beans.factory.support.AbstractBeanFactory.lambda$doGetBean$0(AbstractBeanFactory.java:320)
17-Jun-2019 03:40:52         at org.springframework.beans.factory.support.DefaultSingletonBeanRegistry.getSingleton(DefaultSingletonBeanRegistry.java:222)
17-Jun-2019 03:40:52         at org.springframework.beans.factory.support.AbstractBeanFactory.doGetBean(AbstractBeanFactory.java:318)
17-Jun-2019 03:40:52         at org.springframework.beans.factory.support.AbstractBeanFactory.getBean(AbstractBeanFactory.java:199)
17-Jun-2019 03:40:52         at org.springframework.beans.factory.support.DefaultListableBeanFactory.preInstantiateSingletons(DefaultListableBeanFactory.java:870)
17-Jun-2019 03:40:52         at org.springframework.context.support.AbstractApplicationContext.finishBeanFactoryInitialization(AbstractApplicationContext.java:877)
17-Jun-2019 03:40:52         at org.springframework.context.support.AbstractApplicationContext.refresh(AbstractApplicationContext.java:549)
17-Jun-2019 03:40:52         at org.springframework.boot.SpringApplication.refresh(SpringApplication.java:748)
17-Jun-2019 03:40:52         at org.springframework.boot.SpringApplication.refreshContext(SpringApplication.java:395)
17-Jun-2019 03:40:52         at org.springframework.boot.SpringApplication.run(SpringApplication.java:314)
17-Jun-2019 03:40:52         at org.springframework.boot.test.context.SpringBootContextLoader.loadContext(SpringBootContextLoader.java:124)
17-Jun-2019 03:40:52         at org.springframework.test.context.cache.DefaultCacheAwareContextLoaderDelegate.loadContextInternal(DefaultCacheAwareContextLoaderDelegate.java:99)
17-Jun-2019 03:40:52         at org.springframework.test.context.cache.DefaultCacheAwareContextLoaderDelegate.loadContext(DefaultCacheAwareContextLoaderDelegate.java:124)
17-Jun-2019 03:40:52         ... 32 more
17-Jun-2019 03:40:52 Caused by: java.lang.NoClassDefFoundError: org/springframework/integration/endpoint/Pausable
17-Jun-2019 03:40:52         at java.lang.ClassLoader.defineClass1(Native Method)
17-Jun-2019 03:40:52         at java.lang.ClassLoader.defineClass(ClassLoader.java:763)
17-Jun-2019 03:40:52         at java.security.SecureClassLoader.defineClass(SecureClassLoader.java:142)
17-Jun-2019 03:40:52         at java.net.URLClassLoader.defineClass(URLClassLoader.java:468)
17-Jun-2019 03:40:52         at java.net.URLClassLoader.access$100(URLClassLoader.java:74)
17-Jun-2019 03:40:52         at java.net.URLClassLoader$1.run(URLClassLoader.java:369)
17-Jun-2019 03:40:52         at java.net.URLClassLoader$1.run(URLClassLoader.java:363)
17-Jun-2019 03:40:52         at java.security.AccessController.doPrivileged(Native Method)
17-Jun-2019 03:40:52         at java.net.URLClassLoader.findClass(URLClassLoader.java:362)
17-Jun-2019 03:40:52         at java.lang.ClassLoader.loadClass(ClassLoader.java:424)
17-Jun-2019 03:40:52         at sun.misc.Launcher$AppClassLoader.loadClass(Launcher.java:349)
17-Jun-2019 03:40:52         at java.lang.ClassLoader.loadClass(ClassLoader.java:357)
17-Jun-2019 03:40:52         at java.lang.Class.forName0(Native Method)
17-Jun-2019 03:40:52         at java.lang.Class.forName(Class.java:348)
17-Jun-2019 03:40:52         at sun.reflect.generics.factory.CoreReflectionFactory.makeNamedType(CoreReflectionFactory.java:114)
17-Jun-2019 03:40:52         at sun.reflect.generics.visitor.Reifier.visitClassTypeSignature(Reifier.java:125)
17-Jun-2019 03:40:52         at sun.reflect.generics.tree.ClassTypeSignature.accept(ClassTypeSignature.java:49)
17-Jun-2019 03:40:52         at sun.reflect.generics.visitor.Reifier.reifyTypeArguments(Reifier.java:68)
17-Jun-2019 03:40:52         at sun.reflect.generics.visitor.Reifier.visitClassTypeSignature(Reifier.java:138)
17-Jun-2019 03:40:52         at sun.reflect.generics.tree.ClassTypeSignature.accept(ClassTypeSignature.java:49)
17-Jun-2019 03:40:52         at sun.reflect.generics.repository.MethodRepository.getReturnType(MethodRepository.java:68)
17-Jun-2019 03:40:52         at java.lang.reflect.Method.getGenericReturnType(Method.java:255)
17-Jun-2019 03:40:52         at java.lang.reflect.Method.specificToGenericStringHeader(Method.java:420)
17-Jun-2019 03:40:52         at java.lang.reflect.Executable.sharedToGenericString(Executable.java:163)
17-Jun-2019 03:40:52         at java.lang.reflect.Method.toGenericString(Method.java:415)
17-Jun-2019 03:40:52         at java.beans.MethodRef.set(MethodRef.java:46)
17-Jun-2019 03:40:52         at java.beans.MethodDescriptor.setMethod(MethodDescriptor.java:117)
17-Jun-2019 03:40:52         at java.beans.MethodDescriptor.<init>(MethodDescriptor.java:72)
17-Jun-2019 03:40:52         at java.beans.MethodDescriptor.<init>(MethodDescriptor.java:56)
17-Jun-2019 03:40:52         at java.beans.Introspector.getTargetMethodInfo(Introspector.java:1205)
17-Jun-2019 03:40:52         at java.beans.Introspector.getBeanInfo(Introspector.java:426)
17-Jun-2019 03:40:52         at java.beans.Introspector.getBeanInfo(Introspector.java:173)
17-Jun-2019 03:40:52         at org.springframework.beans.CachedIntrospectionResults.getBeanInfo(CachedIntrospectionResults.java:249)
17-Jun-2019 03:40:52         at org.springframework.beans.CachedIntrospectionResults.<init>(CachedIntrospectionResults.java:273)
17-Jun-2019 03:40:52         at org.springframework.beans.CachedIntrospectionResults.forClass(CachedIntrospectionResults.java:177)
17-Jun-2019 03:40:52         at org.springframework.beans.BeanWrapperImpl.getCachedIntrospectionResults(BeanWrapperImpl.java:174)
17-Jun-2019 03:40:52         at org.springframework.beans.BeanWrapperImpl.getPropertyDescriptors(BeanWrapperImpl.java:248)
17-Jun-2019 03:40:52         at org.springframework.beans.factory.support.AbstractAutowireCapableBeanFactory.filterPropertyDescriptorsForDependencyCheck(AbstractAutowireCapableBeanFactory.java:1581)
17-Jun-2019 03:40:52         at org.springframework.beans.factory.support.AbstractAutowireCapableBeanFactory.filterPropertyDescriptorsForDependencyCheck(AbstractAutowireCapableBeanFactory.java:1561)
17-Jun-2019 03:40:52         at org.springframework.beans.factory.support.AbstractAutowireCapableBeanFactory.populateBean(AbstractAutowireCapableBeanFactory.java:1420)
17-Jun-2019 03:40:52         at org.springframework.beans.factory.support.AbstractAutowireCapableBeanFactory.doCreateBean(AbstractAutowireCapableBeanFactory.java:593)
17-Jun-2019 03:40:52         ... 55 more
17-Jun-2019 03:40:52 Caused by: java.lang.ClassNotFoundException: org.springframework.integration.endpoint.Pausable
17-Jun-2019 03:40:52         at java.net.URLClassLoader.findClass(URLClassLoader.java:382)
17-Jun-2019 03:40:52         at java.lang.ClassLoader.loadClass(ClassLoader.java:424)
17-Jun-2019 03:40:52         at sun.misc.Launcher$AppClassLoader.loadClass(Launcher.java:349)
17-Jun-2019 03:40:52         at java.lang.ClassLoader.loadClass(ClassLoader.java:357)
17-Jun-2019 03:40:52         ... 96 more
17-Jun-2019 03:40:52
17-Jun-2019 03:40:52 testSuccessNoParams(org.springframework.cloud.task.launcher.TaskLauncherSinkTests)  Time elapsed: 0.001 sec  <<< ERROR!
17-Jun-2019 03:40:52 java.lang.IllegalStateException: Failed to load ApplicationContext
17-Jun-2019 03:40:52         at org.springframework.test.context.cache.DefaultCacheAwareContextLoaderDelegate.loadContext(DefaultCacheAwareContextLoaderDelegate.java:132)
17-Jun-2019 03:40:52         at org.springframework.test.context.support.DefaultTestContext.getApplicationContext(DefaultTestContext.java:122)
17-Jun-2019 03:40:52         at org.springframework.test.context.support.DependencyInjectionTestExecutionListener.injectDependencies(DependencyInjectionTestExecutionListener.java:118)
17-Jun-2019 03:40:52         at org.springframework.test.context.support.DependencyInjectionTestExecutionListener.prepareTestInstance(DependencyInjectionTestExecutionListener.java:83)
17-Jun-2019 03:40:52         at org.springframework.boot.test.autoconfigure.SpringBootDependencyInjectionTestExecutionListener.prepareTestInstance(SpringBootDependencyInjectionTestExecutionListener.java:43)
17-Jun-2019 03:40:52         at org.springframework.test.context.TestContextManager.prepareTestInstance(TestContextManager.java:244)
17-Jun-2019 03:40:52         at org.springframework.test.context.junit4.SpringJUnit4ClassRunner.createTest(SpringJUnit4ClassRunner.java:227)
17-Jun-2019 03:40:52         at org.springframework.test.context.junit4.SpringJUnit4ClassRunner$1.runReflectiveCall(SpringJUnit4ClassRunner.java:289)
17-Jun-2019 03:40:52         at org.junit.internal.runners.model.ReflectiveCallable.run(ReflectiveCallable.java:12)
17-Jun-2019 03:40:52         at org.springframework.test.context.junit4.SpringJUnit4ClassRunner.methodBlock(SpringJUnit4ClassRunner.java:291)
17-Jun-2019 03:40:52         at org.springframework.test.context.junit4.SpringJUnit4ClassRunner.runChild(SpringJUnit4ClassRunner.java:246)
17-Jun-2019 03:40:52         at org.springframework.test.context.junit4.SpringJUnit4ClassRunner.runChild(SpringJUnit4ClassRunner.java:97)
17-Jun-2019 03:40:52         at org.junit.runners.ParentRunner$3.run(ParentRunner.java:290)
17-Jun-2019 03:40:52         at org.junit.runners.ParentRunner$1.schedule(ParentRunner.java:71)
17-Jun-2019 03:40:52         at org.junit.runners.ParentRunner.runChildren(ParentRunner.java:288)
17-Jun-2019 03:40:52         at org.junit.runners.ParentRunner.access$000(ParentRunner.java:58)
17-Jun-2019 03:40:52         at org.junit.runners.ParentRunner$2.evaluate(ParentRunner.java:268)
17-Jun-2019 03:40:52         at org.springframework.test.context.junit4.statements.RunBeforeTestClassCallbacks.evaluate(RunBeforeTestClassCallbacks.java:61)
17-Jun-2019 03:40:52         at org.springframework.test.context.junit4.statements.RunAfterTestClassCallbacks.evaluate(RunAfterTestClassCallbacks.java:70)
17-Jun-2019 03:40:52         at org.junit.runners.ParentRunner.run(ParentRunner.java:363)
17-Jun-2019 03:40:52         at org.springframework.test.context.junit4.SpringJUnit4ClassRunner.run(SpringJUnit4ClassRunner.java:190)
17-Jun-2019 03:40:52         at org.apache.maven.surefire.junit4.JUnit4Provider.execute(JUnit4Provider.java:252)
17-Jun-2019 03:40:52         at org.apache.maven.surefire.junit4.JUnit4Provider.executeTestSet(JUnit4Provider.java:141)
17-Jun-2019 03:40:52         at org.apache.maven.surefire.junit4.JUnit4Provider.invoke(JUnit4Provider.java:112)
17-Jun-2019 03:40:52         at sun.reflect.NativeMethodAccessorImpl.invoke0(Native Method)
17-Jun-2019 03:40:52         at sun.reflect.NativeMethodAccessorImpl.invoke(NativeMethodAccessorImpl.java:62)
17-Jun-2019 03:40:52         at sun.reflect.DelegatingMethodAccessorImpl.invoke(DelegatingMethodAccessorImpl.java:43)
17-Jun-2019 03:40:52         at java.lang.reflect.Method.invoke(Method.java:498)
17-Jun-2019 03:40:52         at org.apache.maven.surefire.util.ReflectionUtils.invokeMethodWithArray(ReflectionUtils.java:189)
17-Jun-2019 03:40:52         at org.apache.maven.surefire.booter.ProviderFactory$ProviderProxy.invoke(ProviderFactory.java:165)
17-Jun-2019 03:40:52         at org.apache.maven.surefire.booter.ProviderFactory.invokeProvider(ProviderFactory.java:85)
17-Jun-2019 03:40:52         at org.apache.maven.surefire.booter.ForkedBooter.runSuitesInProcess(ForkedBooter.java:115)
17-Jun-2019 03:40:52         at org.apache.maven.surefire.booter.ForkedBooter.main(ForkedBooter.java:75)
17-Jun-2019 03:40:52 Caused by: org.springframework.beans.factory.BeanCreationException: Error creating bean with name 'org.springframework.cloud.stream.messaging.Sink': Initialization of bean failed; nested exception is java.lang.NoClassDefFoundError: org/springframework/integration/endpoint/Pausable
17-Jun-2019 03:40:52         at org.springframework.beans.factory.support.AbstractAutowireCapableBeanFactory.doCreateBean(AbstractAutowireCapableBeanFactory.java:602)
17-Jun-2019 03:40:52         at org.springframework.beans.factory.support.AbstractAutowireCapableBeanFactory.createBean(AbstractAutowireCapableBeanFactory.java:516)
17-Jun-2019 03:40:52         at org.springframework.beans.factory.support.AbstractBeanFactory.lambda$doGetBean$0(AbstractBeanFactory.java:320)
17-Jun-2019 03:40:52         at org.springframework.beans.factory.support.DefaultSingletonBeanRegistry.getSingleton(DefaultSingletonBeanRegistry.java:222)
17-Jun-2019 03:40:52         at org.springframework.beans.factory.support.AbstractBeanFactory.doGetBean(AbstractBeanFactory.java:318)
17-Jun-2019 03:40:52         at org.springframework.beans.factory.support.AbstractBeanFactory.getBean(AbstractBeanFactory.java:199)
17-Jun-2019 03:40:52         at org.springframework.beans.factory.support.ConstructorResolver.instantiateUsingFactoryMethod(ConstructorResolver.java:393)
17-Jun-2019 03:40:52         at org.springframework.beans.factory.support.AbstractAutowireCapableBeanFactory.instantiateUsingFactoryMethod(AbstractAutowireCapableBeanFactory.java:1326)
17-Jun-2019 03:40:52         at org.springframework.beans.factory.support.AbstractAutowireCapableBeanFactory.createBeanInstance(AbstractAutowireCapableBeanFactory.java:1165)
17-Jun-2019 03:40:52         at org.springframework.beans.factory.support.AbstractAutowireCapableBeanFactory.doCreateBean(AbstractAutowireCapableBeanFactory.java:556)
17-Jun-2019 03:40:52         at org.springframework.beans.factory.support.AbstractAutowireCapableBeanFactory.createBean(AbstractAutowireCapableBeanFactory.java:516)
17-Jun-2019 03:40:52         at org.springframework.beans.factory.support.AbstractBeanFactory.lambda$doGetBean$0(AbstractBeanFactory.java:320)
17-Jun-2019 03:40:52         at org.springframework.beans.factory.support.DefaultSingletonBeanRegistry.getSingleton(DefaultSingletonBeanRegistry.java:222)
17-Jun-2019 03:40:52         at org.springframework.beans.factory.support.AbstractBeanFactory.doGetBean(AbstractBeanFactory.java:318)
17-Jun-2019 03:40:52         at org.springframework.beans.factory.support.AbstractBeanFactory.getBean(AbstractBeanFactory.java:199)
17-Jun-2019 03:40:52         at org.springframework.beans.factory.support.DefaultListableBeanFactory.preInstantiateSingletons(DefaultListableBeanFactory.java:870)
17-Jun-2019 03:40:52         at org.springframework.context.support.AbstractApplicationContext.finishBeanFactoryInitialization(AbstractApplicationContext.java:877)
17-Jun-2019 03:40:52         at org.springframework.context.support.AbstractApplicationContext.refresh(AbstractApplicationContext.java:549)
17-Jun-2019 03:40:52         at org.springframework.boot.SpringApplication.refresh(SpringApplication.java:748)
17-Jun-2019 03:40:52         at org.springframework.boot.SpringApplication.refreshContext(SpringApplication.java:395)
17-Jun-2019 03:40:52         at org.springframework.boot.SpringApplication.run(SpringApplication.java:314)
17-Jun-2019 03:40:52         at org.springframework.boot.test.context.SpringBootContextLoader.loadContext(SpringBootContextLoader.java:124)
17-Jun-2019 03:40:52         at org.springframework.test.context.cache.DefaultCacheAwareContextLoaderDelegate.loadContextInternal(DefaultCacheAwareContextLoaderDelegate.java:99)
17-Jun-2019 03:40:52         at org.springframework.test.context.cache.DefaultCacheAwareContextLoaderDelegate.loadContext(DefaultCacheAwareContextLoaderDelegate.java:124)
17-Jun-2019 03:40:52         ... 32 more
17-Jun-2019 03:40:52 Caused by: java.lang.NoClassDefFoundError: org/springframework/integration/endpoint/Pausable
17-Jun-2019 03:40:52         at java.lang.ClassLoader.defineClass1(Native Method)
17-Jun-2019 03:40:52         at java.lang.ClassLoader.defineClass(ClassLoader.java:763)
17-Jun-2019 03:40:52         at java.security.SecureClassLoader.defineClass(SecureClassLoader.java:142)
17-Jun-2019 03:40:52         at java.net.URLClassLoader.defineClass(URLClassLoader.java:468)
17-Jun-2019 03:40:52         at java.net.URLClassLoader.access$100(URLClassLoader.java:74)
17-Jun-2019 03:40:52         at java.net.URLClassLoader$1.run(URLClassLoader.java:369)
17-Jun-2019 03:40:52         at java.net.URLClassLoader$1.run(URLClassLoader.java:363)
17-Jun-2019 03:40:52         at java.security.AccessController.doPrivileged(Native Method)
17-Jun-2019 03:40:52         at java.net.URLClassLoader.findClass(URLClassLoader.java:362)
17-Jun-2019 03:40:52         at java.lang.ClassLoader.loadClass(ClassLoader.java:424)
17-Jun-2019 03:40:52         at sun.misc.Launcher$AppClassLoader.loadClass(Launcher.java:349)
17-Jun-2019 03:40:52         at java.lang.ClassLoader.loadClass(ClassLoader.java:357)
17-Jun-2019 03:40:52         at java.lang.Class.forName0(Native Method)
17-Jun-2019 03:40:52         at java.lang.Class.forName(Class.java:348)
17-Jun-2019 03:40:52         at sun.reflect.generics.factory.CoreReflectionFactory.makeNamedType(CoreReflectionFactory.java:114)
17-Jun-2019 03:40:52         at sun.reflect.generics.visitor.Reifier.visitClassTypeSignature(Reifier.java:125)
17-Jun-2019 03:40:52         at sun.reflect.generics.tree.ClassTypeSignature.accept(ClassTypeSignature.java:49)
17-Jun-2019 03:40:52         at sun.reflect.generics.visitor.Reifier.reifyTypeArguments(Reifier.java:68)
17-Jun-2019 03:40:52         at sun.reflect.generics.visitor.Reifier.visitClassTypeSignature(Reifier.java:138)
17-Jun-2019 03:40:52         at sun.reflect.generics.tree.ClassTypeSignature.accept(ClassTypeSignature.java:49)
17-Jun-2019 03:40:52         at sun.reflect.generics.repository.MethodRepository.getReturnType(MethodRepository.java:68)
17-Jun-2019 03:40:52         at java.lang.reflect.Method.getGenericReturnType(Method.java:255)
17-Jun-2019 03:40:52         at java.lang.reflect.Method.specificToGenericStringHeader(Method.java:420)
17-Jun-2019 03:40:52         at java.lang.reflect.Executable.sharedToGenericString(Executable.java:163)
17-Jun-2019 03:40:52         at java.lang.reflect.Method.toGenericString(Method.java:415)
17-Jun-2019 03:40:52         at java.beans.MethodRef.set(MethodRef.java:46)
17-Jun-2019 03:40:52         at java.beans.MethodDescriptor.setMethod(MethodDescriptor.java:117)
17-Jun-2019 03:40:52         at java.beans.MethodDescriptor.<init>(MethodDescriptor.java:72)
17-Jun-2019 03:40:52         at java.beans.MethodDescriptor.<init>(MethodDescriptor.java:56)
17-Jun-2019 03:40:52         at java.beans.Introspector.getTargetMethodInfo(Introspector.java:1205)
17-Jun-2019 03:40:52         at java.beans.Introspector.getBeanInfo(Introspector.java:426)
17-Jun-2019 03:40:52         at java.beans.Introspector.getBeanInfo(Introspector.java:173)
17-Jun-2019 03:40:52         at org.springframework.beans.CachedIntrospectionResults.getBeanInfo(CachedIntrospectionResults.java:249)
17-Jun-2019 03:40:52         at org.springframework.beans.CachedIntrospectionResults.<init>(CachedIntrospectionResults.java:273)
17-Jun-2019 03:40:52         at org.springframework.beans.CachedIntrospectionResults.forClass(CachedIntrospectionResults.java:177)
17-Jun-2019 03:40:52         at org.springframework.beans.BeanWrapperImpl.getCachedIntrospectionResults(BeanWrapperImpl.java:174)
17-Jun-2019 03:40:52         at org.springframework.beans.BeanWrapperImpl.getPropertyDescriptors(BeanWrapperImpl.java:248)
17-Jun-2019 03:40:52         at org.springframework.beans.factory.support.AbstractAutowireCapableBeanFactory.filterPropertyDescriptorsForDependencyCheck(AbstractAutowireCapableBeanFactory.java:1581)
17-Jun-2019 03:40:52         at org.springframework.beans.factory.support.AbstractAutowireCapableBeanFactory.filterPropertyDescriptorsForDependencyCheck(AbstractAutowireCapableBeanFactory.java:1561)
17-Jun-2019 03:40:52         at org.springframework.beans.factory.support.AbstractAutowireCapableBeanFactory.populateBean(AbstractAutowireCapableBeanFactory.java:1420)
17-Jun-2019 03:40:52         at org.springframework.beans.factory.support.AbstractAutowireCapableBeanFactory.doCreateBean(AbstractAutowireCapableBeanFactory.java:593)
17-Jun-2019 03:40:52         ... 55 more
17-Jun-2019 03:40:52 Caused by: java.lang.ClassNotFoundException: org.springframework.integration.endpoint.Pausable
17-Jun-2019 03:40:52         at java.net.URLClassLoader.findClass(URLClassLoader.java:382)
17-Jun-2019 03:40:52         at java.lang.ClassLoader.loadClass(ClassLoader.java:424)
17-Jun-2019 03:40:52         at sun.misc.Launcher$AppClassLoader.loadClass(Launcher.java:349)
17-Jun-2019 03:40:52         at java.lang.ClassLoader.loadClass(ClassLoader.java:357)
17-Jun-2019 03:40:52         ... 96 more
17-Jun-2019 03:40:52
17-Jun-2019 03:40:52 testSuccessWithParams(org.springframework.cloud.task.launcher.TaskLauncherSinkTests)  Time elapsed: 0 sec  <<< ERROR!
17-Jun-2019 03:40:52 java.lang.IllegalStateException: Failed to load ApplicationContext
17-Jun-2019 03:40:52         at org.springframework.test.context.cache.DefaultCacheAwareContextLoaderDelegate.loadContext(DefaultCacheAwareContextLoaderDelegate.java:132)
17-Jun-2019 03:40:52         at org.springframework.test.context.support.DefaultTestContext.getApplicationContext(DefaultTestContext.java:122)
17-Jun-2019 03:40:52         at org.springframework.test.context.support.DependencyInjectionTestExecutionListener.injectDependencies(DependencyInjectionTestExecutionListener.java:118)
17-Jun-2019 03:40:52         at org.springframework.test.context.support.DependencyInjectionTestExecutionListener.prepareTestInstance(DependencyInjectionTestExecutionListener.java:83)
17-Jun-2019 03:40:52         at org.springframework.boot.test.autoconfigure.SpringBootDependencyInjectionTestExecutionListener.prepareTestInstance(SpringBootDependencyInjectionTestExecutionListener.java:43)
17-Jun-2019 03:40:52         at org.springframework.test.context.TestContextManager.prepareTestInstance(TestContextManager.java:244)
17-Jun-2019 03:40:52         at org.springframework.test.context.junit4.SpringJUnit4ClassRunner.createTest(SpringJUnit4ClassRunner.java:227)
17-Jun-2019 03:40:52         at org.springframework.test.context.junit4.SpringJUnit4ClassRunner$1.runReflectiveCall(SpringJUnit4ClassRunner.java:289)
17-Jun-2019 03:40:52         at org.junit.internal.runners.model.ReflectiveCallable.run(ReflectiveCallable.java:12)
17-Jun-2019 03:40:52         at org.springframework.test.context.junit4.SpringJUnit4ClassRunner.methodBlock(SpringJUnit4ClassRunner.java:291)
17-Jun-2019 03:40:52         at org.springframework.test.context.junit4.SpringJUnit4ClassRunner.runChild(SpringJUnit4ClassRunner.java:246)
17-Jun-2019 03:40:52         at org.springframework.test.context.junit4.SpringJUnit4ClassRunner.runChild(SpringJUnit4ClassRunner.java:97)
17-Jun-2019 03:40:52         at org.junit.runners.ParentRunner$3.run(ParentRunner.java:290)
17-Jun-2019 03:40:52         at org.junit.runners.ParentRunner$1.schedule(ParentRunner.java:71)
17-Jun-2019 03:40:52         at org.junit.runners.ParentRunner.runChildren(ParentRunner.java:288)
17-Jun-2019 03:40:52         at org.junit.runners.ParentRunner.access$000(ParentRunner.java:58)
17-Jun-2019 03:40:52         at org.junit.runners.ParentRunner$2.evaluate(ParentRunner.java:268)
17-Jun-2019 03:40:52         at org.springframework.test.context.junit4.statements.RunBeforeTestClassCallbacks.evaluate(RunBeforeTestClassCallbacks.java:61)
17-Jun-2019 03:40:52         at org.springframework.test.context.junit4.statements.RunAfterTestClassCallbacks.evaluate(RunAfterTestClassCallbacks.java:70)
17-Jun-2019 03:40:52         at org.junit.runners.ParentRunner.run(ParentRunner.java:363)
17-Jun-2019 03:40:52         at org.springframework.test.context.junit4.SpringJUnit4ClassRunner.run(SpringJUnit4ClassRunner.java:190)
17-Jun-2019 03:40:52         at org.apache.maven.surefire.junit4.JUnit4Provider.execute(JUnit4Provider.java:252)
17-Jun-2019 03:40:52         at org.apache.maven.surefire.junit4.JUnit4Provider.executeTestSet(JUnit4Provider.java:141)
17-Jun-2019 03:40:52         at org.apache.maven.surefire.junit4.JUnit4Provider.invoke(JUnit4Provider.java:112)
17-Jun-2019 03:40:52         at sun.reflect.NativeMethodAccessorImpl.invoke0(Native Method)
17-Jun-2019 03:40:52         at sun.reflect.NativeMethodAccessorImpl.invoke(NativeMethodAccessorImpl.java:62)
17-Jun-2019 03:40:52         at sun.reflect.DelegatingMethodAccessorImpl.invoke(DelegatingMethodAccessorImpl.java:43)
17-Jun-2019 03:40:52         at java.lang.reflect.Method.invoke(Method.java:498)
17-Jun-2019 03:40:52         at org.apache.maven.surefire.util.ReflectionUtils.invokeMethodWithArray(ReflectionUtils.java:189)
17-Jun-2019 03:40:52         at org.apache.maven.surefire.booter.ProviderFactory$ProviderProxy.invoke(ProviderFactory.java:165)
17-Jun-2019 03:40:52         at org.apache.maven.surefire.booter.ProviderFactory.invokeProvider(ProviderFactory.java:85)
17-Jun-2019 03:40:52         at org.apache.maven.surefire.booter.ForkedBooter.runSuitesInProcess(ForkedBooter.java:115)
17-Jun-2019 03:40:52         at org.apache.maven.surefire.booter.ForkedBooter.main(ForkedBooter.java:75)
17-Jun-2019 03:40:52 Caused by: org.springframework.beans.factory.BeanCreationException: Error creating bean with name 'org.springframework.cloud.stream.messaging.Sink': Initialization of bean failed; nested exception is java.lang.NoClassDefFoundError: org/springframework/integration/endpoint/Pausable
17-Jun-2019 03:40:52         at org.springframework.beans.factory.support.AbstractAutowireCapableBeanFactory.doCreateBean(AbstractAutowireCapableBeanFactory.java:602)
17-Jun-2019 03:40:52         at org.springframework.beans.factory.support.AbstractAutowireCapableBeanFactory.createBean(AbstractAutowireCapableBeanFactory.java:516)
17-Jun-2019 03:40:52         at org.springframework.beans.factory.support.AbstractBeanFactory.lambda$doGetBean$0(AbstractBeanFactory.java:320)
17-Jun-2019 03:40:52         at org.springframework.beans.factory.support.DefaultSingletonBeanRegistry.getSingleton(DefaultSingletonBeanRegistry.java:222)
17-Jun-2019 03:40:52         at org.springframework.beans.factory.support.AbstractBeanFactory.doGetBean(AbstractBeanFactory.java:318)
17-Jun-2019 03:40:52         at org.springframework.beans.factory.support.AbstractBeanFactory.getBean(AbstractBeanFactory.java:199)
17-Jun-2019 03:40:52         at org.springframework.beans.factory.support.ConstructorResolver.instantiateUsingFactoryMethod(ConstructorResolver.java:393)
17-Jun-2019 03:40:52         at org.springframework.beans.factory.support.AbstractAutowireCapableBeanFactory.instantiateUsingFactoryMethod(AbstractAutowireCapableBeanFactory.java:1326)
17-Jun-2019 03:40:52         at org.springframework.beans.factory.support.AbstractAutowireCapableBeanFactory.createBeanInstance(AbstractAutowireCapableBeanFactory.java:1165)
17-Jun-2019 03:40:52         at org.springframework.beans.factory.support.AbstractAutowireCapableBeanFactory.doCreateBean(AbstractAutowireCapableBeanFactory.java:556)
17-Jun-2019 03:40:52         at org.springframework.beans.factory.support.AbstractAutowireCapableBeanFactory.createBean(AbstractAutowireCapableBeanFactory.java:516)
17-Jun-2019 03:40:52         at org.springframework.beans.factory.support.AbstractBeanFactory.lambda$doGetBean$0(AbstractBeanFactory.java:320)
17-Jun-2019 03:40:52         at org.springframework.beans.factory.support.DefaultSingletonBeanRegistry.getSingleton(DefaultSingletonBeanRegistry.java:222)
17-Jun-2019 03:40:52         at org.springframework.beans.factory.support.AbstractBeanFactory.doGetBean(AbstractBeanFactory.java:318)
17-Jun-2019 03:40:52         at org.springframework.beans.factory.support.AbstractBeanFactory.getBean(AbstractBeanFactory.java:199)
17-Jun-2019 03:40:52         at org.springframework.beans.factory.support.DefaultListableBeanFactory.preInstantiateSingletons(DefaultListableBeanFactory.java:870)
17-Jun-2019 03:40:52         at org.springframework.context.support.AbstractApplicationContext.finishBeanFactoryInitialization(AbstractApplicationContext.java:877)
17-Jun-2019 03:40:52         at org.springframework.context.support.AbstractApplicationContext.refresh(AbstractApplicationContext.java:549)
17-Jun-2019 03:40:52         at org.springframework.boot.SpringApplication.refresh(SpringApplication.java:748)
17-Jun-2019 03:40:52         at org.springframework.boot.SpringApplication.refreshContext(SpringApplication.java:395)
17-Jun-2019 03:40:52         at org.springframework.boot.SpringApplication.run(SpringApplication.java:314)
17-Jun-2019 03:40:52         at org.springframework.boot.test.context.SpringBootContextLoader.loadContext(SpringBootContextLoader.java:124)
17-Jun-2019 03:40:52         at org.springframework.test.context.cache.DefaultCacheAwareContextLoaderDelegate.loadContextInternal(DefaultCacheAwareContextLoaderDelegate.java:99)
17-Jun-2019 03:40:52         at org.springframework.test.context.cache.DefaultCacheAwareContextLoaderDelegate.loadContext(DefaultCacheAwareContextLoaderDelegate.java:124)
17-Jun-2019 03:40:52         ... 32 more
17-Jun-2019 03:40:52 Caused by: java.lang.NoClassDefFoundError: org/springframework/integration/endpoint/Pausable
17-Jun-2019 03:40:52         at java.lang.ClassLoader.defineClass1(Native Method)
17-Jun-2019 03:40:52         at java.lang.ClassLoader.defineClass(ClassLoader.java:763)
17-Jun-2019 03:40:52         at java.security.SecureClassLoader.defineClass(SecureClassLoader.java:142)
17-Jun-2019 03:40:52         at java.net.URLClassLoader.defineClass(URLClassLoader.java:468)
17-Jun-2019 03:40:52         at java.net.URLClassLoader.access$100(URLClassLoader.java:74)
17-Jun-2019 03:40:52         at java.net.URLClassLoader$1.run(URLClassLoader.java:369)
17-Jun-2019 03:40:52         at java.net.URLClassLoader$1.run(URLClassLoader.java:363)
17-Jun-2019 03:40:52         at java.security.AccessController.doPrivileged(Native Method)
17-Jun-2019 03:40:52         at java.net.URLClassLoader.findClass(URLClassLoader.java:362)
17-Jun-2019 03:40:52         at java.lang.ClassLoader.loadClass(ClassLoader.java:424)
17-Jun-2019 03:40:52         at sun.misc.Launcher$AppClassLoader.loadClass(Launcher.java:349)
17-Jun-2019 03:40:52         at java.lang.ClassLoader.loadClass(ClassLoader.java:357)
17-Jun-2019 03:40:52         at java.lang.Class.forName0(Native Method)
17-Jun-2019 03:40:52         at java.lang.Class.forName(Class.java:348)
17-Jun-2019 03:40:52         at sun.reflect.generics.factory.CoreReflectionFactory.makeNamedType(CoreReflectionFactory.java:114)
17-Jun-2019 03:40:52         at sun.reflect.generics.visitor.Reifier.visitClassTypeSignature(Reifier.java:125)
17-Jun-2019 03:40:52         at sun.reflect.generics.tree.ClassTypeSignature.accept(ClassTypeSignature.java:49)
17-Jun-2019 03:40:52         at sun.reflect.generics.visitor.Reifier.reifyTypeArguments(Reifier.java:68)
17-Jun-2019 03:40:52         at sun.reflect.generics.visitor.Reifier.visitClassTypeSignature(Reifier.java:138)
17-Jun-2019 03:40:52         at sun.reflect.generics.tree.ClassTypeSignature.accept(ClassTypeSignature.java:49)
17-Jun-2019 03:40:52         at sun.reflect.generics.repository.MethodRepository.getReturnType(MethodRepository.java:68)
17-Jun-2019 03:40:52         at java.lang.reflect.Method.getGenericReturnType(Method.java:255)
17-Jun-2019 03:40:52         at java.lang.reflect.Method.specificToGenericStringHeader(Method.java:420)
17-Jun-2019 03:40:52         at java.lang.reflect.Executable.sharedToGenericString(Executable.java:163)
17-Jun-2019 03:40:52         at java.lang.reflect.Method.toGenericString(Method.java:415)
17-Jun-2019 03:40:52         at java.beans.MethodRef.set(MethodRef.java:46)
17-Jun-2019 03:40:52         at java.beans.MethodDescriptor.setMethod(MethodDescriptor.java:117)
17-Jun-2019 03:40:52         at java.beans.MethodDescriptor.<init>(MethodDescriptor.java:72)
17-Jun-2019 03:40:52         at java.beans.MethodDescriptor.<init>(MethodDescriptor.java:56)
17-Jun-2019 03:40:52         at java.beans.Introspector.getTargetMethodInfo(Introspector.java:1205)
17-Jun-2019 03:40:52         at java.beans.Introspector.getBeanInfo(Introspector.java:426)
17-Jun-2019 03:40:52         at java.beans.Introspector.getBeanInfo(Introspector.java:173)
17-Jun-2019 03:40:52         at org.springframework.beans.CachedIntrospectionResults.getBeanInfo(CachedIntrospectionResults.java:249)
17-Jun-2019 03:40:52         at org.springframework.beans.CachedIntrospectionResults.<init>(CachedIntrospectionResults.java:273)
17-Jun-2019 03:40:52         at org.springframework.beans.CachedIntrospectionResults.forClass(CachedIntrospectionResults.java:177)
17-Jun-2019 03:40:52         at org.springframework.beans.BeanWrapperImpl.getCachedIntrospectionResults(BeanWrapperImpl.java:174)
17-Jun-2019 03:40:52         at org.springframework.beans.BeanWrapperImpl.getPropertyDescriptors(BeanWrapperImpl.java:248)
17-Jun-2019 03:40:52         at org.springframework.beans.factory.support.AbstractAutowireCapableBeanFactory.filterPropertyDescriptorsForDependencyCheck(AbstractAutowireCapableBeanFactory.java:1581)
17-Jun-2019 03:40:52         at org.springframework.beans.factory.support.AbstractAutowireCapableBeanFactory.filterPropertyDescriptorsForDependencyCheck(AbstractAutowireCapableBeanFactory.java:1561)
17-Jun-2019 03:40:52         at org.springframework.beans.factory.support.AbstractAutowireCapableBeanFactory.populateBean(AbstractAutowireCapableBeanFactory.java:1420)
17-Jun-2019 03:40:52         at org.springframework.beans.factory.support.AbstractAutowireCapableBeanFactory.doCreateBean(AbstractAutowireCapableBeanFactory.java:593)
17-Jun-2019 03:40:52         ... 55 more
17-Jun-2019 03:40:52 Caused by: java.lang.ClassNotFoundException: org.springframework.integration.endpoint.Pausable
17-Jun-2019 03:40:52         at java.net.URLClassLoader.findClass(URLClassLoader.java:382)
17-Jun-2019 03:40:52         at java.lang.ClassLoader.loadClass(ClassLoader.java:424)
17-Jun-2019 03:40:52         at sun.misc.Launcher$AppClassLoader.loadClass(Launcher.java:349)
17-Jun-2019 03:40:52         at java.lang.ClassLoader.loadClass(ClassLoader.java:357)
17-Jun-2019 03:40:52         ... 96 more
17-Jun-2019 03:40:52
17-Jun-2019 03:40:52 testInvalidJar(org.springframework.cloud.task.launcher.TaskLauncherSinkTests)  Time elapsed: 0.001 sec  <<< ERROR!
17-Jun-2019 03:40:52 java.lang.IllegalStateException: Failed to load ApplicationContext
17-Jun-2019 03:40:52         at org.springframework.test.context.cache.DefaultCacheAwareContextLoaderDelegate.loadContext(DefaultCacheAwareContextLoaderDelegate.java:132)
17-Jun-2019 03:40:52         at org.springframework.test.context.support.DefaultTestContext.getApplicationContext(DefaultTestContext.java:122)
17-Jun-2019 03:40:52         at org.springframework.test.context.support.DependencyInjectionTestExecutionListener.injectDependencies(DependencyInjectionTestExecutionListener.java:118)
17-Jun-2019 03:40:52         at org.springframework.test.context.support.DependencyInjectionTestExecutionListener.prepareTestInstance(DependencyInjectionTestExecutionListener.java:83)
17-Jun-2019 03:40:52         at org.springframework.boot.test.autoconfigure.SpringBootDependencyInjectionTestExecutionListener.prepareTestInstance(SpringBootDependencyInjectionTestExecutionListener.java:43)
17-Jun-2019 03:40:52         at org.springframework.test.context.TestContextManager.prepareTestInstance(TestContextManager.java:244)
17-Jun-2019 03:40:52         at org.springframework.test.context.junit4.SpringJUnit4ClassRunner.createTest(SpringJUnit4ClassRunner.java:227)
17-Jun-2019 03:40:52         at org.springframework.test.context.junit4.SpringJUnit4ClassRunner$1.runReflectiveCall(SpringJUnit4ClassRunner.java:289)
17-Jun-2019 03:40:52         at org.junit.internal.runners.model.ReflectiveCallable.run(ReflectiveCallable.java:12)
17-Jun-2019 03:40:52         at org.springframework.test.context.junit4.SpringJUnit4ClassRunner.methodBlock(SpringJUnit4ClassRunner.java:291)
17-Jun-2019 03:40:52         at org.springframework.test.context.junit4.SpringJUnit4ClassRunner.runChild(SpringJUnit4ClassRunner.java:246)
17-Jun-2019 03:40:52         at org.springframework.test.context.junit4.SpringJUnit4ClassRunner.runChild(SpringJUnit4ClassRunner.java:97)
17-Jun-2019 03:40:52         at org.junit.runners.ParentRunner$3.run(ParentRunner.java:290)
17-Jun-2019 03:40:52         at org.junit.runners.ParentRunner$1.schedule(ParentRunner.java:71)
17-Jun-2019 03:40:52         at org.junit.runners.ParentRunner.runChildren(ParentRunner.java:288)
17-Jun-2019 03:40:52         at org.junit.runners.ParentRunner.access$000(ParentRunner.java:58)
17-Jun-2019 03:40:52         at org.junit.runners.ParentRunner$2.evaluate(ParentRunner.java:268)
17-Jun-2019 03:40:52         at org.springframework.test.context.junit4.statements.RunBeforeTestClassCallbacks.evaluate(RunBeforeTestClassCallbacks.java:61)
17-Jun-2019 03:40:52         at org.springframework.test.context.junit4.statements.RunAfterTestClassCallbacks.evaluate(RunAfterTestClassCallbacks.java:70)
17-Jun-2019 03:40:52         at org.junit.runners.ParentRunner.run(ParentRunner.java:363)
17-Jun-2019 03:40:52         at org.springframework.test.context.junit4.SpringJUnit4ClassRunner.run(SpringJUnit4ClassRunner.java:190)
17-Jun-2019 03:40:52         at org.apache.maven.surefire.junit4.JUnit4Provider.execute(JUnit4Provider.java:252)
17-Jun-2019 03:40:52         at org.apache.maven.surefire.junit4.JUnit4Provider.executeTestSet(JUnit4Provider.java:141)
17-Jun-2019 03:40:52         at org.apache.maven.surefire.junit4.JUnit4Provider.invoke(JUnit4Provider.java:112)
17-Jun-2019 03:40:52         at sun.reflect.NativeMethodAccessorImpl.invoke0(Native Method)
17-Jun-2019 03:40:52         at sun.reflect.NativeMethodAccessorImpl.invoke(NativeMethodAccessorImpl.java:62)
17-Jun-2019 03:40:52         at sun.reflect.DelegatingMethodAccessorImpl.invoke(DelegatingMethodAccessorImpl.java:43)
17-Jun-2019 03:40:52         at java.lang.reflect.Method.invoke(Method.java:498)
17-Jun-2019 03:40:52         at org.apache.maven.surefire.util.ReflectionUtils.invokeMethodWithArray(ReflectionUtils.java:189)
17-Jun-2019 03:40:52         at org.apache.maven.surefire.booter.ProviderFactory$ProviderProxy.invoke(ProviderFactory.java:165)
17-Jun-2019 03:40:52         at org.apache.maven.surefire.booter.ProviderFactory.invokeProvider(ProviderFactory.java:85)
17-Jun-2019 03:40:52         at org.apache.maven.surefire.booter.ForkedBooter.runSuitesInProcess(ForkedBooter.java:115)
17-Jun-2019 03:40:52         at org.apache.maven.surefire.booter.ForkedBooter.main(ForkedBooter.java:75)
17-Jun-2019 03:40:52 Caused by: org.springframework.beans.factory.BeanCreationException: Error creating bean with name 'org.springframework.cloud.stream.messaging.Sink': Initialization of bean failed; nested exception is java.lang.NoClassDefFoundError: org/springframework/integration/endpoint/Pausable
17-Jun-2019 03:40:52         at org.springframework.beans.factory.support.AbstractAutowireCapableBeanFactory.doCreateBean(AbstractAutowireCapableBeanFactory.java:602)
17-Jun-2019 03:40:52         at org.springframework.beans.factory.support.AbstractAutowireCapableBeanFactory.createBean(AbstractAutowireCapableBeanFactory.java:516)
17-Jun-2019 03:40:52         at org.springframework.beans.factory.support.AbstractBeanFactory.lambda$doGetBean$0(AbstractBeanFactory.java:320)
17-Jun-2019 03:40:52         at org.springframework.beans.factory.support.DefaultSingletonBeanRegistry.getSingleton(DefaultSingletonBeanRegistry.java:222)
17-Jun-2019 03:40:52         at org.springframework.beans.factory.support.AbstractBeanFactory.doGetBean(AbstractBeanFactory.java:318)
17-Jun-2019 03:40:52         at org.springframework.beans.factory.support.AbstractBeanFactory.getBean(AbstractBeanFactory.java:199)
17-Jun-2019 03:40:52         at org.springframework.beans.factory.support.ConstructorResolver.instantiateUsingFactoryMethod(ConstructorResolver.java:393)
17-Jun-2019 03:40:52         at org.springframework.beans.factory.support.AbstractAutowireCapableBeanFactory.instantiateUsingFactoryMethod(AbstractAutowireCapableBeanFactory.java:1326)
17-Jun-2019 03:40:52         at org.springframework.beans.factory.support.AbstractAutowireCapableBeanFactory.createBeanInstance(AbstractAutowireCapableBeanFactory.java:1165)
17-Jun-2019 03:40:52         at org.springframework.beans.factory.support.AbstractAutowireCapableBeanFactory.doCreateBean(AbstractAutowireCapableBeanFactory.java:556)
17-Jun-2019 03:40:52         at org.springframework.beans.factory.support.AbstractAutowireCapableBeanFactory.createBean(AbstractAutowireCapableBeanFactory.java:516)
17-Jun-2019 03:40:52         at org.springframework.beans.factory.support.AbstractBeanFactory.lambda$doGetBean$0(AbstractBeanFactory.java:320)
17-Jun-2019 03:40:52         at org.springframework.beans.factory.support.DefaultSingletonBeanRegistry.getSingleton(DefaultSingletonBeanRegistry.java:222)
17-Jun-2019 03:40:52         at org.springframework.beans.factory.support.AbstractBeanFactory.doGetBean(AbstractBeanFactory.java:318)
17-Jun-2019 03:40:52         at org.springframework.beans.factory.support.AbstractBeanFactory.getBean(AbstractBeanFactory.java:199)
17-Jun-2019 03:40:52         at org.springframework.beans.factory.support.DefaultListableBeanFactory.preInstantiateSingletons(DefaultListableBeanFactory.java:870)
17-Jun-2019 03:40:52         at org.springframework.context.support.AbstractApplicationContext.finishBeanFactoryInitialization(AbstractApplicationContext.java:877)
17-Jun-2019 03:40:52         at org.springframework.context.support.AbstractApplicationContext.refresh(AbstractApplicationContext.java:549)
17-Jun-2019 03:40:52         at org.springframework.boot.SpringApplication.refresh(SpringApplication.java:748)
17-Jun-2019 03:40:52         at org.springframework.boot.SpringApplication.refreshContext(SpringApplication.java:395)
17-Jun-2019 03:40:52         at org.springframework.boot.SpringApplication.run(SpringApplication.java:314)
17-Jun-2019 03:40:52         at org.springframework.boot.test.context.SpringBootContextLoader.loadContext(SpringBootContextLoader.java:124)
17-Jun-2019 03:40:52         at org.springframework.test.context.cache.DefaultCacheAwareContextLoaderDelegate.loadContextInternal(DefaultCacheAwareContextLoaderDelegate.java:99)
17-Jun-2019 03:40:52         at org.springframework.test.context.cache.DefaultCacheAwareContextLoaderDelegate.loadContext(DefaultCacheAwareContextLoaderDelegate.java:124)
17-Jun-2019 03:40:52         ... 32 more
17-Jun-2019 03:40:52 Caused by: java.lang.NoClassDefFoundError: org/springframework/integration/endpoint/Pausable
17-Jun-2019 03:40:52         at java.lang.ClassLoader.defineClass1(Native Method)
17-Jun-2019 03:40:52         at java.lang.ClassLoader.defineClass(ClassLoader.java:763)
17-Jun-2019 03:40:52         at java.security.SecureClassLoader.defineClass(SecureClassLoader.java:142)
17-Jun-2019 03:40:52         at java.net.URLClassLoader.defineClass(URLClassLoader.java:468)
17-Jun-2019 03:40:52         at java.net.URLClassLoader.access$100(URLClassLoader.java:74)
17-Jun-2019 03:40:52         at java.net.URLClassLoader$1.run(URLClassLoader.java:369)
17-Jun-2019 03:40:52         at java.net.URLClassLoader$1.run(URLClassLoader.java:363)
17-Jun-2019 03:40:52         at java.security.AccessController.doPrivileged(Native Method)
17-Jun-2019 03:40:52         at java.net.URLClassLoader.findClass(URLClassLoader.java:362)
17-Jun-2019 03:40:52         at java.lang.ClassLoader.loadClass(ClassLoader.java:424)
17-Jun-2019 03:40:52         at sun.misc.Launcher$AppClassLoader.loadClass(Launcher.java:349)
17-Jun-2019 03:40:52         at java.lang.ClassLoader.loadClass(ClassLoader.java:357)
17-Jun-2019 03:40:52         at java.lang.Class.forName0(Native Method)
17-Jun-2019 03:40:52         at java.lang.Class.forName(Class.java:348)
17-Jun-2019 03:40:52         at sun.reflect.generics.factory.CoreReflectionFactory.makeNamedType(CoreReflectionFactory.java:114)
17-Jun-2019 03:40:52         at sun.reflect.generics.visitor.Reifier.visitClassTypeSignature(Reifier.java:125)
17-Jun-2019 03:40:52         at sun.reflect.generics.tree.ClassTypeSignature.accept(ClassTypeSignature.java:49)
17-Jun-2019 03:40:52         at sun.reflect.generics.visitor.Reifier.reifyTypeArguments(Reifier.java:68)
17-Jun-2019 03:40:52         at sun.reflect.generics.visitor.Reifier.visitClassTypeSignature(Reifier.java:138)
17-Jun-2019 03:40:52         at sun.reflect.generics.tree.ClassTypeSignature.accept(ClassTypeSignature.java:49)
17-Jun-2019 03:40:52         at sun.reflect.generics.repository.MethodRepository.getReturnType(MethodRepository.java:68)
17-Jun-2019 03:40:52         at java.lang.reflect.Method.getGenericReturnType(Method.java:255)
17-Jun-2019 03:40:52         at java.lang.reflect.Method.specificToGenericStringHeader(Method.java:420)
17-Jun-2019 03:40:52         at java.lang.reflect.Executable.sharedToGenericString(Executable.java:163)
17-Jun-2019 03:40:52         at java.lang.reflect.Method.toGenericString(Method.java:415)
17-Jun-2019 03:40:52         at java.beans.MethodRef.set(MethodRef.java:46)
17-Jun-2019 03:40:52         at java.beans.MethodDescriptor.setMethod(MethodDescriptor.java:117)
17-Jun-2019 03:40:52         at java.beans.MethodDescriptor.<init>(MethodDescriptor.java:72)
17-Jun-2019 03:40:52         at java.beans.MethodDescriptor.<init>(MethodDescriptor.java:56)
17-Jun-2019 03:40:52         at java.beans.Introspector.getTargetMethodInfo(Introspector.java:1205)
17-Jun-2019 03:40:52         at java.beans.Introspector.getBeanInfo(Introspector.java:426)
17-Jun-2019 03:40:52         at java.beans.Introspector.getBeanInfo(Introspector.java:173)
17-Jun-2019 03:40:52         at org.springframework.beans.CachedIntrospectionResults.getBeanInfo(CachedIntrospectionResults.java:249)
17-Jun-2019 03:40:52         at org.springframework.beans.CachedIntrospectionResults.<init>(CachedIntrospectionResults.java:273)
17-Jun-2019 03:40:52         at org.springframework.beans.CachedIntrospectionResults.forClass(CachedIntrospectionResults.java:177)
17-Jun-2019 03:40:52         at org.springframework.beans.BeanWrapperImpl.getCachedIntrospectionResults(BeanWrapperImpl.java:174)
17-Jun-2019 03:40:52         at org.springframework.beans.BeanWrapperImpl.getPropertyDescriptors(BeanWrapperImpl.java:248)
17-Jun-2019 03:40:52         at org.springframework.beans.factory.support.AbstractAutowireCapableBeanFactory.filterPropertyDescriptorsForDependencyCheck(AbstractAutowireCapableBeanFactory.java:1581)
17-Jun-2019 03:40:52         at org.springframework.beans.factory.support.AbstractAutowireCapableBeanFactory.filterPropertyDescriptorsForDependencyCheck(AbstractAutowireCapableBeanFactory.java:1561)
17-Jun-2019 03:40:52         at org.springframework.beans.factory.support.AbstractAutowireCapableBeanFactory.populateBean(AbstractAutowireCapableBeanFactory.java:1420)
17-Jun-2019 03:40:52         at org.springframework.beans.factory.support.AbstractAutowireCapableBeanFactory.doCreateBean(AbstractAutowireCapableBeanFactory.java:593)
17-Jun-2019 03:40:52         ... 55 more
17-Jun-2019 03:40:52 Caused by: java.lang.ClassNotFoundException: org.springframework.integration.endpoint.Pausable
17-Jun-2019 03:40:52         at java.net.URLClassLoader.findClass(URLClassLoader.java:382)
17-Jun-2019 03:40:52         at java.lang.ClassLoader.loadClass(ClassLoader.java:424)
17-Jun-2019 03:40:52         at sun.misc.Launcher$AppClassLoader.loadClass(Launcher.java:349)
17-Jun-2019 03:40:52         at java.lang.ClassLoader.loadClass(ClassLoader.java:357)
17-Jun-2019 03:40:52         ... 96 more
17-Jun-2019 03:40:52
17-Jun-2019 03:40:52
17-Jun-2019 03:40:52 Results :
17-Jun-2019 03:40:52
17-Jun-2019 03:40:52 Tests in error:
17-Jun-2019 03:40:52   testDefaultConfiguration(org.springframework.cloud.task.listener.TaskEventTests): Unstarted application context org.springframework.boot.test.context.assertj.AssertableApplicationContext[startupFailure=org.springframework.beans.factory.BeanCreationException] failed to start
17-Jun-2019 03:40:52   testPostProcessor(org.springframework.cloud.task.batch.listener.TaskBatchEventListenerBeanPostProcessorTests): Failed to load ApplicationContext
17-Jun-2019 03:40:52   testOrderConfiguration(org.springframework.cloud.task.batch.listener.JobExecutionEventTests): Unstarted application context org.springframework.boot.test.context.assertj.AssertableApplicationContext[startupFailure=org.springframework.beans.factory.BeanCreationException] failed to start
17-Jun-2019 03:40:52   testDisabledSkipEventListener(org.springframework.cloud.task.batch.listener.JobExecutionEventTests): Unstarted application context org.springframework.boot.test.context.assertj.AssertableApplicationContext[startupFailure=org.springframework.beans.factory.BeanCreationException] failed to start
17-Jun-2019 03:40:52   testDisabledItemProcessListener(org.springframework.cloud.task.batch.listener.JobExecutionEventTests): Unstarted application context org.springframework.boot.test.context.assertj.AssertableApplicationContext[startupFailure=org.springframework.beans.factory.BeanCreationException] failed to start
17-Jun-2019 03:40:52   testDefaultConfiguration(org.springframework.cloud.task.batch.listener.JobExecutionEventTests): Unstarted application context org.springframework.boot.test.context.assertj.AssertableApplicationContext[startupFailure=org.springframework.beans.factory.BeanCreationException] failed to start
17-Jun-2019 03:40:52   testDisabledItemReadListener(org.springframework.cloud.task.batch.listener.JobExecutionEventTests): Unstarted application context org.springframework.boot.test.context.assertj.AssertableApplicationContext[startupFailure=org.springframework.beans.factory.BeanCreationException] failed to start
17-Jun-2019 03:40:52   testDisabledJobExecutionListener(org.springframework.cloud.task.batch.listener.JobExecutionEventTests): Unstarted application context org.springframework.boot.test.context.assertj.AssertableApplicationContext[startupFailure=org.springframework.beans.factory.BeanCreationException] failed to start
17-Jun-2019 03:40:52   testDisabledStepExecutionListener(org.springframework.cloud.task.batch.listener.JobExecutionEventTests): Unstarted application context org.springframework.boot.test.context.assertj.AssertableApplicationContext[startupFailure=org.springframework.beans.factory.BeanCreationException] failed to start
17-Jun-2019 03:40:52   testDisabledChunkListener(org.springframework.cloud.task.batch.listener.JobExecutionEventTests): Unstarted application context org.springframework.boot.test.context.assertj.AssertableApplicationContext[startupFailure=org.springframework.beans.factory.BeanCreationException] failed to start
17-Jun-2019 03:40:52   testDisabledItemWriteListener(org.springframework.cloud.task.batch.listener.JobExecutionEventTests): Unstarted application context org.springframework.boot.test.context.assertj.AssertableApplicationContext[startupFailure=org.springframework.beans.factory.BeanCreationException] failed to start
17-Jun-2019 03:40:52   testNoRun(org.springframework.cloud.task.launcher.TaskLauncherSinkTests): Failed to load ApplicationContext
17-Jun-2019 03:40:52   testSuccessWithAppName(org.springframework.cloud.task.launcher.TaskLauncherSinkTests): Failed to load ApplicationContext
17-Jun-2019 03:40:52   testSuccessNoParams(org.springframework.cloud.task.launcher.TaskLauncherSinkTests): Failed to load ApplicationContext
17-Jun-2019 03:40:52   testSuccessWithParams(org.springframework.cloud.task.launcher.TaskLauncherSinkTests): Failed to load ApplicationContext
17-Jun-2019 03:40:52   testInvalidJar(org.springframework.cloud.task.launcher.TaskLauncherSinkTests): Failed to load ApplicationContext
17-Jun-2019 03:40:52
17-Jun-2019 03:40:52 Tests run: 78, Failures: 0, Errors: 16, Skipped: 0
17-Jun-2019 03:40:52
17-Jun-2019 03:40:52 [INFO]
17-Jun-2019 03:40:52 [INFO] ------------------------------------------------------------------------
17-Jun-2019 03:40:52 [INFO] Skipping Spring Cloud Task Build
17-Jun-2019 03:40:52 [INFO] This project has been banned from the build due to previous failures.
17-Jun-2019 03:40:52 [INFO] ------------------------------------------------------------------------
17-Jun-2019 03:40:52 [INFO] ------------------------------------------------------------------------
17-Jun-2019 03:40:52 [INFO] Reactor Summary:
17-Jun-2019 03:40:52 [INFO]
17-Jun-2019 03:40:52 [INFO] Spring Cloud Task Dependencies ..................... SUCCESS [  0.170 s]
17-Jun-2019 03:40:52 [INFO] Spring Cloud Task Build 2.2.0.BUILD-SNAPSHOT ....... SUCCESS [ 56.687 s]
17-Jun-2019 03:40:52 [INFO] Spring Cloud Task Core ............................. SUCCESS [ 27.850 s]
17-Jun-2019 03:40:52 [INFO] Spring Cloud Task Batch ............................ SUCCESS [01:08 min]
17-Jun-2019 03:40:52 [INFO] Spring Cloud Task Stream ........................... FAILURE [  9.398 s]
17-Jun-2019 03:40:52 [INFO] Spring Cloud Task Starter .......................... SKIPPED
17-Jun-2019 03:40:52 [INFO] Timestamp Task ..................................... SKIPPED
17-Jun-2019 03:40:52 [INFO] Batch Job Sample Application ....................... SKIPPED
17-Jun-2019 03:40:52 [INFO] Task Sink Sample Application ....................... SKIPPED
17-Jun-2019 03:40:52 [INFO] Task Processor Sample Application .................. SKIPPED
17-Jun-2019 03:40:52 [INFO] Partitioned Batch Job .............................. SKIPPED
17-Jun-2019 03:40:52 [INFO] Task Events ........................................ SKIPPED
17-Jun-2019 03:40:52 [INFO] Batch Events Sample Application .................... SKIPPED
17-Jun-2019 03:40:52 [INFO] Spring Cloud Task JPA Sample Application ........... SKIPPED
17-Jun-2019 03:40:52 [INFO] Spring Cloud Task Multiple DataSources Application . SKIPPED
17-Jun-2019 03:40:52 [INFO] Spring Cloud Task Samples .......................... SKIPPED
17-Jun-2019 03:40:52 [INFO] Spring Cloud Task Integration Tests ................ SKIPPED
17-Jun-2019 03:40:52 [INFO] Spring Cloud Task Docs 2.2.0.BUILD-SNAPSHOT ........ SKIPPED
17-Jun-2019 03:40:52 [INFO] ------------------------------------------------------------------------
17-Jun-2019 03:40:52 [INFO] BUILD FAILURE
17-Jun-2019 03:40:52 [INFO] ------------------------------------------------------------------------
17-Jun-2019 03:40:52 [INFO] Total time: 02:48 min
17-Jun-2019 03:40:52 [INFO] Finished at: 2019-06-17T03:40:52Z
17-Jun-2019 03:40:52 [INFO] ------------------------------------------------------------------------
17-Jun-2019 03:40:52 [ERROR] Failed to execute goal org.apache.maven.plugins:maven-surefire-plugin:2.12.4:test (default-test) on project spring-cloud-task-stream: There are test failures.
17-Jun-2019 03:40:52 [ERROR]
17-Jun-2019 03:40:52 [ERROR] Please refer to /opt/bamboo-home/xml-data/build-dir/SCT-STASK-JOB1/spring-cloud-task-stream/target/surefire-reports for the individual test results.
17-Jun-2019 03:40:52 [ERROR] -> [Help 1]
17-Jun-2019 03:40:52 [ERROR]
17-Jun-2019 03:40:52 [ERROR] To see the full stack trace of the errors, re-run Maven with the -e switch.
17-Jun-2019 03:40:52 [ERROR] Re-run Maven using the -X switch to enable full debug logging.
17-Jun-2019 03:40:52 [ERROR]
17-Jun-2019 03:40:52 [ERROR] For more information about the errors and possible solutions, please read the following articles:
17-Jun-2019 03:40:52 [ERROR] [Help 1] http://cwiki.apache.org/confluence/display/MAVEN/MojoFailureException
17-Jun-2019 03:40:52 [ERROR]
17-Jun-2019 03:40:52 [ERROR] After correcting the problems, you can resume the build with the command
17-Jun-2019 03:40:52 [ERROR]   mvn <goals> -rf :spring-cloud-task-stream
17-Jun-2019 03:40:52
17-Jun-2019 03:40:52 Failing task since return code of [/opt/jdk-8/bin/java -cp /opt/maven-3.5/boot/plexus-classworlds-2.5.2.jar -Dclassworlds.conf=/tmp/artifactoryM28456853263105934335conf -DbuildInfoConfig.propertiesFile=/tmp/buildInfo1015957150165060974.properties -Xmx2048m -XX:MaxPermSize=2048m -Dmaven.home=/opt/maven-3.5 -Dmaven.multiModuleProjectDirectory=/opt/bamboo-home/xml-data/build-dir/SCT-STASK-JOB1 org.codehaus.plexus.classworlds.launcher.Launcher clean install -Pfull,skipIntegrationTests javadoc:aggregate -Dartifactory.publish.password=********] was 1 while expected 0
17-Jun-2019 03:40:52 Parsing test results under /opt/bamboo-home/xml-data/build-dir/SCT-STASK-JOB1...
17-Jun-2019 03:40:53 Finished task 'Build and publish Spring Cloud Task Modules' with result: Failed
17-Jun-2019 03:40:53 Running post build plugin 'Docker Container Cleanup'
17-Jun-2019 03:40:53 Running post build plugin 'NCover Results Collector'
17-Jun-2019 03:40:53 Running post build plugin 'Artifactory Release Management Staging'
17-Jun-2019 03:40:53 Running post build plugin 'Artifactory Build Info Copier'
17-Jun-2019 03:40:53 Running post build plugin 'Artifactory Gradle Properties Info Copier'
17-Jun-2019 03:40:53 Running post build plugin 'Clover Results Collector'
17-Jun-2019 03:40:53 Running post build plugin 'npm Cache Cleanup'
17-Jun-2019 03:40:53 Running post build plugin 'Artifact Copier'
17-Jun-2019 03:40:53 Publishing an artifact: Test Results
17-Jun-2019 03:40:53 Finished publishing of artifact Non required shared artifact: [Test Results], pattern: [**/target/surefire-reports/**/*.*] in 99.68 ms
17-Jun-2019 03:40:53 Successfully removed working directory at '/opt/bamboo-home/xml-data/build-dir/SCT-STASK-JOB1'
17-Jun-2019 03:40:53 Finalising the build...
17-Jun-2019 03:40:53 Stopping timer.
17-Jun-2019 03:40:53 Build SCT-STASK-JOB1-493 completed.
17-Jun-2019 03:40:53 Running on server: post build plugin 'NCover Results Collector'
17-Jun-2019 03:40:53 Running on server: post build plugin 'Build Hanging Detection Configuration'
17-Jun-2019 03:40:53 Running on server: post build plugin 'Clover Delta Calculator'
17-Jun-2019 03:40:53 Running on server: post build plugin 'Maven Dependencies Postprocessor'
17-Jun-2019 03:40:53 All post build plugins have finished
17-Jun-2019 03:40:53 Generating build results summary...
17-Jun-2019 03:40:53 Saving build results to disk...
17-Jun-2019 03:40:53 Logging substituted variables...
17-Jun-2019 03:40:53 Indexing build results...
17-Jun-2019 03:40:53 Finished building SCT-STASK-JOB1-493.