Build #149

Builds the Spring Cloud Task Master project

Build: #149 failed Scheduled

Logs

The following logs have been generated by the jobs in this branch.
  • Expand all
  • Collapse all
Job Logs
Collapse Build Spring Cloud Task Project Default Stage Download or View
20-Oct-2019 03:36:51 [INFO] Batch Job Sample Application ....................... SUCCESS [  2.781 s]
20-Oct-2019 03:36:51 [INFO] Task Sink Sample Application ....................... SUCCESS [  3.744 s]
20-Oct-2019 03:36:51 [INFO] Task Processor Sample Application .................. SUCCESS [  3.645 s]
20-Oct-2019 03:36:51 [INFO] Task Events ........................................ SUCCESS [  0.863 s]
20-Oct-2019 03:36:51 [INFO] Batch Events Sample Application .................... FAILURE [  6.360 s]
20-Oct-2019 03:36:51 [INFO] Spring Cloud Task Samples 1.0.4.BUILD-SNAPSHOT ..... SKIPPED
20-Oct-2019 03:36:51 [INFO] ------------------------------------------------------------------------
20-Oct-2019 03:36:51 [INFO] BUILD FAILURE
20-Oct-2019 03:36:51 [INFO] ------------------------------------------------------------------------
20-Oct-2019 03:36:51 [INFO] Total time: 01:47 min
20-Oct-2019 03:36:51 [INFO] Finished at: 2019-10-20T03:36:51Z
20-Oct-2019 03:36:51 [INFO] ------------------------------------------------------------------------
20-Oct-2019 03:36:51 [ERROR] Failed to execute goal org.apache.maven.plugins:maven-surefire-plugin:2.18.1:test (default-test) on project batch-events: There are test failures.
20-Oct-2019 03:36:51 [ERROR]
20-Oct-2019 03:36:51 [ERROR] Please refer to /opt/bamboo-home/xml-data/build-dir/SCT-STASK0-JOB1/spring-cloud-task-samples/batch-events/target/surefire-reports for the individual test results.
20-Oct-2019 03:36:51 [ERROR] -> [Help 1]
20-Oct-2019 03:36:51 [ERROR]
20-Oct-2019 03:36:51 [ERROR] To see the full stack trace of the errors, re-run Maven with the -e switch.
20-Oct-2019 03:36:51 [ERROR] Re-run Maven using the -X switch to enable full debug logging.
20-Oct-2019 03:36:51 [ERROR]
20-Oct-2019 03:36:51 [ERROR] For more information about the errors and possible solutions, please read the following articles:
20-Oct-2019 03:36:51 [ERROR] [Help 1] http://cwiki.apache.org/confluence/display/MAVEN/MojoFailureException
20-Oct-2019 03:36:51 [ERROR]
20-Oct-2019 03:36:51 [ERROR] After correcting the problems, you can resume the build with the command
20-Oct-2019 03:36:51 [ERROR]   mvn <goals> -rf :batch-events