Build #491

Builds the Spring Cloud Task Master project

Build: #491 failed Scheduled

Logs

The following logs have been generated by the jobs in this branch.
  • Expand all
  • Collapse all
Job Logs
Collapse Build Spring Cloud Task Project Default Stage Download or View
27-Sep-2020 03:37:05 [INFO] Batch Job Sample Application ....................... SUCCESS [  2.936 s]
27-Sep-2020 03:37:05 [INFO] Task Sink Sample Application ....................... SUCCESS [  3.941 s]
27-Sep-2020 03:37:05 [INFO] Task Processor Sample Application .................. SUCCESS [  3.662 s]
27-Sep-2020 03:37:05 [INFO] Task Events ........................................ SUCCESS [  0.891 s]
27-Sep-2020 03:37:05 [INFO] Batch Events Sample Application .................... FAILURE [  6.818 s]
27-Sep-2020 03:37:05 [INFO] Spring Cloud Task Samples 1.0.4.BUILD-SNAPSHOT ..... SKIPPED
27-Sep-2020 03:37:05 [INFO] ------------------------------------------------------------------------
27-Sep-2020 03:37:05 [INFO] BUILD FAILURE
27-Sep-2020 03:37:05 [INFO] ------------------------------------------------------------------------
27-Sep-2020 03:37:05 [INFO] Total time: 02:01 min
27-Sep-2020 03:37:05 [INFO] Finished at: 2020-09-27T03:37:05Z
27-Sep-2020 03:37:05 [INFO] ------------------------------------------------------------------------
27-Sep-2020 03:37:05 [ERROR] Failed to execute goal org.apache.maven.plugins:maven-surefire-plugin:2.18.1:test (default-test) on project batch-events: There are test failures.
27-Sep-2020 03:37:05 [ERROR]
27-Sep-2020 03:37:05 [ERROR] Please refer to /opt/bamboo-home/xml-data/build-dir/SCT-STASK0-JOB1/spring-cloud-task-samples/batch-events/target/surefire-reports for the individual test results.
27-Sep-2020 03:37:05 [ERROR] -> [Help 1]
27-Sep-2020 03:37:05 [ERROR]
27-Sep-2020 03:37:05 [ERROR] To see the full stack trace of the errors, re-run Maven with the -e switch.
27-Sep-2020 03:37:05 [ERROR] Re-run Maven using the -X switch to enable full debug logging.
27-Sep-2020 03:37:05 [ERROR]
27-Sep-2020 03:37:05 [ERROR] For more information about the errors and possible solutions, please read the following articles:
27-Sep-2020 03:37:05 [ERROR] [Help 1] http://cwiki.apache.org/confluence/display/MAVEN/MojoFailureException
27-Sep-2020 03:37:05 [ERROR]
27-Sep-2020 03:37:05 [ERROR] After correcting the problems, you can resume the build with the command
27-Sep-2020 03:37:05 [ERROR]   mvn <goals> -rf :batch-events