Build #245

Builds the Spring Cloud Task project

Build: #245 failed Scheduled

Logs

The following logs have been generated by the jobs in this branch.
  • Expand all
  • Collapse all
Job Logs
Collapse Build Spring Cloud Task Project Default Stage Download or View
24-Jan-2020 03:37:08 [INFO] Partitioned Batch Job .............................. SUCCESS [  1.012 s]
24-Jan-2020 03:37:08 [INFO] Task Events ........................................ SUCCESS [  0.806 s]
24-Jan-2020 03:37:08 [INFO] Batch Events Sample Application .................... FAILURE [ 11.072 s]
24-Jan-2020 03:37:08 [INFO] Spring Cloud Task Samples .......................... SKIPPED
24-Jan-2020 03:37:08 [INFO] Spring Cloud Task Integration Tests ................ SKIPPED
24-Jan-2020 03:37:08 [INFO] Spring Cloud Task Docs 1.1.3.BUILD-SNAPSHOT ........ SKIPPED
24-Jan-2020 03:37:08 [INFO] ------------------------------------------------------------------------
24-Jan-2020 03:37:08 [INFO] BUILD FAILURE
24-Jan-2020 03:37:08 [INFO] ------------------------------------------------------------------------
24-Jan-2020 03:37:08 [INFO] Total time: 01:57 min
24-Jan-2020 03:37:08 [INFO] Finished at: 2020-01-24T03:37:08Z
24-Jan-2020 03:37:08 [INFO] ------------------------------------------------------------------------
24-Jan-2020 03:37:08 [ERROR] Failed to execute goal org.apache.maven.plugins:maven-surefire-plugin:2.18.1:test (default-test) on project batch-events: There are test failures.
24-Jan-2020 03:37:08 [ERROR]
24-Jan-2020 03:37:08 [ERROR] Please refer to /opt/bamboo-home/xml-data/build-dir/SCT-STASK1-JOB1/spring-cloud-task-samples/batch-events/target/surefire-reports for the individual test results.
24-Jan-2020 03:37:08 [ERROR] -> [Help 1]
24-Jan-2020 03:37:08 [ERROR]
24-Jan-2020 03:37:08 [ERROR] To see the full stack trace of the errors, re-run Maven with the -e switch.
24-Jan-2020 03:37:08 [ERROR] Re-run Maven using the -X switch to enable full debug logging.
24-Jan-2020 03:37:08 [ERROR]
24-Jan-2020 03:37:08 [ERROR] For more information about the errors and possible solutions, please read the following articles:
24-Jan-2020 03:37:08 [ERROR] [Help 1] http://cwiki.apache.org/confluence/display/MAVEN/MojoFailureException
24-Jan-2020 03:37:08 [ERROR]
24-Jan-2020 03:37:08 [ERROR] After correcting the problems, you can resume the build with the command
24-Jan-2020 03:37:08 [ERROR]   mvn <goals> -rf :batch-events