Build: #783 failed Scheduled

Logs

The following logs have been generated by the jobs in this plan.
  • Expand all
  • Collapse all
Job Logs
Collapse Default Job Default Stage Download or View
14-Jan-2019 04:03:24 Download https://repo1.maven.org/maven2/org/springframework/security/spring-security-test/4.0.3.RELEASE/spring-security-test-4.0.3.RELEASE.pom
14-Jan-2019 04:03:24 Download https://repo1.maven.org/maven2/javax/servlet/javax.servlet-api/3.0.1/javax.servlet-api-3.0.1.pom
14-Jan-2019 04:03:25 Download https://repo1.maven.org/maven2/org/springframework/security/spring-security-test/4.0.3.RELEASE/spring-security-test-4.0.3.RELEASE.jar
14-Jan-2019 04:03:27 :spring-statemachine-core:processTestResources
14-Jan-2019 04:03:27 :spring-statemachine-core:testClasses
14-Jan-2019 04:03:46 :spring-statemachine-core:test
14-Jan-2019 04:03:46
14-Jan-2019 04:03:46 org.springframework.statemachine.EventDeferTests > testDeferWithSubsThreadExecutor FAILED
14-Jan-2019 04:03:46     java.lang.AssertionError at EventDeferTests.java:150
14-Jan-2019 04:06:13
14-Jan-2019 04:06:13 420 tests completed, 1 failed
14-Jan-2019 04:06:15 :spring-statemachine-core:test FAILED
14-Jan-2019 04:06:15
14-Jan-2019 04:06:15 FAILURE: Build failed with an exception.
14-Jan-2019 04:06:15
14-Jan-2019 04:06:15 * What went wrong:
14-Jan-2019 04:06:15 Execution failed for task ':spring-statemachine-core:test'.
14-Jan-2019 04:06:15 > There were failing tests. See the report at: file:///opt/bamboo-home/xml-data/build-dir/SDG-B12X-JOB1/spring-statemachine-core/build/reports/tests/index.html
14-Jan-2019 04:06:15
14-Jan-2019 04:06:15 * Try:
14-Jan-2019 04:06:15 Run with --stacktrace option to get the stack trace. Run with --info or --debug option to get more log output.
14-Jan-2019 04:06:15
14-Jan-2019 04:06:15 BUILD FAILED
14-Jan-2019 04:06:15
14-Jan-2019 04:06:15 Total time: 6 mins 6.458 secs