Build: #845 failed Scheduled

Build result summary

Details

Completed
Duration
6 minutes
Labels
None
Agent
bamboo-06.af.pivotal.io
Revision
2d26c9e7c897ee2430b881a84ccec7e4018000c3 2d26c9e7c897ee2430b881a84ccec7e4018000c3
Total tests
629
Failing since
#844 (Scheduled – )
Fixed in
#847 (Scheduled)

Responsible

This build has been failing since #844
No one has taken responsibility

Tests

New test failures 1
Status Test View job Duration
Collapse Failed EventDeferTests testDeferWithSubsThreadExecutor History
Default Job 3 secs
java.lang.AssertionError: java.lang.AssertionError: 
Expected: is <true>
     but: was <false>
java.lang.AssertionError: 
Expected: is <true>
     but: was <false>
	at org.hamcrest.MatcherAssert.assertThat(MatcherAssert.java:20)
	at org.junit.Assert.assertThat(Assert.java:956)
(47 more lines...)
Fixed tests 1
Status Test Failing since View job Duration
Successful EndSmokeTests testEndState History
Failing since build #844 (Scheduled) Default Job < 1 sec