Build: #880 failed Scheduled

Build result summary

Details

Completed
Duration
3 minutes
Labels
None
Agent
bamboo-04.af.pivotal.io
Revision
14f1407ab94edc0c0086cf74f672c245fb8dc705 14f1407ab94edc0c0086cf74f672c245fb8dc705
Total tests
208
Fixed in
#881 (Scheduled)

Responsible

No one has taken responsibility for this failure

Tests

New test failures 1
Status Test View job Duration
Collapse Failed EndSmokeTests testEndState History
Default Job < 1 sec
java.lang.AssertionError: java.lang.AssertionError: 
Expected: is <true>
     but: was <false>
java.lang.AssertionError: 
Expected: is <true>
     but: was <false>
	at org.hamcrest.MatcherAssert.assertThat(MatcherAssert.java:20)
	at org.junit.Assert.assertThat(Assert.java:956)
(47 more lines...)