Build: #783 failed

Job: Default Job failed

Stages & jobs

  1. Default Stage

Job result summary

Completed
Duration
6 minutes
Agent
bamboo-02.af.pivotal.io
Revision
2d26c9e7c897ee2430b881a84ccec7e4018000c3 2d26c9e7c897ee2430b881a84ccec7e4018000c3
Total tests
629
Fixed in
#784 (Scheduled)

Tests

  • 629 tests in total
  • 1 test failed
  • 1 failure is new
  • 4 minutes taken in total.
New test failures 1
Status Test Duration
Collapse Failed EventDeferTests testDeferWithSubsThreadExecutor History
3 secs
java.lang.AssertionError: java.lang.AssertionError: 
Expected: is <true>
     but: was <false>
java.lang.AssertionError: 
Expected: is <true>
     but: was <false>
	at org.hamcrest.MatcherAssert.assertThat(MatcherAssert.java:20)
	at org.junit.Assert.assertThat(Assert.java:956)
(47 more lines...)

Error summary

The build generated some errors. See the full build log for more details.

POM relocation to an other version number is not fully supported in Gradle : xml-apis#xml-apis;2.0.2 relocated to xml-apis#xml-apis;1.0.b2.
Processing of /opt/users/bamboo/.gradle/caches/modules-2/files-2.1/log4j/log4j/1.2.16/88efb1b8d3d993fe339e9e2b201c75eed57d4c65/log4j-1.2.16.pom failed:
    'build.plugins.plugin[io.spring.gradle.dependencymanagement.org.apache.maven.plugins:maven-antrun-plugin].dependencies.dependency.scope' for junit:junit:jar must be one of [compile, runtime, system] but is 'test'. in log4j:log4j:1.2.16
Processing of /opt/users/bamboo/.gradle/caches/modules-2/files-2.1/log4j/log4j/1.2.16/88efb1b8d3d993fe339e9e2b201c75eed57d4c65/log4j-1.2.16.pom failed:
    'build.plugins.plugin[io.spring.gradle.dependencymanagement.org.apache.maven.plugins:maven-antrun-plugin].dependencies.dependency.scope' for junit:junit:jar must be one of [compile, runtime, system] but is 'test'. in log4j:log4j:1.2.16

420 tests completed, 1 failed

FAILURE: Build failed with an exception.

* What went wrong:
Execution failed for task ':spring-statemachine-core:test'.
> There were failing tests. See the report at: file:///opt/bamboo-home/xml-data/build-dir/SDG-B12X-JOB1/spring-statemachine-core/build/reports/tests/index.html

* Try:
Run with --stacktrace option to get the stack trace. Run with --info or --debug option to get more log output.