Build: #127 failed Scheduled

Build result summary

Details

Completed
Duration
7 minutes
Labels
None
Agent
bamboo-13.af.pivotal.io
Revision
efce68bab0336f4a235b176fc33cc720a9d8effd efce68bab0336f4a235b176fc33cc720a9d8effd
Total tests
629
Failing since
#126 (Scheduled – )
Fixed in
#128 (Scheduled)

Responsible

This build has been failing since #126
No one has taken responsibility

Tests

Existing test failures 1
Status Test Failing since View job Duration
java.lang.AssertionError: java.lang.AssertionError: 
Expected: is <true>
     but: was <false>
java.lang.AssertionError: 
Expected: is <true>
     but: was <false>
	at org.hamcrest.MatcherAssert.assertThat(MatcherAssert.java:20)
	at org.junit.Assert.assertThat(Assert.java:956)
(48 more lines...)