Build from master

Build: #1454 failed Changes by Janne Valkealahti

Logs

The following logs have been generated by the jobs in this plan.
  • Expand all
  • Collapse all
Job Logs
Collapse Default Job Default Stage Download or View
13-Jan-2019 09:08:21 :spring-statemachine-core:assemble
13-Jan-2019 09:08:23 :spring-statemachine-core:compileTestJava
13-Jan-2019 09:08:23 :spring-statemachine-core:processTestResources
13-Jan-2019 09:08:23 :spring-statemachine-core:testClasses
13-Jan-2019 09:09:33 :spring-statemachine-core:test
13-Jan-2019 09:09:33
13-Jan-2019 09:09:33 org.springframework.statemachine.EventDeferTests > testDeferWithSubsThreadExecutor FAILED
13-Jan-2019 09:09:33     java.lang.AssertionError at EventDeferTests.java:150
13-Jan-2019 09:11:02
13-Jan-2019 09:11:02 426 tests completed, 1 failed
13-Jan-2019 09:11:02 :spring-statemachine-core:test FAILED
13-Jan-2019 09:11:02
13-Jan-2019 09:11:02 FAILURE: Build failed with an exception.
13-Jan-2019 09:11:02
13-Jan-2019 09:11:02 * What went wrong:
13-Jan-2019 09:11:02 Execution failed for task ':spring-statemachine-core:test'.
13-Jan-2019 09:11:02 > There were failing tests. See the report at: file:///opt/bamboo-home/xml-data/build-dir/SDG-MAS-JOB1/spring-statemachine-core/build/reports/tests/test/index.html
13-Jan-2019 09:11:02
13-Jan-2019 09:11:02 * Try:
13-Jan-2019 09:11:02 Run with --stacktrace option to get the stack trace. Run with --info or --debug option to get more log output. Run with --scan to get full insights.
13-Jan-2019 09:11:02
13-Jan-2019 09:11:02 * Get more help at https://help.gradle.org
13-Jan-2019 09:11:02
13-Jan-2019 09:11:02 BUILD FAILED in 6m 4s
13-Jan-2019 09:11:02 184 actionable tasks: 150 executed, 34 up-to-date