Build from master

Build: #1454 failed Changes by Janne Valkealahti

Test results

  • 635 tests in total
  • 1 test failed
  • 1 failure is new
  • 4 minutes taken in total.
New test failures 1
Status Test View job Duration
Collapse Failed EventDeferTests testDeferWithSubsThreadExecutor History
Default Job 3 secs
java.lang.AssertionError: java.lang.AssertionError: 
Expected: is <true>
     but: was <false>
java.lang.AssertionError: 
Expected: is <true>
     but: was <false>
	at org.hamcrest.MatcherAssert.assertThat(MatcherAssert.java:20)
	at org.junit.Assert.assertThat(Assert.java:956)
(48 more lines...)