Build from master

Build: #1645 failed Changes by Janne Valkealahti

Build result summary

Details

Completed
Duration
5 minutes
Labels
None
Agent
bamboo-11.af.pivotal.io
Revision
efbd72b4d1a0437ca893627b4abb05e30d3f452d efbd72b4d1a0437ca893627b4abb05e30d3f452d
Total tests
209
Fixed in
#1651 (Manual run by Janne Valkealahti)

Responsible

Code commits

Author Commit Message Commit date
Janne Valkealahti Janne Valkealahti efbd72b4d1a0437ca893627b4abb05e30d3f452d efbd72b4d1a0437ca893627b4abb05e30d3f452d Add turnstile reactive docs
- Relates #742

Tests

New test failures 1
Status Test View job Duration
Collapse Failed TimerSmokeTests testDeadlock History
Default Job 1 sec
java.lang.AssertionError: java.lang.AssertionError: 
Expected: is <true>
     but: was <false>
java.lang.AssertionError: 
Expected: is <true>
     but: was <false>
	at org.hamcrest.MatcherAssert.assertThat(MatcherAssert.java:20)
	at org.junit.Assert.assertThat(Assert.java:956)
(47 more lines...)