Build from master

Build: #1646 failed Scheduled

Build result summary

Details

Completed
Duration
5 minutes
Labels
None
Revision
efbd72b4d1a0437ca893627b4abb05e30d3f452d efbd72b4d1a0437ca893627b4abb05e30d3f452d
Total tests
209
Failing since
#1645 (Changes by Janne Valkealahti)
Fixed in
#1651 (Manual run by Janne Valkealahti)

Tests

Responsible

Tests

Existing test failures 1
Status Test Failing since View job Duration
java.lang.AssertionError: java.lang.AssertionError: 
Expected: is <true>
     but: was <false>
java.lang.AssertionError: 
Expected: is <true>
     but: was <false>
	at org.hamcrest.MatcherAssert.assertThat(MatcherAssert.java:20)
	at org.junit.Assert.assertThat(Assert.java:956)
(47 more lines...)