Build from master

Build: #1650 failed Manual run by Janne Valkealahti

Build result summary

Details

Completed
Duration
5 minutes
Labels
None
Agent
bamboo-00.af.pivotal.io
Revision
e76c43870b4c6569e2f01deb492445c0aa7123c3 e76c43870b4c6569e2f01deb492445c0aa7123c3
Total tests
209
Failing since
#1645 (Changes by Janne Valkealahti)
Fixed in
#1651 (Manual run by Janne Valkealahti)

Responsible

Configuration changes

Plan configuration has changed since the last successful build. See the plan audit log for more details.

Tests

Existing test failures 1
Status Test Failing since View job Duration
java.lang.AssertionError: java.lang.AssertionError: 
Expected: is <true>
     but: was <false>
java.lang.AssertionError: 
Expected: is <true>
     but: was <false>
	at org.hamcrest.MatcherAssert.assertThat(MatcherAssert.java:20)
	at org.junit.Assert.assertThat(Assert.java:956)
(48 more lines...)