Build from master

Build: #1652 failed Changes by Janne Valkealahti

Build result summary

Details

Completed
Duration
4 minutes
Labels
None
Revision
d0c692c2e8e7d66a3f9faba609c50256a1018f0f d0c692c2e8e7d66a3f9faba609c50256a1018f0f
Total tests
209
Fixed in
#1655 (Manual run by Janne Valkealahti)

Tests

Responsible

Code commits

Author Commit Message Commit date
Janne Valkealahti Janne Valkealahti d0c692c2e8e7d66a3f9faba609c50256a1018f0f d0c692c2e8e7d66a3f9faba609c50256a1018f0f Add junit5 to build infra
- Fixes #772

Tests

New test failures 1
Status Test View job Duration
Collapse Failed TimerSmokeTests testDeadlock History
Default Job 1 sec
java.lang.AssertionError: java.lang.AssertionError: 
Expected: is <true>
     but: was <false>
java.lang.AssertionError: 
Expected: is <true>
     but: was <false>
	at org.hamcrest.MatcherAssert.assertThat(MatcherAssert.java:20)
	at org.junit.Assert.assertThat(Assert.java:956)
(69 more lines...)