Build from master

Build: #1653 failed Manual run by Janne Valkealahti

Logs

The following logs have been generated by the jobs in this plan.
  • Expand all
  • Collapse all
Job Logs
Collapse Default Job Default Stage Download or View
18-May-2019 08:03:24
18-May-2019 08:03:24 org.springframework.statemachine.buildtests.TimerSmokeTests > testDeadlock FAILED
18-May-2019 08:03:24     java.lang.AssertionError at TimerSmokeTests.java:140
18-May-2019 08:03:24
18-May-2019 08:03:24 200 tests completed, 1 failed
18-May-2019 08:03:26
18-May-2019 08:03:26 > Task :spring-statemachine-build-tests:test FAILED
18-May-2019 08:03:26
18-May-2019 08:03:26 Deprecated Gradle features were used in this build, making it incompatible with Gradle 6.0.
18-May-2019 08:03:26 Use '--warning-mode all' to show the individual deprecation warnings.
18-May-2019 08:03:26 See https://docs.gradle.org/5.4.1/userguide/command_line_interface.html#sec:command_line_warnings
18-May-2019 08:03:26 185 actionable tasks: 150 executed, 35 up-to-date
18-May-2019 08:03:26
18-May-2019 08:03:26 FAILURE: Build failed with an exception.
18-May-2019 08:03:26
18-May-2019 08:03:26 * What went wrong:
18-May-2019 08:03:26 Execution failed for task ':spring-statemachine-build-tests:test'.
18-May-2019 08:03:26 > There were failing tests. See the report at: file:///opt/bamboo-home/xml-data/build-dir/SDG-MAS-JOB1/spring-statemachine-build-tests/build/reports/tests/test/index.html
18-May-2019 08:03:26
18-May-2019 08:03:26 * Try:
18-May-2019 08:03:26 Run with --stacktrace option to get the stack trace. Run with --info or --debug option to get more log output. Run with --scan to get full insights.
18-May-2019 08:03:26
18-May-2019 08:03:26 * Get more help at https://help.gradle.org
18-May-2019 08:03:26
18-May-2019 08:03:26 BUILD FAILED in 4m 40s