Build from master

Build: #1653 failed Manual run by Janne Valkealahti

Test results

  • 209 tests in total
  • 1 test failed
  • 2 minutes taken in total.
Existing test failures 1
Status Test Failing since View job Duration
java.lang.AssertionError: java.lang.AssertionError: 
Expected: is <true>
     but: was <false>
java.lang.AssertionError: 
Expected: is <true>
     but: was <false>
	at org.hamcrest.MatcherAssert.assertThat(MatcherAssert.java:20)
	at org.junit.Assert.assertThat(Assert.java:956)
(69 more lines...)