Build from master

Build: #1654 failed Manual run by Janne Valkealahti

Build result summary

Details

Completed
Duration
7 minutes
Labels
None
Agent
bamboo-08.af.pivotal.io
Revision
d0c692c2e8e7d66a3f9faba609c50256a1018f0f d0c692c2e8e7d66a3f9faba609c50256a1018f0f
Total tests
209
Failing since
#1652 (Changes by Janne Valkealahti)
Fixed in
#1655 (Manual run by Janne Valkealahti)

Responsible

Tests

Existing test failures 1
Status Test Failing since View job Duration
java.lang.AssertionError: java.lang.AssertionError: 
Expected: is <true>
     but: was <false>
java.lang.AssertionError: 
Expected: is <true>
     but: was <false>
	at org.hamcrest.MatcherAssert.assertThat(MatcherAssert.java:20)
	at org.junit.Assert.assertThat(Assert.java:956)
(69 more lines...)