Build from master

Build: #1898 failed Scheduled

Build result summary

Details

Completed
Duration
9 minutes
Labels
None
Agent
bamboo-17.af.pivotal.io
Revision
5324c3e8d542ec40e023f4d2303f06f0aab9b2a9 5324c3e8d542ec40e023f4d2303f06f0aab9b2a9
Total tests
877
Fixed in
#1899 (Scheduled)

Tests

Responsible

No one has taken responsibility for this failure

Tests

New test failures 1
Status Test View job Duration
Collapse Failed StateMachineTests testPlaceOrder() History
Default Job 5 secs
java.lang.AssertionError: java.lang.AssertionError: StateChanged count not matched for machine CUSTOMER_ERROR HANDLE_ORDER MAKE_PRODUCTION_PLAN CHECK_STOCK FILL_ORDER PRODUCE WAIT_PRODUCT JUNCTION_STOCK CHOICE_PRODUCTION JUNCTION_ORDER WAIT_PAYMENT SEND_BILL HANDLE_PAYMENT WAIT_ORDER SEND_REMINDER NOTIFY_CUSTOMER CHOICE_PAYMENT_OK WAIT_NEW_ORDER ORDER_SHIPPED SHIP_ORDER RECEIVE_ORDER FORK CHOICE_HANDLE_ORDER JOIN  /  / uuid=2353269f-776d-4e9a-be33-59f3be3a21fb / id=null
Expected: is <2>
     but: was <3>
java.lang.AssertionError: StateChanged count not matched for machine CUSTOMER_ERROR HANDLE_ORDER MAKE_PRODUCTION_PLAN CHECK_STOCK FILL_ORDER PRODUCE WAIT_PRODUCT JUNCTION_STOCK CHOICE_PRODUCTION JUNCTION_ORDER WAIT_PAYMENT SEND_BILL HANDLE_PAYMENT WAIT_ORDER SEND_REMINDER NOTIFY_CUSTOMER CHOICE_PAYMENT_OK WAIT_NEW_ORDER ORDER_SHIPPED SHIP_ORDER RECEIVE_ORDER FORK CHOICE_HANDLE_ORDER JOIN  /  / uuid=2353269f-776d-4e9a-be33-59f3be3a21fb / id=null
Expected: is <2>
     but: was <3>
	at org.hamcrest.MatcherAssert.assertThat(MatcherAssert.java:18)
	at org.springframework.statemachine.test.StateMachineTestPlan.test(StateMachineTestPlan.java:173)
(89 more lines...)