Build from master

Build: #1902 failed Scheduled

Build result summary

Details

Completed
Duration
5 minutes
Labels
None
Agent
bamboo-19.af.pivotal.io
Revision
5324c3e8d542ec40e023f4d2303f06f0aab9b2a9 5324c3e8d542ec40e023f4d2303f06f0aab9b2a9
Total tests
656
Fixed in
#1903 (Scheduled)

Tests

Responsible

No one has taken responsibility for this failure

Tests

New test failures 1
Status Test View job Duration
Collapse Failed TasksHandlerTests testRunFailAndAutomaticFix() History
Default Job 4 secs
java.lang.AssertionError: java.lang.AssertionError: 
Expected: is <true>
     but: was <false>
java.lang.AssertionError: 
Expected: is <true>
     but: was <false>
	at org.hamcrest.MatcherAssert.assertThat(MatcherAssert.java:18)
	at org.hamcrest.MatcherAssert.assertThat(MatcherAssert.java:6)
(89 more lines...)