Build from master

Build: #1913 failed Changes by Janne Valkealahti

Build result summary

Details

Completed
Duration
6 minutes
Labels
None
Agent
bamboo-21.af.pivotal.io
Revision
b456ea823ac4a718fa1e40f79090c8ceb2f3b49c b456ea823ac4a718fa1e40f79090c8ceb2f3b49c
Total tests
656
Fixed in
#1914 (Changes by Janne Valkealahti)

Tests

Responsible

Code commits

Author Commit Message Commit date
Janne Valkealahti Janne Valkealahti b456ea823ac4a718fa1e40f79090c8ceb2f3b49c b456ea823ac4a718fa1e40f79090c8ceb2f3b49c Fix TimerSmokeTests
- Now doing stop assert in same step where machine
  actually stops which is more reliable way to test.

Tests

New test failures 1
Status Test View job Duration
Collapse Failed TasksHandlerTests testRunOnceSimpleNoFailures() History
Default Job 8 secs
java.lang.AssertionError: java.lang.AssertionError: 
Expected: is <true>
     but: was <false>
java.lang.AssertionError: 
Expected: is <true>
     but: was <false>
	at org.hamcrest.MatcherAssert.assertThat(MatcherAssert.java:18)
	at org.hamcrest.MatcherAssert.assertThat(MatcherAssert.java:6)
(89 more lines...)