Build from master

Build: #1454 failed

Job: Default Job failed

Stages & jobs

  1. Default Stage

Job result summary

Completed
Duration
6 minutes
Agent
bamboo-12.af.pivotal.io
Revision
b30f0ed0b3490d5e216f72461c8247274c20f58f b30f0ed0b3490d5e216f72461c8247274c20f58f
Total tests
635
Fixed in
#1455 (Code changes detected)

Tests

  • 635 tests in total
  • 1 test failed
  • 1 failure is new
  • 4 minutes taken in total.
New test failures 1
Status Test Duration
Collapse Failed EventDeferTests testDeferWithSubsThreadExecutor History
3 secs
java.lang.AssertionError: java.lang.AssertionError: 
Expected: is <true>
     but: was <false>
java.lang.AssertionError: 
Expected: is <true>
     but: was <false>
	at org.hamcrest.MatcherAssert.assertThat(MatcherAssert.java:20)
	at org.junit.Assert.assertThat(Assert.java:956)
(48 more lines...)

Error summary

The build generated some errors. See the full build log for more details.


426 tests completed, 1 failed

FAILURE: Build failed with an exception.

* What went wrong:
Execution failed for task ':spring-statemachine-core:test'.
> There were failing tests. See the report at: file:///opt/bamboo-home/xml-data/build-dir/SDG-MAS-JOB1/spring-statemachine-core/build/reports/tests/test/index.html

* Try:
Run with --stacktrace option to get the stack trace. Run with --info or --debug option to get more log output. Run with --scan to get full insights.

* Get more help at https://help.gradle.org

BUILD FAILED in 6m 4s