Build from master

Build: #1652 failed

Job: Default Job failed

Stages & jobs

  1. Default Stage

Job result summary

Completed
Duration
4 minutes
Revision
d0c692c2e8e7d66a3f9faba609c50256a1018f0f d0c692c2e8e7d66a3f9faba609c50256a1018f0f
Total tests
209
Fixed in
#1655 (Manual run by Janne Valkealahti)

Tests

  • 209 tests in total
  • 1 test failed
  • 1 failure is new
  • 2 minutes taken in total.
New test failures 1
Status Test Duration
Collapse Failed TimerSmokeTests testDeadlock History
1 sec
java.lang.AssertionError: java.lang.AssertionError: 
Expected: is <true>
     but: was <false>
java.lang.AssertionError: 
Expected: is <true>
     but: was <false>
	at org.hamcrest.MatcherAssert.assertThat(MatcherAssert.java:20)
	at org.junit.Assert.assertThat(Assert.java:956)
(69 more lines...)

Error summary

The build generated some errors. See the full build log for more details.

Note: Some input files use or override a deprecated API.
Note: Recompile with -Xlint:deprecation for details.
Note: Some input files use or override a deprecated API.
Note: Recompile with -Xlint:deprecation for details.

200 tests completed, 1 failed

FAILURE: Build failed with an exception.

* What went wrong:
Execution failed for task ':spring-statemachine-build-tests:test'.
> There were failing tests. See the report at: file:///opt/bamboo-home/xml-data/build-dir/SDG-MAS-JOB1/spring-statemachine-build-tests/build/reports/tests/test/index.html

* Try:
Run with --stacktrace option to get the stack trace. Run with --info or --debug option to get more log output. Run with --scan to get full insights.

* Get more help at https://help.gradle.org

BUILD FAILED in 4m 31s