Build from master

Build: #1652 failed

Job: Default Job failed

Stages & jobs

  1. Default Stage

Test results

  • 209 tests in total
  • 1 test failed
  • 1 failure is new
  • 2 minutes taken in total.

Build 1,652 has the following 1 errors: 1 new failure(s) occurred since the previous build.

New test failures 1
Status Test Duration
Collapse Failed TimerSmokeTests testDeadlock History
1 sec
java.lang.AssertionError: java.lang.AssertionError: 
Expected: is <true>
     but: was <false>
java.lang.AssertionError: 
Expected: is <true>
     but: was <false>
	at org.hamcrest.MatcherAssert.assertThat(MatcherAssert.java:20)
	at org.junit.Assert.assertThat(Assert.java:956)
(69 more lines...)