Build from master

Build: #1653 failed

Job: Default Job failed

Stages & jobs

  1. Default Stage

Test results

  • 209 tests in total
  • 1 test failed
  • 2 minutes taken in total.

Build 1,653 has the following 1 errors:There were no new test failures since the previous build.

Existing test failures 1
Status Test Failing since Duration
java.lang.AssertionError: java.lang.AssertionError: 
Expected: is <true>
     but: was <false>
java.lang.AssertionError: 
Expected: is <true>
     but: was <false>
	at org.hamcrest.MatcherAssert.assertThat(MatcherAssert.java:20)
	at org.junit.Assert.assertThat(Assert.java:956)
(69 more lines...)