Build from master using jdk9

Build: #7 failed Changes by Janne Valkealahti

Logs

The following logs have been generated by the jobs in this plan.
  • Expand all
  • Collapse all
Job Logs
Collapse Default Job Default Stage Download or View
10-Nov-2017 09:11:50 Download http://repo.springsource.org/libs-snapshot/org/springframework/boot/spring-boot-starter-tomcat/2.0.0.M6/spring-boot-starter-tomcat-2.0.0.M6.jar
10-Nov-2017 09:11:52 Download http://repo.springsource.org/libs-snapshot/org/springframework/boot/spring-boot-starter-actuator/2.0.0.M6/spring-boot-starter-actuator-2.0.0.M6.pom
10-Nov-2017 09:11:52 Download http://repo.springsource.org/libs-snapshot/org/springframework/boot/spring-boot-actuator-autoconfigure/2.0.0.M6/spring-boot-actuator-autoconfigure-2.0.0.M6.pom
10-Nov-2017 09:11:53 Download http://repo.springsource.org/libs-snapshot/org/springframework/boot/spring-boot-starter-actuator/2.0.0.M6/spring-boot-starter-actuator-2.0.0.M6.jar
10-Nov-2017 09:11:53 Download http://repo.springsource.org/libs-snapshot/org/springframework/boot/spring-boot-actuator-autoconfigure/2.0.0.M6/spring-boot-actuator-autoconfigure-2.0.0.M6.jar
10-Nov-2017 09:11:54 Download http://repo.springsource.org/libs-snapshot/org/springframework/boot/spring-boot-starter-security/2.0.0.M6/spring-boot-starter-security-2.0.0.M6.pom
10-Nov-2017 09:11:55 Download http://repo.springsource.org/libs-snapshot/org/springframework/boot/spring-boot-starter-security/2.0.0.M6/spring-boot-starter-security-2.0.0.M6.jar
10-Nov-2017 09:11:56 Download http://repo.springsource.org/libs-snapshot/org/springframework/boot/spring-boot-starter-websocket/2.0.0.M6/spring-boot-starter-websocket-2.0.0.M6.pom
10-Nov-2017 09:11:56 Download http://repo.springsource.org/libs-snapshot/org/springframework/boot/spring-boot-starter-websocket/2.0.0.M6/spring-boot-starter-websocket-2.0.0.M6.jar
10-Nov-2017 09:12:04 :copyDocsSamples
10-Nov-2017 09:12:05 :asciidoctor FAILED
10-Nov-2017 09:12:05
10-Nov-2017 09:12:05 FAILURE: Build failed with an exception.
10-Nov-2017 09:12:05
10-Nov-2017 09:12:05 * What went wrong:
10-Nov-2017 09:12:05 Execution failed for task ':asciidoctor'.
10-Nov-2017 09:12:05 > java.lang.ExceptionInInitializerError (no error message)
10-Nov-2017 09:12:05
10-Nov-2017 09:12:05 * Try:
10-Nov-2017 09:12:05 Run with --stacktrace option to get the stack trace. Run with --info or --debug option to get more log output.
10-Nov-2017 09:12:05
10-Nov-2017 09:12:05 * Get more help at https://help.gradle.org
10-Nov-2017 09:12:05
10-Nov-2017 09:12:05 BUILD FAILED in 1m 3s
10-Nov-2017 09:12:05 63 actionable tasks: 31 executed, 32 up-to-date