Build from master using jdk9

Build: #9 failed

Job: Default Job failed

Stages & jobs

  1. Default Stage

Build log

The build generated 188 lines of output. Download or view full build log

16-Nov-2017 04:00:00 Build Spring Statemachine - Master JDK9 - Default Job #9 (SDG-MASJDK9-JOB1-9) started building on agent bamboo-07.af.pivotal.io
16-Nov-2017 04:00:00 Remote agent on host bamboo-07.af.pivotal.io
16-Nov-2017 04:00:00 Build working directory is /opt/bamboo-home/xml-data/build-dir/SDG-MASJDK9-JOB1
16-Nov-2017 04:00:00 Executing build Spring Statemachine - Master JDK9 - Default Job #9 (SDG-MASJDK9-JOB1-9)
16-Nov-2017 04:00:00 Starting task 'Checkout Default Repository' of type 'com.atlassian.bamboo.plugins.vcs:task.vcs.checkout'
16-Nov-2017 04:00:00 Updating source code to revision: c2db915306b0c939bc68ebccd7f8c5401f089deb
16-Nov-2017 04:00:00 Creating local git repository in '/opt/bamboo-home/xml-data/build-dir/SDG-MASJDK9-JOB1/.git'.
16-Nov-2017 04:00:00 Initialized empty Git repository in /opt/bamboo-home/xml-data/build-dir/SDG-MASJDK9-JOB1/.git/
16-Nov-2017 04:00:01 Fetching 'refs/heads/master' from 'https://github.com/spring-projects/spring-statemachine.git'.
16-Nov-2017 04:00:08 From https://github.com/spring-projects/spring-statemachine
16-Nov-2017 04:00:08 * [new branch]      master     -> master
16-Nov-2017 04:00:08 * [new tag]         v1.0.0.M1  -> v1.0.0.M1
16-Nov-2017 04:00:08 Checking out revision c2db915306b0c939bc68ebccd7f8c5401f089deb.
16-Nov-2017 04:00:08 Already on 'master'
16-Nov-2017 04:00:08 Updated source code to revision: c2db915306b0c939bc68ebccd7f8c5401f089deb
16-Nov-2017 04:00:08 Finished task 'Checkout Default Repository' with result: Success
16-Nov-2017 04:00:08 Running pre-build action: Artifactory Release Staging
16-Nov-2017 04:00:08 Running pre-build action: VCS Version Collector
16-Nov-2017 04:00:08 Running pre-build action: Hung Build Killer PreBuildAction
16-Nov-2017 04:00:08 Starting task 'Artifactory Gradle' of type 'org.jfrog.bamboo.bamboo-artifactory-plugin:artifactoryGradleTask'
16-Nov-2017 04:00:08 Bamboo Artifactory Plugin version: 2.1.0
16-Nov-2017 04:00:08
Beginning to execute external process for build 'Spring Statemachine - Master JDK9 - Default Job #9 (SDG-MASJDK9-JOB1-9)'
... running command line:
./gradlew clean build -I /tmp/artifactory.init.script9196645430996514848gradle -DbuildInfoConfig.propertiesFile=/tmp/buildinfo4344811960562026058properties artifactoryPublish
... in: /opt/bamboo-home/xml-data/build-dir/SDG-MASJDK9-JOB1
... using extra environment variables:
bamboo_planRepository_1_branch=master
IRBRC=/home/bamboo/.rvm/rubies/ruby-2.3.0/.irbrc
bamboo_signing_store_password=********
bamboo_capability_system_builder_ant_Ant_1_9=/opt/ant-1.9
bamboo_capability_system_builder_ant_Ant_1_8=/opt/ant-1.8
bamboo_planRepository_1_branchDisplayName=master
bamboo_repository_revision_number=c2db915306b0c939bc68ebccd7f8c5401f089deb
bamboo_repository_254541939_git_branch=master
bamboo_RIAK_BIN=/usr/sbin/riak
bamboo_capability_system_builder_node_Node_js_6=/usr/bin/node
WRAPPER_BITS=32
bamboo_buildKey=SDG-MASJDK9-JOB1
rvm_loaded_flag=1
bamboo_sonar_token_password=********
rvm_version=1.27.0 (latest)
PWD=/opt/bamboo-home/bin
bamboo_repository_254541939_previous_revision_number=c2db915306b0c939bc68ebccd7f8c5401f089deb
bamboo_shortJobName=Default Job
bamboo_buildResultsUrl=https://build.spring.io/browse/SDG-MASJDK9-JOB1-9
bamboo_capability_system_builder_gradle___gradlew=./gradlew
bamboo_capability_system_builder_mvn3_Maven_3_3=/opt/maven-3.3
bamboo_capability_system_builder_mvn3_Maven_3_2=/opt/maven-3.2
bamboo_planRepository_repositoryUrl=https://github.com/spring-projects/spring-statemachine.git
bamboo_capability_system_builder_mvn3_Maven_3_1=/opt/maven-3.1
bamboo_capability_system_builder_mvn3_Maven_3_5=/opt/maven-3.5
bamboo_agentId=208568329
MY_RUBY_HOME=/home/bamboo/.rvm/rubies/ruby-2.3.0
bamboo_capability_system_builder_mvn3_Maven_3_0=/opt/maven-3.0
bamboo_repository_254541939_revision_number=c2db915306b0c939bc68ebccd7f8c5401f089deb
rvm_path=/home/bamboo/.rvm
bamboo_planRepository_revision=c2db915306b0c939bc68ebccd7f8c5401f089deb
bamboo_planRepository_previousRevision=c2db915306b0c939bc68ebccd7f8c5401f089deb
bamboo_capability_remote_build=true
bamboo_repository_branch_name=master
SHLVL=1
bamboo_scdf_acceptance_tests_password=********
WRAPPER_OS=linux
JAVA_HOME=/opt/jdk-9/
EC2_HOME=/opt/ec2-api-tools
XDG_SESSION_ID=c1
bamboo_planRepository_branch=master
bamboo_planRepository_1_type=gitv2
bamboo_planRepository_branchName=master
WRAPPER_FILE_SEPARATOR=/
_=/opt/bamboo-home/bin/bamboo-agent.sh
WRAPPER_PATH_SEPARATOR=:
bamboo_sonar_password=********
bamboo_planRepository_type=gitv2
bamboo_planRepository_1_username=markpollack
rvm_stored_umask=0002
GEM_PATH=/home/bamboo/.rvm/gems/ruby-2.3.0:/home/bamboo/.rvm/gems/ruby-2.3.0@global
bamboo_planKey=SDG-MASJDK9
bamboo_JDK8_HOME=/opt/jdk-8
bamboo_planRepository_username=markpollack
NLSPATH=/usr/dt/lib/nls/msg/%L/%N.cat
bamboo_planRepository_1_branchName=master
bamboo_sonar_version=5.6.3
XDG_DATA_DIRS=/usr/local/share:/usr/share:/var/lib/snapd/desktop
bamboo_resultsUrl=https://build.spring.io/browse/SDG-MASJDK9-JOB1-9
bamboo_planRepository_1_name=Git
bamboo_build_working_directory=/opt/bamboo-home/xml-data/build-dir/SDG-MASJDK9-JOB1
bamboo_capability_system_os=ubuntu1604
bamboo_nexusPush_stagingProfile=buildmaster
bamboo_shortPlanName=Master JDK9
MAIL=/var/mail/bamboo
bamboo_planRepository_name=Git
LOGNAME=bamboo
bamboo_buildNumber=9
rvm_user_install_flag=1
SHELL=/bin/bash
bamboo_repository_254541939_branch_name=master
bamboo_JDK7_HOME=/opt/jdk-7
bamboo_planName=Spring Statemachine - Master JDK9
bamboo_shortPlanKey=MASJDK9
OLDPWD=/opt/users/bamboo
GEM_HOME=/home/bamboo/.rvm/gems/ruby-2.3.0
bamboo_shortJobKey=JOB1
bamboo_repository_previous_revision_number=c2db915306b0c939bc68ebccd7f8c5401f089deb
bamboo_buildTimeStamp=2017-11-16T04:00:00.535Z
RUBY_VERSION=ruby-2.3.0
bamboo_sonar_username=buildmaster
_system_name=Ubuntu
bamboo_buildResultKey=SDG-MASJDK9-JOB1-9
bamboo_repository_git_branch=master
bamboo_nexusPush_close=true
bamboo_buildPlanName=Spring Statemachine - Master JDK9 - Default Job
bamboo_planRepository_1_revision=c2db915306b0c939bc68ebccd7f8c5401f089deb
_system_arch=x86_64
bamboo_repository_name=Git
rvm_bin_path=/home/bamboo/.rvm/bin
bamboo_signing_key_password=********
XFILESEARCHPATH=/usr/dt/app-defaults/%L/Dt
rvm_prefix=/home/bamboo
LANG=en_US.UTF-8
bamboo_capability_system_docker_executable=/usr/bin/docker
bamboo_repository_254541939_git_username=markpollack
DISPLAY=localhost:1.0
bamboo_capability_system_builder_groovy_Groovy_2_4=/opt/groovy-2.4
bamboo_capability_system_builder_command_Bash=/bin/bash
bamboo_agentWorkingDirectory=/opt/bamboo-home/xml-data/build-dir
bamboo_capability_system_git_executable=/usr/bin/git
bamboo_planRepository_1_previousRevision=c2db915306b0c939bc68ebccd7f8c5401f089deb
bamboo_repository_git_username=markpollack
bamboo_capability_os_family=unix
NVM_NODEJS_ORG_MIRROR=http://nodejs.org/dist
bamboo_planRepository_branchDisplayName=master
bamboo_repository_254541939_name=Git
NODE_PATH=/usr/lib/nodejs:/usr/lib/node_modules:/usr/share/javascript
bamboo_capability_system_builder_maven_Artifactory_Maven_3_5=/opt/maven-3.5
GIT_SSL_NO_VERIFY=true
bamboo_capability_system_builder_maven_Artifactory_Maven_3_3=/opt/maven-3.3
NVM_DIR=/home/bamboo/.nvm
bamboo_s3_properties=/home/bamboo/tools/s3.properties
bamboo_capability_system_builder_maven_Artifactory_Maven_3_2=/opt/maven-3.2
bamboo_capability_system_builder_maven_Artifactory_Maven_3_1=/opt/maven-3.1
bamboo_capability_system_builder_maven_Artifactory_Maven_3_0=/opt/maven-3.0
_system_type=Linux
bamboo_plan_storageTag=plan-254345446
_system_version=16.04
USER=bamboo
bamboo_repository_git_repositoryUrl=https://github.com/spring-projects/spring-statemachine.git
bamboo_repository_254541939_git_repositoryUrl=https://github.com/spring-projects/spring-statemachine.git
bamboo_working_directory=/opt/bamboo-home/xml-data/build-dir/SDG-MASJDK9-JOB1
bamboo_planRepository_1_repositoryUrl=https://github.com/spring-projects/spring-statemachine.git
bamboo_capability_system_jdk_JDK_1_8=/opt/jdk-8
bamboo_capability_system_jdk_JDK_1_9=/opt/jdk-9
WRAPPER_ARCH=x86
bamboo_capability_system_jdk_JDK_1_6=/opt/jdk-6
bamboo_sonar_ip=10.194.6.9
bamboo_capability_system_jdk_JDK_1_7=/opt/jdk-7
XDG_RUNTIME_DIR=/run/user/505
HOME=/home/bamboo
PATH=/bin:/home/bamboo/.rvm/gems/ruby-2.3.0/bin:/home/bamboo/.rvm/gems/ruby-2.3.0@global/bin:/home/bamboo/.rvm/rubies/ruby-2.3.0/bin:/home/bamboo/bin:/usr/local/bin:/usr/bin:/bin:/usr/local/games:/usr/games:/snap/bin:/home/bamboo/bin:/usr/local/bin:/opt/ec2-api-tools/bin:/home/bamboo/.rvm/bin:/bin:/home/bamboo/.rvm/gems/ruby-2.3.0/bin:/home/bamboo/.rvm/gems/ruby-2.3.0@global/bin:/home/bamboo/.rvm/rubies/ruby-2.3.0/bin:/home/bamboo/bin:/usr/local/bin:/usr/bin:/bin:/usr/local/games:/usr/games:/snap/bin:/home/bamboo/bin:/usr/local/bin:/opt/ec2-api-tools/bin:/home/bamboo/.rvm/bin
16-Nov-2017 04:00:12 Starting a Gradle Daemon (subsequent builds will be faster)
16-Nov-2017 04:00:25 Cannot publish pom for project ':' since it does not contain the Maven plugin install task and task ':artifactoryPublish' does not specify a custom pom path.
16-Nov-2017 04:00:25 Cannot publish pom for project ':' since it does not contain the Maven plugin install task and task ':artifactoryPublish' does not specify a custom pom path.
16-Nov-2017 04:00:25 Cannot publish pom for project ':' since it does not contain the Maven plugin install task and task ':artifactoryPublish' does not specify a custom pom path.
16-Nov-2017 04:00:25 Cannot publish pom for project ':' since it does not contain the Maven plugin install task and task ':artifactoryPublish' does not specify a custom pom path.
16-Nov-2017 04:00:25 Cannot publish pom for project ':' since it does not contain the Maven plugin install task and task ':artifactoryPublish' does not specify a custom pom path.
16-Nov-2017 04:00:25 Cannot publish pom for project ':' since it does not contain the Maven plugin install task and task ':artifactoryPublish' does not specify a custom pom path.
16-Nov-2017 04:00:25 Cannot publish pom for project ':' since it does not contain the Maven plugin install task and task ':artifactoryPublish' does not specify a custom pom path.
16-Nov-2017 04:00:25 Cannot publish pom for project ':' since it does not contain the Maven plugin install task and task ':artifactoryPublish' does not specify a custom pom path.
16-Nov-2017 04:00:25 Cannot publish pom for project ':' since it does not contain the Maven plugin install task and task ':artifactoryPublish' does not specify a custom pom path.
16-Nov-2017 04:00:26 Cannot publish pom for project ':' since it does not contain the Maven plugin install task and task ':artifactoryPublish' does not specify a custom pom path.
16-Nov-2017 04:00:26 Cannot publish pom for project ':' since it does not contain the Maven plugin install task and task ':artifactoryPublish' does not specify a custom pom path.
16-Nov-2017 04:00:26 Cannot publish pom for project ':' since it does not contain the Maven plugin install task and task ':artifactoryPublish' does not specify a custom pom path.
16-Nov-2017 04:00:26 Cannot publish pom for project ':' since it does not contain the Maven plugin install task and task ':artifactoryPublish' does not specify a custom pom path.
16-Nov-2017 04:00:26 Cannot publish pom for project ':' since it does not contain the Maven plugin install task and task ':artifactoryPublish' does not specify a custom pom path.
16-Nov-2017 04:00:26 Cannot publish pom for project ':' since it does not contain the Maven plugin install task and task ':artifactoryPublish' does not specify a custom pom path.
16-Nov-2017 04:00:26 Cannot publish pom for project ':' since it does not contain the Maven plugin install task and task ':artifactoryPublish' does not specify a custom pom path.
16-Nov-2017 04:00:26 Cannot publish pom for project ':' since it does not contain the Maven plugin install task and task ':artifactoryPublish' does not specify a custom pom path.
16-Nov-2017 04:00:26 Cannot publish pom for project ':' since it does not contain the Maven plugin install task and task ':artifactoryPublish' does not specify a custom pom path.
16-Nov-2017 04:00:26 Cannot publish pom for project ':' since it does not contain the Maven plugin install task and task ':artifactoryPublish' does not specify a custom pom path.
16-Nov-2017 04:00:26 Cannot publish pom for project ':' since it does not contain the Maven plugin install task and task ':artifactoryPublish' does not specify a custom pom path.
16-Nov-2017 04:00:26 Cannot publish pom for project ':' since it does not contain the Maven plugin install task and task ':artifactoryPublish' does not specify a custom pom path.
16-Nov-2017 04:00:26 Cannot publish pom for project ':' since it does not contain the Maven plugin install task and task ':artifactoryPublish' does not specify a custom pom path.
16-Nov-2017 04:00:26 Cannot publish pom for project ':' since it does not contain the Maven plugin install task and task ':artifactoryPublish' does not specify a custom pom path.
16-Nov-2017 04:00:26 Cannot publish pom for project ':' since it does not contain the Maven plugin install task and task ':artifactoryPublish' does not specify a custom pom path.
16-Nov-2017 04:00:26 Cannot publish pom for project ':' since it does not contain the Maven plugin install task and task ':artifactoryPublish' does not specify a custom pom path.
16-Nov-2017 04:00:26 Cannot publish pom for project ':' since it does not contain the Maven plugin install task and task ':artifactoryPublish' does not specify a custom pom path.
16-Nov-2017 04:00:26 Cannot publish pom for project ':' since it does not contain the Maven plugin install task and task ':artifactoryPublish' does not specify a custom pom path.
16-Nov-2017 04:00:26 Cannot publish pom for project ':' since it does not contain the Maven plugin install task and task ':artifactoryPublish' does not specify a custom pom path.
16-Nov-2017 04:00:26 Cannot publish pom for project ':' since it does not contain the Maven plugin install task and task ':artifactoryPublish' does not specify a custom pom path.
16-Nov-2017 04:00:26 Cannot publish pom for project ':' since it does not contain the Maven plugin install task and task ':artifactoryPublish' does not specify a custom pom path.
16-Nov-2017 04:00:26 Cannot publish pom for project ':' since it does not contain the Maven plugin install task and task ':artifactoryPublish' does not specify a custom pom path.
16-Nov-2017 04:00:26 Cannot publish pom for project ':' since it does not contain the Maven plugin install task and task ':artifactoryPublish' does not specify a custom pom path.
16-Nov-2017 04:00:27 :clean UP-TO-DATE
16-Nov-2017 04:00:27 :spring-statemachine-bom:clean UP-TO-DATE
16-Nov-2017 04:00:27 :spring-statemachine-boot:clean UP-TO-DATE
16-Nov-2017 04:00:27 :spring-statemachine-build-tests:clean UP-TO-DATE
16-Nov-2017 04:00:27 :spring-statemachine-cluster:clean UP-TO-DATE
16-Nov-2017 04:00:27 :spring-statemachine-core:clean UP-TO-DATE
16-Nov-2017 04:00:27 :spring-statemachine-data-common:clean UP-TO-DATE
16-Nov-2017 04:00:27 :spring-statemachine-kryo:clean UP-TO-DATE
16-Nov-2017 04:00:27 :spring-statemachine-recipes-common:clean UP-TO-DATE
16-Nov-2017 04:00:27 :spring-statemachine-redis:clean UP-TO-DATE
16-Nov-2017 04:00:27 :spring-statemachine-samples-common:clean UP-TO-DATE
16-Nov-2017 04:00:27 :spring-statemachine-test:clean UP-TO-DATE
16-Nov-2017 04:00:27 :spring-statemachine-uml:clean UP-TO-DATE
16-Nov-2017 04:00:27 :spring-statemachine-zookeeper:clean UP-TO-DATE
16-Nov-2017 04:00:27 :spring-statemachine-data-common:spring-statemachine-data-jpa:clean UP-TO-DATE
16-Nov-2017 04:00:27 :spring-statemachine-data-common:spring-statemachine-data-mongodb:clean UP-TO-DATE
16-Nov-2017 04:00:27 :spring-statemachine-data-common:spring-statemachine-data-redis:clean UP-TO-DATE
16-Nov-2017 04:00:27 :spring-statemachine-samples-common:spring-statemachine-samples-cdplayer:clean UP-TO-DATE
16-Nov-2017 04:00:27 :spring-statemachine-samples-common:spring-statemachine-samples-datajpa:clean UP-TO-DATE
16-Nov-2017 04:00:27 :spring-statemachine-samples-common:spring-statemachine-samples-deploy:clean UP-TO-DATE
16-Nov-2017 04:00:27 :spring-statemachine-samples-common:spring-statemachine-samples-eventservice:clean UP-TO-DATE
16-Nov-2017 04:00:27 :spring-statemachine-samples-common:spring-statemachine-samples-monitoring:clean UP-TO-DATE
16-Nov-2017 04:00:27 :spring-statemachine-samples-common:spring-statemachine-samples-ordershipping:clean UP-TO-DATE
16-Nov-2017 04:00:27 :spring-statemachine-samples-common:spring-statemachine-samples-persist:clean UP-TO-DATE
16-Nov-2017 04:00:27 :spring-statemachine-samples-common:spring-statemachine-samples-scope:clean UP-TO-DATE
16-Nov-2017 04:00:27 :spring-statemachine-samples-common:spring-statemachine-samples-security:clean UP-TO-DATE
16-Nov-2017 04:00:27 :spring-statemachine-samples-common:spring-statemachine-samples-showcase:clean UP-TO-DATE
16-Nov-2017 04:00:27 :spring-statemachine-samples-common:spring-statemachine-samples-tasks:clean UP-TO-DATE
16-Nov-2017 04:00:27 :spring-statemachine-samples-common:spring-statemachine-samples-turnstile:clean UP-TO-DATE
16-Nov-2017 04:00:27 :spring-statemachine-samples-common:spring-statemachine-samples-washer:clean UP-TO-DATE
16-Nov-2017 04:00:27 :spring-statemachine-samples-common:spring-statemachine-samples-web:clean UP-TO-DATE
16-Nov-2017 04:00:27 :spring-statemachine-samples-common:spring-statemachine-samples-zookeeper:clean UP-TO-DATE
16-Nov-2017 04:00:33 :spring-statemachine-core:compileJava
16-Nov-2017 04:00:33 :spring-statemachine-core:processResources NO-SOURCE
16-Nov-2017 04:00:33 :spring-statemachine-core:classes
16-Nov-2017 04:00:33 :spring-statemachine-core:jar
16-Nov-2017 04:00:34 :spring-statemachine-data-common:compileJava
16-Nov-2017 04:00:34 :spring-statemachine-data-common:processResources NO-SOURCE
16-Nov-2017 04:00:34 :spring-statemachine-data-common:classes
16-Nov-2017 04:00:34 :spring-statemachine-data-common:jar
16-Nov-2017 04:00:35 :spring-statemachine-data-common:spring-statemachine-data-jpa:compileJava
16-Nov-2017 04:00:35 :spring-statemachine-data-common:spring-statemachine-data-jpa:processResources NO-SOURCE
16-Nov-2017 04:00:35 :spring-statemachine-data-common:spring-statemachine-data-jpa:classes
16-Nov-2017 04:00:35 :spring-statemachine-data-common:spring-statemachine-data-jpa:jar
16-Nov-2017 04:00:36 :spring-statemachine-data-common:spring-statemachine-data-mongodb:compileJava
16-Nov-2017 04:00:36 :spring-statemachine-data-common:spring-statemachine-data-mongodb:processResources NO-SOURCE
16-Nov-2017 04:00:36 :spring-statemachine-data-common:spring-statemachine-data-mongodb:classes
16-Nov-2017 04:00:36 :spring-statemachine-data-common:spring-statemachine-data-mongodb:jar
16-Nov-2017 04:00:36 :spring-statemachine-data-common:spring-statemachine-data-redis:compileJava
16-Nov-2017 04:00:36 :spring-statemachine-data-common:spring-statemachine-data-redis:processResources NO-SOURCE
16-Nov-2017 04:00:36 :spring-statemachine-data-common:spring-statemachine-data-redis:classes
16-Nov-2017 04:00:36 :spring-statemachine-data-common:spring-statemachine-data-redis:jar
16-Nov-2017 04:00:41 :spring-statemachine-boot:compileJava
16-Nov-2017 04:00:41 :spring-statemachine-boot:processResources
16-Nov-2017 04:00:41 :spring-statemachine-boot:classes
16-Nov-2017 04:00:41 :spring-statemachine-boot:jar
16-Nov-2017 04:00:41 :spring-statemachine-kryo:compileJava
16-Nov-2017 04:00:41 :spring-statemachine-kryo:processResources NO-SOURCE
16-Nov-2017 04:00:41 :spring-statemachine-kryo:classes
16-Nov-2017 04:00:41 :spring-statemachine-kryo:jar
16-Nov-2017 04:00:42 :spring-statemachine-zookeeper:compileJava
16-Nov-2017 04:00:42 :spring-statemachine-zookeeper:processResources NO-SOURCE
16-Nov-2017 04:00:42 :spring-statemachine-zookeeper:classes
16-Nov-2017 04:00:42 :spring-statemachine-zookeeper:jar
16-Nov-2017 04:00:43 :spring-statemachine-cluster:compileJava
16-Nov-2017 04:00:43 :spring-statemachine-cluster:processResources NO-SOURCE
16-Nov-2017 04:00:43 :spring-statemachine-cluster:classes
16-Nov-2017 04:00:43 :spring-statemachine-cluster:jar
16-Nov-2017 04:00:43 :spring-statemachine-recipes-common:compileJava
16-Nov-2017 04:00:43 :spring-statemachine-recipes-common:processResources NO-SOURCE
16-Nov-2017 04:00:43 :spring-statemachine-recipes-common:classes
16-Nov-2017 04:00:43 :spring-statemachine-recipes-common:jar
16-Nov-2017 04:00:43 :spring-statemachine-redis:compileJava
16-Nov-2017 04:00:43 :spring-statemachine-redis:processResources NO-SOURCE
16-Nov-2017 04:00:43 :spring-statemachine-redis:classes
16-Nov-2017 04:00:43 :spring-statemachine-redis:jar
16-Nov-2017 04:00:44 :spring-statemachine-samples-common:compileJava
16-Nov-2017 04:00:44 :spring-statemachine-samples-common:processResources
16-Nov-2017 04:00:44 :spring-statemachine-samples-common:classes
16-Nov-2017 04:00:44 :spring-statemachine-samples-common:jar
16-Nov-2017 04:00:45 :spring-statemachine-uml:compileJava
16-Nov-2017 04:00:45 :spring-statemachine-uml:processResources NO-SOURCE
16-Nov-2017 04:00:45 :spring-statemachine-uml:classes
16-Nov-2017 04:00:45 :spring-statemachine-uml:jar
16-Nov-2017 04:01:00 :api
16-Nov-2017 04:01:01 :copyDocsSamples
16-Nov-2017 04:01:01 :asciidoctor FAILED
16-Nov-2017 04:01:01
16-Nov-2017 04:01:01 FAILURE: Build failed with an exception.
16-Nov-2017 04:01:01
16-Nov-2017 04:01:01 * What went wrong:
16-Nov-2017 04:01:01 Execution failed for task ':asciidoctor'.
16-Nov-2017 04:01:01 > java.lang.ExceptionInInitializerError (no error message)
16-Nov-2017 04:01:01
16-Nov-2017 04:01:01 * Try:
16-Nov-2017 04:01:01 Run with --stacktrace option to get the stack trace. Run with --info or --debug option to get more log output.
16-Nov-2017 04:01:01
16-Nov-2017 04:01:01 * Get more help at https://help.gradle.org
16-Nov-2017 04:01:01
16-Nov-2017 04:01:01 BUILD FAILED in 51s
16-Nov-2017 04:01:01 63 actionable tasks: 31 executed, 32 up-to-date
16-Nov-2017 04:01:02
16-Nov-2017 04:01:02 Failing task since return code of [./gradlew clean build -I /tmp/artifactory.init.script9196645430996514848gradle -DbuildInfoConfig.propertiesFile=/tmp/buildinfo4344811960562026058properties artifactoryPublish] was 1 while expected 0
16-Nov-2017 04:01:02 Parsing test results under /opt/bamboo-home/xml-data/build-dir/SDG-MASJDK9-JOB1...
16-Nov-2017 04:01:02 Finished task 'Artifactory Gradle' with result: Failed
16-Nov-2017 04:01:02 Starting task 'JUnit Parser' of type 'com.atlassian.bamboo.plugins.testresultparser:task.testresultparser.junit'
16-Nov-2017 04:01:02 Parsing test results under /opt/bamboo-home/xml-data/build-dir/SDG-MASJDK9-JOB1...
16-Nov-2017 04:01:02 Failing task since test cases were expected but none were found.
16-Nov-2017 04:01:02 Finished task 'JUnit Parser' with result: Failed
16-Nov-2017 04:01:02 Running post build plugin 'Docker Container Cleanup'
16-Nov-2017 04:01:02 Running post build plugin 'NCover Results Collector'
16-Nov-2017 04:01:02 Running post build plugin 'Artifactory Release Management Staging'
16-Nov-2017 04:01:02 Running post build plugin 'Artifactory Build Info Copier'
16-Nov-2017 04:01:02 Running post build plugin 'Artifactory Gradle Properties Info Copier'
16-Nov-2017 04:01:02 Running post build plugin 'Clover Results Collector'
16-Nov-2017 04:01:02 Running post build plugin 'npm Cache Cleanup'
16-Nov-2017 04:01:02 Running post build plugin 'Artifact Copier'
16-Nov-2017 04:01:02 Publishing an artifact: Test Results
16-Nov-2017 04:01:02 Finished publishing of artifact Job artifact: [Test Results], pattern: [**/build/reports/**] in 138.9 ms
16-Nov-2017 04:01:02 Successfully removed working directory at '/opt/bamboo-home/xml-data/build-dir/SDG-MASJDK9-JOB1'
16-Nov-2017 04:01:02 Finalising the build...
16-Nov-2017 04:01:02 Stopping timer.
16-Nov-2017 04:01:02 Build SDG-MASJDK9-JOB1-9 completed.
16-Nov-2017 04:01:02 Running on server: post build plugin 'NCover Results Collector'
16-Nov-2017 04:01:02 Running on server: post build plugin 'Build Hanging Detection Configuration'
16-Nov-2017 04:01:02 Running on server: post build plugin 'Clover Delta Calculator'
16-Nov-2017 04:01:02 Running on server: post build plugin 'Maven Dependencies Postprocessor'
16-Nov-2017 04:01:02 All post build plugins have finished
16-Nov-2017 04:01:02 Generating build results summary...
16-Nov-2017 04:01:02 Saving build results to disk...
16-Nov-2017 04:01:02 Logging substituted variables...
16-Nov-2017 04:01:02 Indexing build results...
16-Nov-2017 04:01:02 Finished building SDG-MASJDK9-JOB1-9.