Build: #1473 failed

Job: Default Job failed

Stages & jobs

  1. Default Stage

Build log

The build generated 9,214 lines of output.The output is too long and has been truncated to the last 1,000 lines. Download or view full build log

06-Feb-2020 03:28:38         at org.jfrog.gradle.plugin.artifactory.ArtifactoryPluginBase.getArtifactoryPluginConvention(ArtifactoryPluginBase.groovy:73)
06-Feb-2020 03:28:38         at sun.reflect.NativeMethodAccessorImpl.invoke0(Native Method)
06-Feb-2020 03:28:38         at sun.reflect.NativeMethodAccessorImpl.invoke(NativeMethodAccessorImpl.java:62)
06-Feb-2020 03:28:38         at sun.reflect.DelegatingMethodAccessorImpl.invoke(DelegatingMethodAccessorImpl.java:43)
06-Feb-2020 03:28:38         at java.lang.reflect.Method.invoke(Method.java:498)
06-Feb-2020 03:28:38         at org.codehaus.groovy.runtime.callsite.PogoMetaMethodSite$PogoCachedMethodSiteNoUnwrapNoCoerce.invoke(PogoMetaMethodSite.java:210)
06-Feb-2020 03:28:38         at org.codehaus.groovy.runtime.callsite.PogoMetaMethodSite.callCurrent(PogoMetaMethodSite.java:59)
06-Feb-2020 03:28:38         at org.codehaus.groovy.runtime.callsite.CallSiteArray.defaultCallCurrent(CallSiteArray.java:52)
06-Feb-2020 03:28:38         at org.codehaus.groovy.runtime.callsite.AbstractCallSite.callCurrent(AbstractCallSite.java:154)
06-Feb-2020 03:28:38         at org.codehaus.groovy.runtime.callsite.AbstractCallSite.callCurrent(AbstractCallSite.java:166)
06-Feb-2020 03:28:38         at org.jfrog.gradle.plugin.artifactory.ArtifactoryPluginBase.apply(ArtifactoryPluginBase.groovy:41)
06-Feb-2020 03:28:38         at org.jfrog.gradle.plugin.artifactory.ArtifactoryPluginBase.apply(ArtifactoryPluginBase.groovy)
06-Feb-2020 03:28:38         at org.gradle.api.internal.plugins.ImperativeOnlyPluginApplicator.applyImperative(ImperativeOnlyPluginApplicator.java:35)
06-Feb-2020 03:28:38         at org.gradle.api.internal.plugins.RuleBasedPluginApplicator.applyImperative(RuleBasedPluginApplicator.java:43)
06-Feb-2020 03:28:38         at org.gradle.api.internal.plugins.DefaultPluginManager.doApply(DefaultPluginManager.java:139)
06-Feb-2020 03:28:38         ... 135 more
06-Feb-2020 03:28:38 Cause 49: org.gradle.api.ProjectConfigurationException: A problem occurred configuring root project 'spring-security'.
06-Feb-2020 03:28:38         at org.gradle.configuration.project.LifecycleProjectEvaluator.addConfigurationFailure(LifecycleProjectEvaluator.java:79)
06-Feb-2020 03:28:38         at org.gradle.configuration.project.LifecycleProjectEvaluator.evaluate(LifecycleProjectEvaluator.java:57)
06-Feb-2020 03:28:38         at org.gradle.api.internal.project.DefaultProject.evaluate(DefaultProject.java:573)
06-Feb-2020 03:28:38         at org.gradle.api.internal.project.DefaultProject.evaluate(DefaultProject.java:125)
06-Feb-2020 03:28:38         at org.gradle.execution.TaskPathProjectEvaluator.configureHierarchy(TaskPathProjectEvaluator.java:42)
06-Feb-2020 03:28:38         at org.gradle.configuration.DefaultBuildConfigurer.configure(DefaultBuildConfigurer.java:38)
06-Feb-2020 03:28:38         at org.gradle.initialization.DefaultGradleLauncher$2.run(DefaultGradleLauncher.java:124)
06-Feb-2020 03:28:38         at org.gradle.internal.Factories$1.create(Factories.java:22)
06-Feb-2020 03:28:38         at org.gradle.internal.progress.DefaultBuildOperationExecutor.run(DefaultBuildOperationExecutor.java:91)
06-Feb-2020 03:28:38         at org.gradle.internal.progress.DefaultBuildOperationExecutor.run(DefaultBuildOperationExecutor.java:53)
06-Feb-2020 03:28:38         at org.gradle.initialization.DefaultGradleLauncher.doBuildStages(DefaultGradleLauncher.java:121)
06-Feb-2020 03:28:38         at org.gradle.initialization.DefaultGradleLauncher.access$200(DefaultGradleLauncher.java:32)
06-Feb-2020 03:28:38         at org.gradle.initialization.DefaultGradleLauncher$1.create(DefaultGradleLauncher.java:98)
06-Feb-2020 03:28:38         at org.gradle.initialization.DefaultGradleLauncher$1.create(DefaultGradleLauncher.java:92)
06-Feb-2020 03:28:38         at org.gradle.internal.progress.DefaultBuildOperationExecutor.run(DefaultBuildOperationExecutor.java:91)
06-Feb-2020 03:28:38         at org.gradle.internal.progress.DefaultBuildOperationExecutor.run(DefaultBuildOperationExecutor.java:63)
06-Feb-2020 03:28:38         at org.gradle.initialization.DefaultGradleLauncher.doBuild(DefaultGradleLauncher.java:92)
06-Feb-2020 03:28:38         at org.gradle.initialization.DefaultGradleLauncher.run(DefaultGradleLauncher.java:83)
06-Feb-2020 03:28:38         at org.gradle.launcher.exec.InProcessBuildActionExecuter$DefaultBuildController.run(InProcessBuildActionExecuter.java:94)
06-Feb-2020 03:28:38         at org.gradle.tooling.internal.provider.ExecuteBuildActionRunner.run(ExecuteBuildActionRunner.java:28)
06-Feb-2020 03:28:38         at org.gradle.launcher.exec.ChainingBuildActionRunner.run(ChainingBuildActionRunner.java:35)
06-Feb-2020 03:28:38         at org.gradle.launcher.exec.InProcessBuildActionExecuter.execute(InProcessBuildActionExecuter.java:43)
06-Feb-2020 03:28:38         at org.gradle.launcher.exec.InProcessBuildActionExecuter.execute(InProcessBuildActionExecuter.java:28)
06-Feb-2020 03:28:38         at org.gradle.launcher.exec.ContinuousBuildActionExecuter.execute(ContinuousBuildActionExecuter.java:82)
06-Feb-2020 03:28:38         at org.gradle.launcher.exec.ContinuousBuildActionExecuter.execute(ContinuousBuildActionExecuter.java:49)
06-Feb-2020 03:28:38         at org.gradle.launcher.cli.RunBuildAction.run(RunBuildAction.java:43)
06-Feb-2020 03:28:38         at org.gradle.internal.Actions$RunnableActionAdapter.execute(Actions.java:173)
06-Feb-2020 03:28:38         at org.gradle.launcher.cli.CommandLineActionFactory$ParseAndBuildAction.execute(CommandLineActionFactory.java:244)
06-Feb-2020 03:28:38         at org.gradle.launcher.cli.CommandLineActionFactory$ParseAndBuildAction.execute(CommandLineActionFactory.java:217)
06-Feb-2020 03:28:38         at org.gradle.launcher.cli.JavaRuntimeValidationAction.execute(JavaRuntimeValidationAction.java:33)
06-Feb-2020 03:28:38         at org.gradle.launcher.cli.JavaRuntimeValidationAction.execute(JavaRuntimeValidationAction.java:24)
06-Feb-2020 03:28:38         at org.gradle.launcher.cli.ExceptionReportingAction.execute(ExceptionReportingAction.java:33)
06-Feb-2020 03:28:38         at org.gradle.launcher.cli.ExceptionReportingAction.execute(ExceptionReportingAction.java:22)
06-Feb-2020 03:28:38         at org.gradle.launcher.cli.CommandLineActionFactory$WithLogging.execute(CommandLineActionFactory.java:210)
06-Feb-2020 03:28:38         at org.gradle.launcher.cli.CommandLineActionFactory$WithLogging.execute(CommandLineActionFactory.java:174)
06-Feb-2020 03:28:38         at org.gradle.launcher.Main.doAction(Main.java:33)
06-Feb-2020 03:28:38         at org.gradle.launcher.bootstrap.EntryPoint.run(EntryPoint.java:45)
06-Feb-2020 03:28:38         at sun.reflect.NativeMethodAccessorImpl.invoke0(Native Method)
06-Feb-2020 03:28:38         at sun.reflect.NativeMethodAccessorImpl.invoke(NativeMethodAccessorImpl.java:62)
06-Feb-2020 03:28:38         at sun.reflect.DelegatingMethodAccessorImpl.invoke(DelegatingMethodAccessorImpl.java:43)
06-Feb-2020 03:28:38         at java.lang.reflect.Method.invoke(Method.java:498)
06-Feb-2020 03:28:38         at org.gradle.launcher.bootstrap.ProcessBootstrap.runNoExit(ProcessBootstrap.java:60)
06-Feb-2020 03:28:38         at org.gradle.launcher.bootstrap.ProcessBootstrap.run(ProcessBootstrap.java:37)
06-Feb-2020 03:28:38         at org.gradle.launcher.GradleMain.main(GradleMain.java:23)
06-Feb-2020 03:28:38         at sun.reflect.NativeMethodAccessorImpl.invoke0(Native Method)
06-Feb-2020 03:28:38         at sun.reflect.NativeMethodAccessorImpl.invoke(NativeMethodAccessorImpl.java:62)
06-Feb-2020 03:28:38         at sun.reflect.DelegatingMethodAccessorImpl.invoke(DelegatingMethodAccessorImpl.java:43)
06-Feb-2020 03:28:38         at java.lang.reflect.Method.invoke(Method.java:498)
06-Feb-2020 03:28:38         at org.gradle.wrapper.BootstrapMainStarter.start(BootstrapMainStarter.java:30)
06-Feb-2020 03:28:38         at org.gradle.wrapper.WrapperExecutor.execute(WrapperExecutor.java:129)
06-Feb-2020 03:28:38         at org.gradle.wrapper.GradleWrapperMain.main(GradleWrapperMain.java:61)
06-Feb-2020 03:28:38 Caused by: org.gradle.api.GradleScriptException: A problem occurred evaluating root project 'spring-security'.
06-Feb-2020 03:28:38         at org.gradle.groovy.scripts.internal.DefaultScriptRunnerFactory$ScriptRunnerImpl.run(DefaultScriptRunnerFactory.java:92)
06-Feb-2020 03:28:38         at org.gradle.configuration.DefaultScriptPluginFactory$ScriptPluginImpl$2.run(DefaultScriptPluginFactory.java:177)
06-Feb-2020 03:28:38         at org.gradle.configuration.ProjectScriptTarget.addConfiguration(ProjectScriptTarget.java:77)
06-Feb-2020 03:28:38         at org.gradle.configuration.DefaultScriptPluginFactory$ScriptPluginImpl.apply(DefaultScriptPluginFactory.java:182)
06-Feb-2020 03:28:38         at org.gradle.configuration.project.BuildScriptProcessor.execute(BuildScriptProcessor.java:38)
06-Feb-2020 03:28:38         at org.gradle.configuration.project.BuildScriptProcessor.execute(BuildScriptProcessor.java:25)
06-Feb-2020 03:28:38         at org.gradle.configuration.project.ConfigureActionsProjectEvaluator.evaluate(ConfigureActionsProjectEvaluator.java:34)
06-Feb-2020 03:28:38         at org.gradle.configuration.project.LifecycleProjectEvaluator.evaluate(LifecycleProjectEvaluator.java:55)
06-Feb-2020 03:28:38         ... 49 more
06-Feb-2020 03:28:38 Caused by: org.gradle.api.GradleScriptException: A problem occurred evaluating script.
06-Feb-2020 03:28:38         at org.gradle.groovy.scripts.internal.DefaultScriptRunnerFactory$ScriptRunnerImpl.run(DefaultScriptRunnerFactory.java:92)
06-Feb-2020 03:28:38         at org.gradle.configuration.DefaultScriptPluginFactory$ScriptPluginImpl$2.run(DefaultScriptPluginFactory.java:177)
06-Feb-2020 03:28:38         at org.gradle.configuration.DefaultScriptTarget.addConfiguration(DefaultScriptTarget.java:74)
06-Feb-2020 03:28:38         at org.gradle.configuration.DefaultScriptPluginFactory$ScriptPluginImpl.apply(DefaultScriptPluginFactory.java:182)
06-Feb-2020 03:28:38         at org.gradle.api.internal.plugins.DefaultObjectConfigurationAction.applyScript(DefaultObjectConfigurationAction.java:102)
06-Feb-2020 03:28:38         at org.gradle.api.internal.plugins.DefaultObjectConfigurationAction.access$000(DefaultObjectConfigurationAction.java:36)
06-Feb-2020 03:28:38         at org.gradle.api.internal.plugins.DefaultObjectConfigurationAction$1.run(DefaultObjectConfigurationAction.java:62)
06-Feb-2020 03:28:38         at org.gradle.api.internal.plugins.DefaultObjectConfigurationAction.execute(DefaultObjectConfigurationAction.java:136)
06-Feb-2020 03:28:38         at org.gradle.api.internal.project.AbstractPluginAware.apply(AbstractPluginAware.java:44)
06-Feb-2020 03:28:38         at sun.reflect.GeneratedMethodAccessor40.invoke(Unknown Source)
06-Feb-2020 03:28:38         at sun.reflect.DelegatingMethodAccessorImpl.invoke(DelegatingMethodAccessorImpl.java:43)
06-Feb-2020 03:28:38         at java.lang.reflect.Method.invoke(Method.java:498)
06-Feb-2020 03:28:38         at org.codehaus.groovy.reflection.CachedMethod.invoke(CachedMethod.java:93)
06-Feb-2020 03:28:38         at groovy.lang.MetaMethod.doMethodInvoke(MetaMethod.java:325)
06-Feb-2020 03:28:38         at org.gradle.internal.metaobject.BeanDynamicObject$MetaClassAdapter.invokeMethod(BeanDynamicObject.java:382)
06-Feb-2020 03:28:38         at org.gradle.internal.metaobject.BeanDynamicObject.invokeMethod(BeanDynamicObject.java:170)
06-Feb-2020 03:28:38         at org.gradle.internal.metaobject.CompositeDynamicObject.invokeMethod(CompositeDynamicObject.java:96)
06-Feb-2020 03:28:38         at org.gradle.internal.metaobject.MixInClosurePropertiesAsMethodsDynamicObject.invokeMethod(MixInClosurePropertiesAsMethodsDynamicObject.java:30)
06-Feb-2020 03:28:38         at org.gradle.internal.metaobject.ConfigureDelegate.invokeMethod(ConfigureDelegate.java:59)
06-Feb-2020 03:28:38         at org.codehaus.groovy.runtime.metaclass.ClosureMetaClass.invokeOnDelegationObjects(ClosureMetaClass.java:430)
06-Feb-2020 03:28:38         at org.codehaus.groovy.runtime.metaclass.ClosureMetaClass.invokeMethod(ClosureMetaClass.java:369)
06-Feb-2020 03:28:38         at groovy.lang.MetaClassImpl.invokeMethod(MetaClassImpl.java:1024)
06-Feb-2020 03:28:38         at org.codehaus.groovy.runtime.callsite.PogoMetaClassSite.callCurrent(PogoMetaClassSite.java:69)
06-Feb-2020 03:28:38         at org.codehaus.groovy.runtime.callsite.CallSiteArray.defaultCallCurrent(CallSiteArray.java:52)
06-Feb-2020 03:28:38         at org.codehaus.groovy.runtime.callsite.AbstractCallSite.callCurrent(AbstractCallSite.java:154)
06-Feb-2020 03:28:38         at org.codehaus.groovy.runtime.callsite.AbstractCallSite.callCurrent(AbstractCallSite.java:166)
06-Feb-2020 03:28:38         at build_54hslkk5jqk8gxa9mlqjldrmz$_run_closure10.doCall(/opt/bamboo-home/xml-data/build-dir/SEC-B42X-JOB1/build.gradle:112)
06-Feb-2020 03:28:38         at sun.reflect.NativeMethodAccessorImpl.invoke0(Native Method)
06-Feb-2020 03:28:38         at sun.reflect.NativeMethodAccessorImpl.invoke(NativeMethodAccessorImpl.java:62)
06-Feb-2020 03:28:38         at sun.reflect.DelegatingMethodAccessorImpl.invoke(DelegatingMethodAccessorImpl.java:43)
06-Feb-2020 03:28:38         at java.lang.reflect.Method.invoke(Method.java:498)
06-Feb-2020 03:28:38         at org.codehaus.groovy.reflection.CachedMethod.invoke(CachedMethod.java:93)
06-Feb-2020 03:28:38         at groovy.lang.MetaMethod.doMethodInvoke(MetaMethod.java:325)
06-Feb-2020 03:28:38         at org.codehaus.groovy.runtime.metaclass.ClosureMetaClass.invokeMethod(ClosureMetaClass.java:294)
06-Feb-2020 03:28:38         at groovy.lang.MetaClassImpl.invokeMethod(MetaClassImpl.java:1024)
06-Feb-2020 03:28:38         at groovy.lang.Closure.call(Closure.java:414)
06-Feb-2020 03:28:38         at groovy.lang.Closure.call(Closure.java:430)
06-Feb-2020 03:28:38         at org.gradle.api.internal.ClosureBackedAction.execute(ClosureBackedAction.java:70)
06-Feb-2020 03:28:38         at org.gradle.util.ConfigureUtil.configureTarget(ConfigureUtil.java:160)
06-Feb-2020 03:28:38         at org.gradle.util.ConfigureUtil.configure(ConfigureUtil.java:106)
06-Feb-2020 03:28:38         at org.gradle.api.internal.project.DefaultProject.configure(DefaultProject.java:921)
06-Feb-2020 03:28:38         at org.gradle.api.internal.project.DefaultProject.configure(DefaultProject.java:926)
06-Feb-2020 03:28:38         at sun.reflect.NativeMethodAccessorImpl.invoke0(Native Method)
06-Feb-2020 03:28:38         at sun.reflect.NativeMethodAccessorImpl.invoke(NativeMethodAccessorImpl.java:62)
06-Feb-2020 03:28:38         at sun.reflect.DelegatingMethodAccessorImpl.invoke(DelegatingMethodAccessorImpl.java:43)
06-Feb-2020 03:28:38         at java.lang.reflect.Method.invoke(Method.java:498)
06-Feb-2020 03:28:38         at org.codehaus.groovy.reflection.CachedMethod.invoke(CachedMethod.java:93)
06-Feb-2020 03:28:38         at groovy.lang.MetaMethod.doMethodInvoke(MetaMethod.java:325)
06-Feb-2020 03:28:38         at org.gradle.internal.metaobject.BeanDynamicObject$MetaClassAdapter.invokeMethod(BeanDynamicObject.java:382)
06-Feb-2020 03:28:38         at org.gradle.internal.metaobject.BeanDynamicObject.invokeMethod(BeanDynamicObject.java:170)
06-Feb-2020 03:28:38         at org.gradle.internal.metaobject.CompositeDynamicObject.invokeMethod(CompositeDynamicObject.java:96)
06-Feb-2020 03:28:38         at org.gradle.internal.metaobject.MixInClosurePropertiesAsMethodsDynamicObject.invokeMethod(MixInClosurePropertiesAsMethodsDynamicObject.java:30)
06-Feb-2020 03:28:38         at org.gradle.internal.metaobject.AbstractDynamicObject.invokeMethod(AbstractDynamicObject.java:163)
06-Feb-2020 03:28:38         at org.gradle.groovy.scripts.BasicScript.methodMissing(BasicScript.java:83)
06-Feb-2020 03:28:38         at sun.reflect.GeneratedMethodAccessor9.invoke(Unknown Source)
06-Feb-2020 03:28:38         at sun.reflect.DelegatingMethodAccessorImpl.invoke(DelegatingMethodAccessorImpl.java:43)
06-Feb-2020 03:28:38         at java.lang.reflect.Method.invoke(Method.java:498)
06-Feb-2020 03:28:38         at org.codehaus.groovy.reflection.CachedMethod.invoke(CachedMethod.java:93)
06-Feb-2020 03:28:38         at groovy.lang.MetaClassImpl.invokeMissingMethod(MetaClassImpl.java:941)
06-Feb-2020 03:28:38         at groovy.lang.MetaClassImpl.invokePropertyOrMissing(MetaClassImpl.java:1264)
06-Feb-2020 03:28:38         at groovy.lang.MetaClassImpl.invokeMethod(MetaClassImpl.java:1217)
06-Feb-2020 03:28:38         at groovy.lang.MetaClassImpl.invokeMethod(MetaClassImpl.java:1024)
06-Feb-2020 03:28:38         at org.codehaus.groovy.runtime.callsite.PogoMetaClassSite.callCurrent(PogoMetaClassSite.java:69)
06-Feb-2020 03:28:38         at org.codehaus.groovy.runtime.callsite.CallSiteArray.defaultCallCurrent(CallSiteArray.java:52)
06-Feb-2020 03:28:38         at org.codehaus.groovy.runtime.callsite.AbstractCallSite.callCurrent(AbstractCallSite.java:154)
06-Feb-2020 03:28:38         at org.codehaus.groovy.runtime.callsite.AbstractCallSite.callCurrent(AbstractCallSite.java:174)
06-Feb-2020 03:28:38         at build_54hslkk5jqk8gxa9mlqjldrmz.run(/opt/bamboo-home/xml-data/build-dir/SEC-B42X-JOB1/build.gradle:110)
06-Feb-2020 03:28:38         at org.gradle.groovy.scripts.internal.DefaultScriptRunnerFactory$ScriptRunnerImpl.run(DefaultScriptRunnerFactory.java:90)
06-Feb-2020 03:28:38         ... 56 more
06-Feb-2020 03:28:38 Caused by: org.gradle.api.internal.plugins.PluginApplicationException: Failed to apply plugin [id 'com.jfrog.artifactory']
06-Feb-2020 03:28:38         at org.gradle.api.internal.plugins.DefaultPluginManager.doApply(DefaultPluginManager.java:155)
06-Feb-2020 03:28:38         at org.gradle.api.internal.plugins.DefaultPluginManager.apply(DefaultPluginManager.java:112)
06-Feb-2020 03:28:38         at org.gradle.api.internal.plugins.DefaultObjectConfigurationAction.applyType(DefaultObjectConfigurationAction.java:113)
06-Feb-2020 03:28:38         at org.gradle.api.internal.plugins.DefaultObjectConfigurationAction.access$200(DefaultObjectConfigurationAction.java:36)
06-Feb-2020 03:28:38         at org.gradle.api.internal.plugins.DefaultObjectConfigurationAction$3.run(DefaultObjectConfigurationAction.java:80)
06-Feb-2020 03:28:38         at org.gradle.api.internal.plugins.DefaultObjectConfigurationAction.execute(DefaultObjectConfigurationAction.java:136)
06-Feb-2020 03:28:38         at org.gradle.groovy.scripts.DefaultScript.apply(DefaultScript.java:114)
06-Feb-2020 03:28:38         at org.gradle.api.Script$apply.callCurrent(Unknown Source)
06-Feb-2020 03:28:38         at org.codehaus.groovy.runtime.callsite.CallSiteArray.defaultCallCurrent(CallSiteArray.java:52)
06-Feb-2020 03:28:38         at org.codehaus.groovy.runtime.callsite.AbstractCallSite.callCurrent(AbstractCallSite.java:154)
06-Feb-2020 03:28:38         at org.codehaus.groovy.runtime.callsite.AbstractCallSite.callCurrent(AbstractCallSite.java:166)
06-Feb-2020 03:28:38         at artifactory_do0x2satu4xr1js8ccmm5hu99.run(/opt/bamboo-home/xml-data/build-dir/SEC-B42X-JOB1/gradle/artifactory.gradle:1)
06-Feb-2020 03:28:38         at org.gradle.groovy.scripts.internal.DefaultScriptRunnerFactory$ScriptRunnerImpl.run(DefaultScriptRunnerFactory.java:90)
06-Feb-2020 03:28:38         ... 123 more
06-Feb-2020 03:28:38 Caused by: org.codehaus.groovy.runtime.typehandling.GroovyCastException: Cannot cast object 'org.jfrog.gradle.plugin.artifactory.dsl.ArtifactoryPluginConvention@54ad9ff9' with class 'org.jfrog.gradle.plugin.artifactory.dsl.ArtifactoryPluginConvention' to class 'org.jfrog.gradle.plugin.artifactory.dsl.ArtifactoryPluginConvention'
06-Feb-2020 03:28:38         at org.codehaus.groovy.runtime.typehandling.DefaultTypeTransformation.continueCastOnSAM(DefaultTypeTransformation.java:405)
06-Feb-2020 03:28:38         at org.codehaus.groovy.runtime.typehandling.DefaultTypeTransformation.continueCastOnNumber(DefaultTypeTransformation.java:319)
06-Feb-2020 03:28:38         at org.codehaus.groovy.runtime.typehandling.DefaultTypeTransformation.castToType(DefaultTypeTransformation.java:232)
06-Feb-2020 03:28:38         at org.codehaus.groovy.runtime.ScriptBytecodeAdapter.castToType(ScriptBytecodeAdapter.java:603)
06-Feb-2020 03:28:38         at org.jfrog.gradle.plugin.artifactory.ArtifactoryPluginBase.getArtifactoryPluginConvention(ArtifactoryPluginBase.groovy:73)
06-Feb-2020 03:28:38         at sun.reflect.NativeMethodAccessorImpl.invoke0(Native Method)
06-Feb-2020 03:28:38         at sun.reflect.NativeMethodAccessorImpl.invoke(NativeMethodAccessorImpl.java:62)
06-Feb-2020 03:28:38         at sun.reflect.DelegatingMethodAccessorImpl.invoke(DelegatingMethodAccessorImpl.java:43)
06-Feb-2020 03:28:38         at java.lang.reflect.Method.invoke(Method.java:498)
06-Feb-2020 03:28:38         at org.codehaus.groovy.runtime.callsite.PogoMetaMethodSite$PogoCachedMethodSiteNoUnwrapNoCoerce.invoke(PogoMetaMethodSite.java:210)
06-Feb-2020 03:28:38         at org.codehaus.groovy.runtime.callsite.PogoMetaMethodSite.callCurrent(PogoMetaMethodSite.java:59)
06-Feb-2020 03:28:38         at org.codehaus.groovy.runtime.callsite.CallSiteArray.defaultCallCurrent(CallSiteArray.java:52)
06-Feb-2020 03:28:38         at org.codehaus.groovy.runtime.callsite.AbstractCallSite.callCurrent(AbstractCallSite.java:154)
06-Feb-2020 03:28:38         at org.codehaus.groovy.runtime.callsite.AbstractCallSite.callCurrent(AbstractCallSite.java:166)
06-Feb-2020 03:28:38         at org.jfrog.gradle.plugin.artifactory.ArtifactoryPluginBase.apply(ArtifactoryPluginBase.groovy:41)
06-Feb-2020 03:28:38         at org.jfrog.gradle.plugin.artifactory.ArtifactoryPluginBase.apply(ArtifactoryPluginBase.groovy)
06-Feb-2020 03:28:38         at org.gradle.api.internal.plugins.ImperativeOnlyPluginApplicator.applyImperative(ImperativeOnlyPluginApplicator.java:35)
06-Feb-2020 03:28:38         at org.gradle.api.internal.plugins.RuleBasedPluginApplicator.applyImperative(RuleBasedPluginApplicator.java:43)
06-Feb-2020 03:28:38         at org.gradle.api.internal.plugins.DefaultPluginManager.doApply(DefaultPluginManager.java:139)
06-Feb-2020 03:28:38         ... 135 more
06-Feb-2020 03:28:38 Cause 50: org.gradle.api.ProjectConfigurationException: A problem occurred configuring root project 'spring-security'.
06-Feb-2020 03:28:38         at org.gradle.configuration.project.LifecycleProjectEvaluator.addConfigurationFailure(LifecycleProjectEvaluator.java:79)
06-Feb-2020 03:28:38         at org.gradle.configuration.project.LifecycleProjectEvaluator.evaluate(LifecycleProjectEvaluator.java:57)
06-Feb-2020 03:28:38         at org.gradle.api.internal.project.DefaultProject.evaluate(DefaultProject.java:573)
06-Feb-2020 03:28:38         at org.gradle.api.internal.project.DefaultProject.evaluate(DefaultProject.java:125)
06-Feb-2020 03:28:38         at org.gradle.execution.TaskPathProjectEvaluator.configureHierarchy(TaskPathProjectEvaluator.java:42)
06-Feb-2020 03:28:38         at org.gradle.configuration.DefaultBuildConfigurer.configure(DefaultBuildConfigurer.java:38)
06-Feb-2020 03:28:38         at org.gradle.initialization.DefaultGradleLauncher$2.run(DefaultGradleLauncher.java:124)
06-Feb-2020 03:28:38         at org.gradle.internal.Factories$1.create(Factories.java:22)
06-Feb-2020 03:28:38         at org.gradle.internal.progress.DefaultBuildOperationExecutor.run(DefaultBuildOperationExecutor.java:91)
06-Feb-2020 03:28:38         at org.gradle.internal.progress.DefaultBuildOperationExecutor.run(DefaultBuildOperationExecutor.java:53)
06-Feb-2020 03:28:38         at org.gradle.initialization.DefaultGradleLauncher.doBuildStages(DefaultGradleLauncher.java:121)
06-Feb-2020 03:28:38         at org.gradle.initialization.DefaultGradleLauncher.access$200(DefaultGradleLauncher.java:32)
06-Feb-2020 03:28:38         at org.gradle.initialization.DefaultGradleLauncher$1.create(DefaultGradleLauncher.java:98)
06-Feb-2020 03:28:38         at org.gradle.initialization.DefaultGradleLauncher$1.create(DefaultGradleLauncher.java:92)
06-Feb-2020 03:28:38         at org.gradle.internal.progress.DefaultBuildOperationExecutor.run(DefaultBuildOperationExecutor.java:91)
06-Feb-2020 03:28:38         at org.gradle.internal.progress.DefaultBuildOperationExecutor.run(DefaultBuildOperationExecutor.java:63)
06-Feb-2020 03:28:38         at org.gradle.initialization.DefaultGradleLauncher.doBuild(DefaultGradleLauncher.java:92)
06-Feb-2020 03:28:38         at org.gradle.initialization.DefaultGradleLauncher.run(DefaultGradleLauncher.java:83)
06-Feb-2020 03:28:38         at org.gradle.launcher.exec.InProcessBuildActionExecuter$DefaultBuildController.run(InProcessBuildActionExecuter.java:94)
06-Feb-2020 03:28:38         at org.gradle.tooling.internal.provider.ExecuteBuildActionRunner.run(ExecuteBuildActionRunner.java:28)
06-Feb-2020 03:28:38         at org.gradle.launcher.exec.ChainingBuildActionRunner.run(ChainingBuildActionRunner.java:35)
06-Feb-2020 03:28:38         at org.gradle.launcher.exec.InProcessBuildActionExecuter.execute(InProcessBuildActionExecuter.java:43)
06-Feb-2020 03:28:38         at org.gradle.launcher.exec.InProcessBuildActionExecuter.execute(InProcessBuildActionExecuter.java:28)
06-Feb-2020 03:28:38         at org.gradle.launcher.exec.ContinuousBuildActionExecuter.execute(ContinuousBuildActionExecuter.java:82)
06-Feb-2020 03:28:38         at org.gradle.launcher.exec.ContinuousBuildActionExecuter.execute(ContinuousBuildActionExecuter.java:49)
06-Feb-2020 03:28:38         at org.gradle.launcher.cli.RunBuildAction.run(RunBuildAction.java:43)
06-Feb-2020 03:28:38         at org.gradle.internal.Actions$RunnableActionAdapter.execute(Actions.java:173)
06-Feb-2020 03:28:38         at org.gradle.launcher.cli.CommandLineActionFactory$ParseAndBuildAction.execute(CommandLineActionFactory.java:244)
06-Feb-2020 03:28:38         at org.gradle.launcher.cli.CommandLineActionFactory$ParseAndBuildAction.execute(CommandLineActionFactory.java:217)
06-Feb-2020 03:28:38         at org.gradle.launcher.cli.JavaRuntimeValidationAction.execute(JavaRuntimeValidationAction.java:33)
06-Feb-2020 03:28:38         at org.gradle.launcher.cli.JavaRuntimeValidationAction.execute(JavaRuntimeValidationAction.java:24)
06-Feb-2020 03:28:38         at org.gradle.launcher.cli.ExceptionReportingAction.execute(ExceptionReportingAction.java:33)
06-Feb-2020 03:28:38         at org.gradle.launcher.cli.ExceptionReportingAction.execute(ExceptionReportingAction.java:22)
06-Feb-2020 03:28:38         at org.gradle.launcher.cli.CommandLineActionFactory$WithLogging.execute(CommandLineActionFactory.java:210)
06-Feb-2020 03:28:38         at org.gradle.launcher.cli.CommandLineActionFactory$WithLogging.execute(CommandLineActionFactory.java:174)
06-Feb-2020 03:28:38         at org.gradle.launcher.Main.doAction(Main.java:33)
06-Feb-2020 03:28:38         at org.gradle.launcher.bootstrap.EntryPoint.run(EntryPoint.java:45)
06-Feb-2020 03:28:38         at sun.reflect.NativeMethodAccessorImpl.invoke0(Native Method)
06-Feb-2020 03:28:38         at sun.reflect.NativeMethodAccessorImpl.invoke(NativeMethodAccessorImpl.java:62)
06-Feb-2020 03:28:38         at sun.reflect.DelegatingMethodAccessorImpl.invoke(DelegatingMethodAccessorImpl.java:43)
06-Feb-2020 03:28:38         at java.lang.reflect.Method.invoke(Method.java:498)
06-Feb-2020 03:28:38         at org.gradle.launcher.bootstrap.ProcessBootstrap.runNoExit(ProcessBootstrap.java:60)
06-Feb-2020 03:28:38         at org.gradle.launcher.bootstrap.ProcessBootstrap.run(ProcessBootstrap.java:37)
06-Feb-2020 03:28:38         at org.gradle.launcher.GradleMain.main(GradleMain.java:23)
06-Feb-2020 03:28:38         at sun.reflect.NativeMethodAccessorImpl.invoke0(Native Method)
06-Feb-2020 03:28:38         at sun.reflect.NativeMethodAccessorImpl.invoke(NativeMethodAccessorImpl.java:62)
06-Feb-2020 03:28:38         at sun.reflect.DelegatingMethodAccessorImpl.invoke(DelegatingMethodAccessorImpl.java:43)
06-Feb-2020 03:28:38         at java.lang.reflect.Method.invoke(Method.java:498)
06-Feb-2020 03:28:38         at org.gradle.wrapper.BootstrapMainStarter.start(BootstrapMainStarter.java:30)
06-Feb-2020 03:28:38         at org.gradle.wrapper.WrapperExecutor.execute(WrapperExecutor.java:129)
06-Feb-2020 03:28:38         at org.gradle.wrapper.GradleWrapperMain.main(GradleWrapperMain.java:61)
06-Feb-2020 03:28:38 Caused by: org.gradle.api.GradleScriptException: A problem occurred evaluating root project 'spring-security'.
06-Feb-2020 03:28:38         at org.gradle.groovy.scripts.internal.DefaultScriptRunnerFactory$ScriptRunnerImpl.run(DefaultScriptRunnerFactory.java:92)
06-Feb-2020 03:28:38         at org.gradle.configuration.DefaultScriptPluginFactory$ScriptPluginImpl$2.run(DefaultScriptPluginFactory.java:177)
06-Feb-2020 03:28:38         at org.gradle.configuration.ProjectScriptTarget.addConfiguration(ProjectScriptTarget.java:77)
06-Feb-2020 03:28:38         at org.gradle.configuration.DefaultScriptPluginFactory$ScriptPluginImpl.apply(DefaultScriptPluginFactory.java:182)
06-Feb-2020 03:28:38         at org.gradle.configuration.project.BuildScriptProcessor.execute(BuildScriptProcessor.java:38)
06-Feb-2020 03:28:38         at org.gradle.configuration.project.BuildScriptProcessor.execute(BuildScriptProcessor.java:25)
06-Feb-2020 03:28:38         at org.gradle.configuration.project.ConfigureActionsProjectEvaluator.evaluate(ConfigureActionsProjectEvaluator.java:34)
06-Feb-2020 03:28:38         at org.gradle.configuration.project.LifecycleProjectEvaluator.evaluate(LifecycleProjectEvaluator.java:55)
06-Feb-2020 03:28:38         ... 49 more
06-Feb-2020 03:28:38 Caused by: org.gradle.api.GradleScriptException: A problem occurred evaluating script.
06-Feb-2020 03:28:38         at org.gradle.groovy.scripts.internal.DefaultScriptRunnerFactory$ScriptRunnerImpl.run(DefaultScriptRunnerFactory.java:92)
06-Feb-2020 03:28:38         at org.gradle.configuration.DefaultScriptPluginFactory$ScriptPluginImpl$2.run(DefaultScriptPluginFactory.java:177)
06-Feb-2020 03:28:38         at org.gradle.configuration.DefaultScriptTarget.addConfiguration(DefaultScriptTarget.java:74)
06-Feb-2020 03:28:38         at org.gradle.configuration.DefaultScriptPluginFactory$ScriptPluginImpl.apply(DefaultScriptPluginFactory.java:182)
06-Feb-2020 03:28:38         at org.gradle.api.internal.plugins.DefaultObjectConfigurationAction.applyScript(DefaultObjectConfigurationAction.java:102)
06-Feb-2020 03:28:38         at org.gradle.api.internal.plugins.DefaultObjectConfigurationAction.access$000(DefaultObjectConfigurationAction.java:36)
06-Feb-2020 03:28:38         at org.gradle.api.internal.plugins.DefaultObjectConfigurationAction$1.run(DefaultObjectConfigurationAction.java:62)
06-Feb-2020 03:28:38         at org.gradle.api.internal.plugins.DefaultObjectConfigurationAction.execute(DefaultObjectConfigurationAction.java:136)
06-Feb-2020 03:28:38         at org.gradle.api.internal.project.AbstractPluginAware.apply(AbstractPluginAware.java:44)
06-Feb-2020 03:28:38         at sun.reflect.GeneratedMethodAccessor40.invoke(Unknown Source)
06-Feb-2020 03:28:38         at sun.reflect.DelegatingMethodAccessorImpl.invoke(DelegatingMethodAccessorImpl.java:43)
06-Feb-2020 03:28:38         at java.lang.reflect.Method.invoke(Method.java:498)
06-Feb-2020 03:28:38         at org.codehaus.groovy.reflection.CachedMethod.invoke(CachedMethod.java:93)
06-Feb-2020 03:28:38         at groovy.lang.MetaMethod.doMethodInvoke(MetaMethod.java:325)
06-Feb-2020 03:28:38         at org.gradle.internal.metaobject.BeanDynamicObject$MetaClassAdapter.invokeMethod(BeanDynamicObject.java:382)
06-Feb-2020 03:28:38         at org.gradle.internal.metaobject.BeanDynamicObject.invokeMethod(BeanDynamicObject.java:170)
06-Feb-2020 03:28:38         at org.gradle.internal.metaobject.CompositeDynamicObject.invokeMethod(CompositeDynamicObject.java:96)
06-Feb-2020 03:28:38         at org.gradle.internal.metaobject.MixInClosurePropertiesAsMethodsDynamicObject.invokeMethod(MixInClosurePropertiesAsMethodsDynamicObject.java:30)
06-Feb-2020 03:28:38         at org.gradle.internal.metaobject.ConfigureDelegate.invokeMethod(ConfigureDelegate.java:59)
06-Feb-2020 03:28:38         at org.codehaus.groovy.runtime.metaclass.ClosureMetaClass.invokeOnDelegationObjects(ClosureMetaClass.java:430)
06-Feb-2020 03:28:38         at org.codehaus.groovy.runtime.metaclass.ClosureMetaClass.invokeMethod(ClosureMetaClass.java:369)
06-Feb-2020 03:28:38         at groovy.lang.MetaClassImpl.invokeMethod(MetaClassImpl.java:1024)
06-Feb-2020 03:28:38         at org.codehaus.groovy.runtime.callsite.PogoMetaClassSite.callCurrent(PogoMetaClassSite.java:69)
06-Feb-2020 03:28:38         at org.codehaus.groovy.runtime.callsite.CallSiteArray.defaultCallCurrent(CallSiteArray.java:52)
06-Feb-2020 03:28:38         at org.codehaus.groovy.runtime.callsite.AbstractCallSite.callCurrent(AbstractCallSite.java:154)
06-Feb-2020 03:28:38         at org.codehaus.groovy.runtime.callsite.AbstractCallSite.callCurrent(AbstractCallSite.java:166)
06-Feb-2020 03:28:38         at build_54hslkk5jqk8gxa9mlqjldrmz$_run_closure10.doCall(/opt/bamboo-home/xml-data/build-dir/SEC-B42X-JOB1/build.gradle:112)
06-Feb-2020 03:28:38         at sun.reflect.NativeMethodAccessorImpl.invoke0(Native Method)
06-Feb-2020 03:28:38         at sun.reflect.NativeMethodAccessorImpl.invoke(NativeMethodAccessorImpl.java:62)
06-Feb-2020 03:28:38         at sun.reflect.DelegatingMethodAccessorImpl.invoke(DelegatingMethodAccessorImpl.java:43)
06-Feb-2020 03:28:38         at java.lang.reflect.Method.invoke(Method.java:498)
06-Feb-2020 03:28:38         at org.codehaus.groovy.reflection.CachedMethod.invoke(CachedMethod.java:93)
06-Feb-2020 03:28:38         at groovy.lang.MetaMethod.doMethodInvoke(MetaMethod.java:325)
06-Feb-2020 03:28:38         at org.codehaus.groovy.runtime.metaclass.ClosureMetaClass.invokeMethod(ClosureMetaClass.java:294)
06-Feb-2020 03:28:38         at groovy.lang.MetaClassImpl.invokeMethod(MetaClassImpl.java:1024)
06-Feb-2020 03:28:38         at groovy.lang.Closure.call(Closure.java:414)
06-Feb-2020 03:28:38         at groovy.lang.Closure.call(Closure.java:430)
06-Feb-2020 03:28:38         at org.gradle.api.internal.ClosureBackedAction.execute(ClosureBackedAction.java:70)
06-Feb-2020 03:28:38         at org.gradle.util.ConfigureUtil.configureTarget(ConfigureUtil.java:160)
06-Feb-2020 03:28:38         at org.gradle.util.ConfigureUtil.configure(ConfigureUtil.java:106)
06-Feb-2020 03:28:38         at org.gradle.api.internal.project.DefaultProject.configure(DefaultProject.java:921)
06-Feb-2020 03:28:38         at org.gradle.api.internal.project.DefaultProject.configure(DefaultProject.java:926)
06-Feb-2020 03:28:38         at sun.reflect.NativeMethodAccessorImpl.invoke0(Native Method)
06-Feb-2020 03:28:38         at sun.reflect.NativeMethodAccessorImpl.invoke(NativeMethodAccessorImpl.java:62)
06-Feb-2020 03:28:38         at sun.reflect.DelegatingMethodAccessorImpl.invoke(DelegatingMethodAccessorImpl.java:43)
06-Feb-2020 03:28:38         at java.lang.reflect.Method.invoke(Method.java:498)
06-Feb-2020 03:28:38         at org.codehaus.groovy.reflection.CachedMethod.invoke(CachedMethod.java:93)
06-Feb-2020 03:28:38         at groovy.lang.MetaMethod.doMethodInvoke(MetaMethod.java:325)
06-Feb-2020 03:28:38         at org.gradle.internal.metaobject.BeanDynamicObject$MetaClassAdapter.invokeMethod(BeanDynamicObject.java:382)
06-Feb-2020 03:28:38         at org.gradle.internal.metaobject.BeanDynamicObject.invokeMethod(BeanDynamicObject.java:170)
06-Feb-2020 03:28:38         at org.gradle.internal.metaobject.CompositeDynamicObject.invokeMethod(CompositeDynamicObject.java:96)
06-Feb-2020 03:28:38         at org.gradle.internal.metaobject.MixInClosurePropertiesAsMethodsDynamicObject.invokeMethod(MixInClosurePropertiesAsMethodsDynamicObject.java:30)
06-Feb-2020 03:28:38         at org.gradle.internal.metaobject.AbstractDynamicObject.invokeMethod(AbstractDynamicObject.java:163)
06-Feb-2020 03:28:38         at org.gradle.groovy.scripts.BasicScript.methodMissing(BasicScript.java:83)
06-Feb-2020 03:28:38         at sun.reflect.GeneratedMethodAccessor9.invoke(Unknown Source)
06-Feb-2020 03:28:38         at sun.reflect.DelegatingMethodAccessorImpl.invoke(DelegatingMethodAccessorImpl.java:43)
06-Feb-2020 03:28:38         at java.lang.reflect.Method.invoke(Method.java:498)
06-Feb-2020 03:28:38         at org.codehaus.groovy.reflection.CachedMethod.invoke(CachedMethod.java:93)
06-Feb-2020 03:28:38         at groovy.lang.MetaClassImpl.invokeMissingMethod(MetaClassImpl.java:941)
06-Feb-2020 03:28:38         at groovy.lang.MetaClassImpl.invokePropertyOrMissing(MetaClassImpl.java:1264)
06-Feb-2020 03:28:38         at groovy.lang.MetaClassImpl.invokeMethod(MetaClassImpl.java:1217)
06-Feb-2020 03:28:38         at groovy.lang.MetaClassImpl.invokeMethod(MetaClassImpl.java:1024)
06-Feb-2020 03:28:38         at org.codehaus.groovy.runtime.callsite.PogoMetaClassSite.callCurrent(PogoMetaClassSite.java:69)
06-Feb-2020 03:28:38         at org.codehaus.groovy.runtime.callsite.CallSiteArray.defaultCallCurrent(CallSiteArray.java:52)
06-Feb-2020 03:28:38         at org.codehaus.groovy.runtime.callsite.AbstractCallSite.callCurrent(AbstractCallSite.java:154)
06-Feb-2020 03:28:38         at org.codehaus.groovy.runtime.callsite.AbstractCallSite.callCurrent(AbstractCallSite.java:174)
06-Feb-2020 03:28:38         at build_54hslkk5jqk8gxa9mlqjldrmz.run(/opt/bamboo-home/xml-data/build-dir/SEC-B42X-JOB1/build.gradle:110)
06-Feb-2020 03:28:38         at org.gradle.groovy.scripts.internal.DefaultScriptRunnerFactory$ScriptRunnerImpl.run(DefaultScriptRunnerFactory.java:90)
06-Feb-2020 03:28:38         ... 56 more
06-Feb-2020 03:28:38 Caused by: org.gradle.api.internal.plugins.PluginApplicationException: Failed to apply plugin [id 'com.jfrog.artifactory']
06-Feb-2020 03:28:38         at org.gradle.api.internal.plugins.DefaultPluginManager.doApply(DefaultPluginManager.java:155)
06-Feb-2020 03:28:38         at org.gradle.api.internal.plugins.DefaultPluginManager.apply(DefaultPluginManager.java:112)
06-Feb-2020 03:28:38         at org.gradle.api.internal.plugins.DefaultObjectConfigurationAction.applyType(DefaultObjectConfigurationAction.java:113)
06-Feb-2020 03:28:38         at org.gradle.api.internal.plugins.DefaultObjectConfigurationAction.access$200(DefaultObjectConfigurationAction.java:36)
06-Feb-2020 03:28:38         at org.gradle.api.internal.plugins.DefaultObjectConfigurationAction$3.run(DefaultObjectConfigurationAction.java:80)
06-Feb-2020 03:28:38         at org.gradle.api.internal.plugins.DefaultObjectConfigurationAction.execute(DefaultObjectConfigurationAction.java:136)
06-Feb-2020 03:28:38         at org.gradle.groovy.scripts.DefaultScript.apply(DefaultScript.java:114)
06-Feb-2020 03:28:38         at org.gradle.api.Script$apply.callCurrent(Unknown Source)
06-Feb-2020 03:28:38         at org.codehaus.groovy.runtime.callsite.CallSiteArray.defaultCallCurrent(CallSiteArray.java:52)
06-Feb-2020 03:28:38         at org.codehaus.groovy.runtime.callsite.AbstractCallSite.callCurrent(AbstractCallSite.java:154)
06-Feb-2020 03:28:38         at org.codehaus.groovy.runtime.callsite.AbstractCallSite.callCurrent(AbstractCallSite.java:166)
06-Feb-2020 03:28:38         at artifactory_do0x2satu4xr1js8ccmm5hu99.run(/opt/bamboo-home/xml-data/build-dir/SEC-B42X-JOB1/gradle/artifactory.gradle:1)
06-Feb-2020 03:28:38         at org.gradle.groovy.scripts.internal.DefaultScriptRunnerFactory$ScriptRunnerImpl.run(DefaultScriptRunnerFactory.java:90)
06-Feb-2020 03:28:38         ... 123 more
06-Feb-2020 03:28:38 Caused by: org.codehaus.groovy.runtime.typehandling.GroovyCastException: Cannot cast object 'org.jfrog.gradle.plugin.artifactory.dsl.ArtifactoryPluginConvention@54ad9ff9' with class 'org.jfrog.gradle.plugin.artifactory.dsl.ArtifactoryPluginConvention' to class 'org.jfrog.gradle.plugin.artifactory.dsl.ArtifactoryPluginConvention'
06-Feb-2020 03:28:38         at org.codehaus.groovy.runtime.typehandling.DefaultTypeTransformation.continueCastOnSAM(DefaultTypeTransformation.java:405)
06-Feb-2020 03:28:38         at org.codehaus.groovy.runtime.typehandling.DefaultTypeTransformation.continueCastOnNumber(DefaultTypeTransformation.java:319)
06-Feb-2020 03:28:38         at org.codehaus.groovy.runtime.typehandling.DefaultTypeTransformation.castToType(DefaultTypeTransformation.java:232)
06-Feb-2020 03:28:38         at org.codehaus.groovy.runtime.ScriptBytecodeAdapter.castToType(ScriptBytecodeAdapter.java:603)
06-Feb-2020 03:28:38         at org.jfrog.gradle.plugin.artifactory.ArtifactoryPluginBase.getArtifactoryPluginConvention(ArtifactoryPluginBase.groovy:73)
06-Feb-2020 03:28:38         at sun.reflect.NativeMethodAccessorImpl.invoke0(Native Method)
06-Feb-2020 03:28:38         at sun.reflect.NativeMethodAccessorImpl.invoke(NativeMethodAccessorImpl.java:62)
06-Feb-2020 03:28:38         at sun.reflect.DelegatingMethodAccessorImpl.invoke(DelegatingMethodAccessorImpl.java:43)
06-Feb-2020 03:28:38         at java.lang.reflect.Method.invoke(Method.java:498)
06-Feb-2020 03:28:38         at org.codehaus.groovy.runtime.callsite.PogoMetaMethodSite$PogoCachedMethodSiteNoUnwrapNoCoerce.invoke(PogoMetaMethodSite.java:210)
06-Feb-2020 03:28:38         at org.codehaus.groovy.runtime.callsite.PogoMetaMethodSite.callCurrent(PogoMetaMethodSite.java:59)
06-Feb-2020 03:28:38         at org.codehaus.groovy.runtime.callsite.CallSiteArray.defaultCallCurrent(CallSiteArray.java:52)
06-Feb-2020 03:28:38         at org.codehaus.groovy.runtime.callsite.AbstractCallSite.callCurrent(AbstractCallSite.java:154)
06-Feb-2020 03:28:38         at org.codehaus.groovy.runtime.callsite.AbstractCallSite.callCurrent(AbstractCallSite.java:166)
06-Feb-2020 03:28:38         at org.jfrog.gradle.plugin.artifactory.ArtifactoryPluginBase.apply(ArtifactoryPluginBase.groovy:41)
06-Feb-2020 03:28:38         at org.jfrog.gradle.plugin.artifactory.ArtifactoryPluginBase.apply(ArtifactoryPluginBase.groovy)
06-Feb-2020 03:28:38         at org.gradle.api.internal.plugins.ImperativeOnlyPluginApplicator.applyImperative(ImperativeOnlyPluginApplicator.java:35)
06-Feb-2020 03:28:38         at org.gradle.api.internal.plugins.RuleBasedPluginApplicator.applyImperative(RuleBasedPluginApplicator.java:43)
06-Feb-2020 03:28:38         at org.gradle.api.internal.plugins.DefaultPluginManager.doApply(DefaultPluginManager.java:139)
06-Feb-2020 03:28:38         ... 135 more
06-Feb-2020 03:28:38 Cause 51: org.gradle.api.ProjectConfigurationException: A problem occurred configuring root project 'spring-security'.
06-Feb-2020 03:28:38         at org.gradle.configuration.project.LifecycleProjectEvaluator.addConfigurationFailure(LifecycleProjectEvaluator.java:79)
06-Feb-2020 03:28:38         at org.gradle.configuration.project.LifecycleProjectEvaluator.evaluate(LifecycleProjectEvaluator.java:57)
06-Feb-2020 03:28:38         at org.gradle.api.internal.project.DefaultProject.evaluate(DefaultProject.java:573)
06-Feb-2020 03:28:38         at org.gradle.api.internal.project.DefaultProject.evaluate(DefaultProject.java:125)
06-Feb-2020 03:28:38         at org.gradle.execution.TaskPathProjectEvaluator.configureHierarchy(TaskPathProjectEvaluator.java:42)
06-Feb-2020 03:28:38         at org.gradle.configuration.DefaultBuildConfigurer.configure(DefaultBuildConfigurer.java:38)
06-Feb-2020 03:28:38         at org.gradle.initialization.DefaultGradleLauncher$2.run(DefaultGradleLauncher.java:124)
06-Feb-2020 03:28:38         at org.gradle.internal.Factories$1.create(Factories.java:22)
06-Feb-2020 03:28:38         at org.gradle.internal.progress.DefaultBuildOperationExecutor.run(DefaultBuildOperationExecutor.java:91)
06-Feb-2020 03:28:38         at org.gradle.internal.progress.DefaultBuildOperationExecutor.run(DefaultBuildOperationExecutor.java:53)
06-Feb-2020 03:28:38         at org.gradle.initialization.DefaultGradleLauncher.doBuildStages(DefaultGradleLauncher.java:121)
06-Feb-2020 03:28:38         at org.gradle.initialization.DefaultGradleLauncher.access$200(DefaultGradleLauncher.java:32)
06-Feb-2020 03:28:38         at org.gradle.initialization.DefaultGradleLauncher$1.create(DefaultGradleLauncher.java:98)
06-Feb-2020 03:28:38         at org.gradle.initialization.DefaultGradleLauncher$1.create(DefaultGradleLauncher.java:92)
06-Feb-2020 03:28:38         at org.gradle.internal.progress.DefaultBuildOperationExecutor.run(DefaultBuildOperationExecutor.java:91)
06-Feb-2020 03:28:38         at org.gradle.internal.progress.DefaultBuildOperationExecutor.run(DefaultBuildOperationExecutor.java:63)
06-Feb-2020 03:28:38         at org.gradle.initialization.DefaultGradleLauncher.doBuild(DefaultGradleLauncher.java:92)
06-Feb-2020 03:28:38         at org.gradle.initialization.DefaultGradleLauncher.run(DefaultGradleLauncher.java:83)
06-Feb-2020 03:28:38         at org.gradle.launcher.exec.InProcessBuildActionExecuter$DefaultBuildController.run(InProcessBuildActionExecuter.java:94)
06-Feb-2020 03:28:38         at org.gradle.tooling.internal.provider.ExecuteBuildActionRunner.run(ExecuteBuildActionRunner.java:28)
06-Feb-2020 03:28:38         at org.gradle.launcher.exec.ChainingBuildActionRunner.run(ChainingBuildActionRunner.java:35)
06-Feb-2020 03:28:38         at org.gradle.launcher.exec.InProcessBuildActionExecuter.execute(InProcessBuildActionExecuter.java:43)
06-Feb-2020 03:28:38         at org.gradle.launcher.exec.InProcessBuildActionExecuter.execute(InProcessBuildActionExecuter.java:28)
06-Feb-2020 03:28:38         at org.gradle.launcher.exec.ContinuousBuildActionExecuter.execute(ContinuousBuildActionExecuter.java:82)
06-Feb-2020 03:28:38         at org.gradle.launcher.exec.ContinuousBuildActionExecuter.execute(ContinuousBuildActionExecuter.java:49)
06-Feb-2020 03:28:38         at org.gradle.launcher.cli.RunBuildAction.run(RunBuildAction.java:43)
06-Feb-2020 03:28:38         at org.gradle.internal.Actions$RunnableActionAdapter.execute(Actions.java:173)
06-Feb-2020 03:28:38         at org.gradle.launcher.cli.CommandLineActionFactory$ParseAndBuildAction.execute(CommandLineActionFactory.java:244)
06-Feb-2020 03:28:38         at org.gradle.launcher.cli.CommandLineActionFactory$ParseAndBuildAction.execute(CommandLineActionFactory.java:217)
06-Feb-2020 03:28:38         at org.gradle.launcher.cli.JavaRuntimeValidationAction.execute(JavaRuntimeValidationAction.java:33)
06-Feb-2020 03:28:38         at org.gradle.launcher.cli.JavaRuntimeValidationAction.execute(JavaRuntimeValidationAction.java:24)
06-Feb-2020 03:28:38         at org.gradle.launcher.cli.ExceptionReportingAction.execute(ExceptionReportingAction.java:33)
06-Feb-2020 03:28:38         at org.gradle.launcher.cli.ExceptionReportingAction.execute(ExceptionReportingAction.java:22)
06-Feb-2020 03:28:38         at org.gradle.launcher.cli.CommandLineActionFactory$WithLogging.execute(CommandLineActionFactory.java:210)
06-Feb-2020 03:28:38         at org.gradle.launcher.cli.CommandLineActionFactory$WithLogging.execute(CommandLineActionFactory.java:174)
06-Feb-2020 03:28:38         at org.gradle.launcher.Main.doAction(Main.java:33)
06-Feb-2020 03:28:38         at org.gradle.launcher.bootstrap.EntryPoint.run(EntryPoint.java:45)
06-Feb-2020 03:28:38         at sun.reflect.NativeMethodAccessorImpl.invoke0(Native Method)
06-Feb-2020 03:28:38         at sun.reflect.NativeMethodAccessorImpl.invoke(NativeMethodAccessorImpl.java:62)
06-Feb-2020 03:28:38         at sun.reflect.DelegatingMethodAccessorImpl.invoke(DelegatingMethodAccessorImpl.java:43)
06-Feb-2020 03:28:38         at java.lang.reflect.Method.invoke(Method.java:498)
06-Feb-2020 03:28:38         at org.gradle.launcher.bootstrap.ProcessBootstrap.runNoExit(ProcessBootstrap.java:60)
06-Feb-2020 03:28:38         at org.gradle.launcher.bootstrap.ProcessBootstrap.run(ProcessBootstrap.java:37)
06-Feb-2020 03:28:38         at org.gradle.launcher.GradleMain.main(GradleMain.java:23)
06-Feb-2020 03:28:38         at sun.reflect.NativeMethodAccessorImpl.invoke0(Native Method)
06-Feb-2020 03:28:38         at sun.reflect.NativeMethodAccessorImpl.invoke(NativeMethodAccessorImpl.java:62)
06-Feb-2020 03:28:38         at sun.reflect.DelegatingMethodAccessorImpl.invoke(DelegatingMethodAccessorImpl.java:43)
06-Feb-2020 03:28:38         at java.lang.reflect.Method.invoke(Method.java:498)
06-Feb-2020 03:28:38         at org.gradle.wrapper.BootstrapMainStarter.start(BootstrapMainStarter.java:30)
06-Feb-2020 03:28:38         at org.gradle.wrapper.WrapperExecutor.execute(WrapperExecutor.java:129)
06-Feb-2020 03:28:38         at org.gradle.wrapper.GradleWrapperMain.main(GradleWrapperMain.java:61)
06-Feb-2020 03:28:38 Caused by: org.gradle.api.GradleScriptException: A problem occurred evaluating root project 'spring-security'.
06-Feb-2020 03:28:38         at org.gradle.groovy.scripts.internal.DefaultScriptRunnerFactory$ScriptRunnerImpl.run(DefaultScriptRunnerFactory.java:92)
06-Feb-2020 03:28:38         at org.gradle.configuration.DefaultScriptPluginFactory$ScriptPluginImpl$2.run(DefaultScriptPluginFactory.java:177)
06-Feb-2020 03:28:38         at org.gradle.configuration.ProjectScriptTarget.addConfiguration(ProjectScriptTarget.java:77)
06-Feb-2020 03:28:38         at org.gradle.configuration.DefaultScriptPluginFactory$ScriptPluginImpl.apply(DefaultScriptPluginFactory.java:182)
06-Feb-2020 03:28:38         at org.gradle.configuration.project.BuildScriptProcessor.execute(BuildScriptProcessor.java:38)
06-Feb-2020 03:28:38         at org.gradle.configuration.project.BuildScriptProcessor.execute(BuildScriptProcessor.java:25)
06-Feb-2020 03:28:38         at org.gradle.configuration.project.ConfigureActionsProjectEvaluator.evaluate(ConfigureActionsProjectEvaluator.java:34)
06-Feb-2020 03:28:38         at org.gradle.configuration.project.LifecycleProjectEvaluator.evaluate(LifecycleProjectEvaluator.java:55)
06-Feb-2020 03:28:38         ... 49 more
06-Feb-2020 03:28:38 Caused by: org.gradle.api.GradleScriptException: A problem occurred evaluating script.
06-Feb-2020 03:28:38         at org.gradle.groovy.scripts.internal.DefaultScriptRunnerFactory$ScriptRunnerImpl.run(DefaultScriptRunnerFactory.java:92)
06-Feb-2020 03:28:38         at org.gradle.configuration.DefaultScriptPluginFactory$ScriptPluginImpl$2.run(DefaultScriptPluginFactory.java:177)
06-Feb-2020 03:28:38         at org.gradle.configuration.DefaultScriptTarget.addConfiguration(DefaultScriptTarget.java:74)
06-Feb-2020 03:28:38         at org.gradle.configuration.DefaultScriptPluginFactory$ScriptPluginImpl.apply(DefaultScriptPluginFactory.java:182)
06-Feb-2020 03:28:38         at org.gradle.api.internal.plugins.DefaultObjectConfigurationAction.applyScript(DefaultObjectConfigurationAction.java:102)
06-Feb-2020 03:28:38         at org.gradle.api.internal.plugins.DefaultObjectConfigurationAction.access$000(DefaultObjectConfigurationAction.java:36)
06-Feb-2020 03:28:38         at org.gradle.api.internal.plugins.DefaultObjectConfigurationAction$1.run(DefaultObjectConfigurationAction.java:62)
06-Feb-2020 03:28:38         at org.gradle.api.internal.plugins.DefaultObjectConfigurationAction.execute(DefaultObjectConfigurationAction.java:136)
06-Feb-2020 03:28:38         at org.gradle.api.internal.project.AbstractPluginAware.apply(AbstractPluginAware.java:44)
06-Feb-2020 03:28:38         at sun.reflect.GeneratedMethodAccessor40.invoke(Unknown Source)
06-Feb-2020 03:28:38         at sun.reflect.DelegatingMethodAccessorImpl.invoke(DelegatingMethodAccessorImpl.java:43)
06-Feb-2020 03:28:38         at java.lang.reflect.Method.invoke(Method.java:498)
06-Feb-2020 03:28:38         at org.codehaus.groovy.reflection.CachedMethod.invoke(CachedMethod.java:93)
06-Feb-2020 03:28:38         at groovy.lang.MetaMethod.doMethodInvoke(MetaMethod.java:325)
06-Feb-2020 03:28:38         at org.gradle.internal.metaobject.BeanDynamicObject$MetaClassAdapter.invokeMethod(BeanDynamicObject.java:382)
06-Feb-2020 03:28:38         at org.gradle.internal.metaobject.BeanDynamicObject.invokeMethod(BeanDynamicObject.java:170)
06-Feb-2020 03:28:38         at org.gradle.internal.metaobject.CompositeDynamicObject.invokeMethod(CompositeDynamicObject.java:96)
06-Feb-2020 03:28:38         at org.gradle.internal.metaobject.MixInClosurePropertiesAsMethodsDynamicObject.invokeMethod(MixInClosurePropertiesAsMethodsDynamicObject.java:30)
06-Feb-2020 03:28:38         at org.gradle.internal.metaobject.ConfigureDelegate.invokeMethod(ConfigureDelegate.java:59)
06-Feb-2020 03:28:38         at org.codehaus.groovy.runtime.metaclass.ClosureMetaClass.invokeOnDelegationObjects(ClosureMetaClass.java:430)
06-Feb-2020 03:28:38         at org.codehaus.groovy.runtime.metaclass.ClosureMetaClass.invokeMethod(ClosureMetaClass.java:369)
06-Feb-2020 03:28:38         at groovy.lang.MetaClassImpl.invokeMethod(MetaClassImpl.java:1024)
06-Feb-2020 03:28:38         at org.codehaus.groovy.runtime.callsite.PogoMetaClassSite.callCurrent(PogoMetaClassSite.java:69)
06-Feb-2020 03:28:38         at org.codehaus.groovy.runtime.callsite.CallSiteArray.defaultCallCurrent(CallSiteArray.java:52)
06-Feb-2020 03:28:38         at org.codehaus.groovy.runtime.callsite.AbstractCallSite.callCurrent(AbstractCallSite.java:154)
06-Feb-2020 03:28:38         at org.codehaus.groovy.runtime.callsite.AbstractCallSite.callCurrent(AbstractCallSite.java:166)
06-Feb-2020 03:28:38         at build_54hslkk5jqk8gxa9mlqjldrmz$_run_closure10.doCall(/opt/bamboo-home/xml-data/build-dir/SEC-B42X-JOB1/build.gradle:112)
06-Feb-2020 03:28:38         at sun.reflect.NativeMethodAccessorImpl.invoke0(Native Method)
06-Feb-2020 03:28:38         at sun.reflect.NativeMethodAccessorImpl.invoke(NativeMethodAccessorImpl.java:62)
06-Feb-2020 03:28:38         at sun.reflect.DelegatingMethodAccessorImpl.invoke(DelegatingMethodAccessorImpl.java:43)
06-Feb-2020 03:28:38         at java.lang.reflect.Method.invoke(Method.java:498)
06-Feb-2020 03:28:38         at org.codehaus.groovy.reflection.CachedMethod.invoke(CachedMethod.java:93)
06-Feb-2020 03:28:38         at groovy.lang.MetaMethod.doMethodInvoke(MetaMethod.java:325)
06-Feb-2020 03:28:38         at org.codehaus.groovy.runtime.metaclass.ClosureMetaClass.invokeMethod(ClosureMetaClass.java:294)
06-Feb-2020 03:28:38         at groovy.lang.MetaClassImpl.invokeMethod(MetaClassImpl.java:1024)
06-Feb-2020 03:28:38         at groovy.lang.Closure.call(Closure.java:414)
06-Feb-2020 03:28:38         at groovy.lang.Closure.call(Closure.java:430)
06-Feb-2020 03:28:38         at org.gradle.api.internal.ClosureBackedAction.execute(ClosureBackedAction.java:70)
06-Feb-2020 03:28:38         at org.gradle.util.ConfigureUtil.configureTarget(ConfigureUtil.java:160)
06-Feb-2020 03:28:38         at org.gradle.util.ConfigureUtil.configure(ConfigureUtil.java:106)
06-Feb-2020 03:28:38         at org.gradle.api.internal.project.DefaultProject.configure(DefaultProject.java:921)
06-Feb-2020 03:28:38         at org.gradle.api.internal.project.DefaultProject.configure(DefaultProject.java:926)
06-Feb-2020 03:28:38         at sun.reflect.NativeMethodAccessorImpl.invoke0(Native Method)
06-Feb-2020 03:28:38         at sun.reflect.NativeMethodAccessorImpl.invoke(NativeMethodAccessorImpl.java:62)
06-Feb-2020 03:28:38         at sun.reflect.DelegatingMethodAccessorImpl.invoke(DelegatingMethodAccessorImpl.java:43)
06-Feb-2020 03:28:38         at java.lang.reflect.Method.invoke(Method.java:498)
06-Feb-2020 03:28:38         at org.codehaus.groovy.reflection.CachedMethod.invoke(CachedMethod.java:93)
06-Feb-2020 03:28:38         at groovy.lang.MetaMethod.doMethodInvoke(MetaMethod.java:325)
06-Feb-2020 03:28:38         at org.gradle.internal.metaobject.BeanDynamicObject$MetaClassAdapter.invokeMethod(BeanDynamicObject.java:382)
06-Feb-2020 03:28:38         at org.gradle.internal.metaobject.BeanDynamicObject.invokeMethod(BeanDynamicObject.java:170)
06-Feb-2020 03:28:38         at org.gradle.internal.metaobject.CompositeDynamicObject.invokeMethod(CompositeDynamicObject.java:96)
06-Feb-2020 03:28:38         at org.gradle.internal.metaobject.MixInClosurePropertiesAsMethodsDynamicObject.invokeMethod(MixInClosurePropertiesAsMethodsDynamicObject.java:30)
06-Feb-2020 03:28:38         at org.gradle.internal.metaobject.AbstractDynamicObject.invokeMethod(AbstractDynamicObject.java:163)
06-Feb-2020 03:28:38         at org.gradle.groovy.scripts.BasicScript.methodMissing(BasicScript.java:83)
06-Feb-2020 03:28:38         at sun.reflect.GeneratedMethodAccessor9.invoke(Unknown Source)
06-Feb-2020 03:28:38         at sun.reflect.DelegatingMethodAccessorImpl.invoke(DelegatingMethodAccessorImpl.java:43)
06-Feb-2020 03:28:38         at java.lang.reflect.Method.invoke(Method.java:498)
06-Feb-2020 03:28:38         at org.codehaus.groovy.reflection.CachedMethod.invoke(CachedMethod.java:93)
06-Feb-2020 03:28:38         at groovy.lang.MetaClassImpl.invokeMissingMethod(MetaClassImpl.java:941)
06-Feb-2020 03:28:38         at groovy.lang.MetaClassImpl.invokePropertyOrMissing(MetaClassImpl.java:1264)
06-Feb-2020 03:28:38         at groovy.lang.MetaClassImpl.invokeMethod(MetaClassImpl.java:1217)
06-Feb-2020 03:28:38         at groovy.lang.MetaClassImpl.invokeMethod(MetaClassImpl.java:1024)
06-Feb-2020 03:28:38         at org.codehaus.groovy.runtime.callsite.PogoMetaClassSite.callCurrent(PogoMetaClassSite.java:69)
06-Feb-2020 03:28:38         at org.codehaus.groovy.runtime.callsite.CallSiteArray.defaultCallCurrent(CallSiteArray.java:52)
06-Feb-2020 03:28:38         at org.codehaus.groovy.runtime.callsite.AbstractCallSite.callCurrent(AbstractCallSite.java:154)
06-Feb-2020 03:28:38         at org.codehaus.groovy.runtime.callsite.AbstractCallSite.callCurrent(AbstractCallSite.java:174)
06-Feb-2020 03:28:38         at build_54hslkk5jqk8gxa9mlqjldrmz.run(/opt/bamboo-home/xml-data/build-dir/SEC-B42X-JOB1/build.gradle:110)
06-Feb-2020 03:28:38         at org.gradle.groovy.scripts.internal.DefaultScriptRunnerFactory$ScriptRunnerImpl.run(DefaultScriptRunnerFactory.java:90)
06-Feb-2020 03:28:38         ... 56 more
06-Feb-2020 03:28:38 Caused by: org.gradle.api.internal.plugins.PluginApplicationException: Failed to apply plugin [id 'com.jfrog.artifactory']
06-Feb-2020 03:28:38         at org.gradle.api.internal.plugins.DefaultPluginManager.doApply(DefaultPluginManager.java:155)
06-Feb-2020 03:28:38         at org.gradle.api.internal.plugins.DefaultPluginManager.apply(DefaultPluginManager.java:112)
06-Feb-2020 03:28:38         at org.gradle.api.internal.plugins.DefaultObjectConfigurationAction.applyType(DefaultObjectConfigurationAction.java:113)
06-Feb-2020 03:28:38         at org.gradle.api.internal.plugins.DefaultObjectConfigurationAction.access$200(DefaultObjectConfigurationAction.java:36)
06-Feb-2020 03:28:38         at org.gradle.api.internal.plugins.DefaultObjectConfigurationAction$3.run(DefaultObjectConfigurationAction.java:80)
06-Feb-2020 03:28:38         at org.gradle.api.internal.plugins.DefaultObjectConfigurationAction.execute(DefaultObjectConfigurationAction.java:136)
06-Feb-2020 03:28:38         at org.gradle.groovy.scripts.DefaultScript.apply(DefaultScript.java:114)
06-Feb-2020 03:28:38         at org.gradle.api.Script$apply.callCurrent(Unknown Source)
06-Feb-2020 03:28:38         at org.codehaus.groovy.runtime.callsite.CallSiteArray.defaultCallCurrent(CallSiteArray.java:52)
06-Feb-2020 03:28:38         at org.codehaus.groovy.runtime.callsite.AbstractCallSite.callCurrent(AbstractCallSite.java:154)
06-Feb-2020 03:28:38         at org.codehaus.groovy.runtime.callsite.AbstractCallSite.callCurrent(AbstractCallSite.java:166)
06-Feb-2020 03:28:38         at artifactory_do0x2satu4xr1js8ccmm5hu99.run(/opt/bamboo-home/xml-data/build-dir/SEC-B42X-JOB1/gradle/artifactory.gradle:1)
06-Feb-2020 03:28:38         at org.gradle.groovy.scripts.internal.DefaultScriptRunnerFactory$ScriptRunnerImpl.run(DefaultScriptRunnerFactory.java:90)
06-Feb-2020 03:28:38         ... 123 more
06-Feb-2020 03:28:38 Caused by: org.codehaus.groovy.runtime.typehandling.GroovyCastException: Cannot cast object 'org.jfrog.gradle.plugin.artifactory.dsl.ArtifactoryPluginConvention@54ad9ff9' with class 'org.jfrog.gradle.plugin.artifactory.dsl.ArtifactoryPluginConvention' to class 'org.jfrog.gradle.plugin.artifactory.dsl.ArtifactoryPluginConvention'
06-Feb-2020 03:28:38         at org.codehaus.groovy.runtime.typehandling.DefaultTypeTransformation.continueCastOnSAM(DefaultTypeTransformation.java:405)
06-Feb-2020 03:28:38         at org.codehaus.groovy.runtime.typehandling.DefaultTypeTransformation.continueCastOnNumber(DefaultTypeTransformation.java:319)
06-Feb-2020 03:28:38         at org.codehaus.groovy.runtime.typehandling.DefaultTypeTransformation.castToType(DefaultTypeTransformation.java:232)
06-Feb-2020 03:28:38         at org.codehaus.groovy.runtime.ScriptBytecodeAdapter.castToType(ScriptBytecodeAdapter.java:603)
06-Feb-2020 03:28:38         at org.jfrog.gradle.plugin.artifactory.ArtifactoryPluginBase.getArtifactoryPluginConvention(ArtifactoryPluginBase.groovy:73)
06-Feb-2020 03:28:38         at sun.reflect.NativeMethodAccessorImpl.invoke0(Native Method)
06-Feb-2020 03:28:38         at sun.reflect.NativeMethodAccessorImpl.invoke(NativeMethodAccessorImpl.java:62)
06-Feb-2020 03:28:38         at sun.reflect.DelegatingMethodAccessorImpl.invoke(DelegatingMethodAccessorImpl.java:43)
06-Feb-2020 03:28:38         at java.lang.reflect.Method.invoke(Method.java:498)
06-Feb-2020 03:28:38         at org.codehaus.groovy.runtime.callsite.PogoMetaMethodSite$PogoCachedMethodSiteNoUnwrapNoCoerce.invoke(PogoMetaMethodSite.java:210)
06-Feb-2020 03:28:38         at org.codehaus.groovy.runtime.callsite.PogoMetaMethodSite.callCurrent(PogoMetaMethodSite.java:59)
06-Feb-2020 03:28:38         at org.codehaus.groovy.runtime.callsite.CallSiteArray.defaultCallCurrent(CallSiteArray.java:52)
06-Feb-2020 03:28:38         at org.codehaus.groovy.runtime.callsite.AbstractCallSite.callCurrent(AbstractCallSite.java:154)
06-Feb-2020 03:28:38         at org.codehaus.groovy.runtime.callsite.AbstractCallSite.callCurrent(AbstractCallSite.java:166)
06-Feb-2020 03:28:38         at org.jfrog.gradle.plugin.artifactory.ArtifactoryPluginBase.apply(ArtifactoryPluginBase.groovy:41)
06-Feb-2020 03:28:38         at org.jfrog.gradle.plugin.artifactory.ArtifactoryPluginBase.apply(ArtifactoryPluginBase.groovy)
06-Feb-2020 03:28:38         at org.gradle.api.internal.plugins.ImperativeOnlyPluginApplicator.applyImperative(ImperativeOnlyPluginApplicator.java:35)
06-Feb-2020 03:28:38         at org.gradle.api.internal.plugins.RuleBasedPluginApplicator.applyImperative(RuleBasedPluginApplicator.java:43)
06-Feb-2020 03:28:38         at org.gradle.api.internal.plugins.DefaultPluginManager.doApply(DefaultPluginManager.java:139)
06-Feb-2020 03:28:38         ... 135 more
06-Feb-2020 03:28:38 Cause 52: org.gradle.api.ProjectConfigurationException: A problem occurred configuring root project 'spring-security'.
06-Feb-2020 03:28:38         at org.gradle.configuration.project.LifecycleProjectEvaluator.addConfigurationFailure(LifecycleProjectEvaluator.java:79)
06-Feb-2020 03:28:38         at org.gradle.configuration.project.LifecycleProjectEvaluator.evaluate(LifecycleProjectEvaluator.java:57)
06-Feb-2020 03:28:38         at org.gradle.api.internal.project.DefaultProject.evaluate(DefaultProject.java:573)
06-Feb-2020 03:28:38         at org.gradle.api.internal.project.DefaultProject.evaluate(DefaultProject.java:125)
06-Feb-2020 03:28:38         at org.gradle.execution.TaskPathProjectEvaluator.configureHierarchy(TaskPathProjectEvaluator.java:42)
06-Feb-2020 03:28:38         at org.gradle.configuration.DefaultBuildConfigurer.configure(DefaultBuildConfigurer.java:38)
06-Feb-2020 03:28:38         at org.gradle.initialization.DefaultGradleLauncher$2.run(DefaultGradleLauncher.java:124)
06-Feb-2020 03:28:38         at org.gradle.internal.Factories$1.create(Factories.java:22)
06-Feb-2020 03:28:38         at org.gradle.internal.progress.DefaultBuildOperationExecutor.run(DefaultBuildOperationExecutor.java:91)
06-Feb-2020 03:28:38         at org.gradle.internal.progress.DefaultBuildOperationExecutor.run(DefaultBuildOperationExecutor.java:53)
06-Feb-2020 03:28:38         at org.gradle.initialization.DefaultGradleLauncher.doBuildStages(DefaultGradleLauncher.java:121)
06-Feb-2020 03:28:38         at org.gradle.initialization.DefaultGradleLauncher.access$200(DefaultGradleLauncher.java:32)
06-Feb-2020 03:28:38         at org.gradle.initialization.DefaultGradleLauncher$1.create(DefaultGradleLauncher.java:98)
06-Feb-2020 03:28:38         at org.gradle.initialization.DefaultGradleLauncher$1.create(DefaultGradleLauncher.java:92)
06-Feb-2020 03:28:38         at org.gradle.internal.progress.DefaultBuildOperationExecutor.run(DefaultBuildOperationExecutor.java:91)
06-Feb-2020 03:28:38         at org.gradle.internal.progress.DefaultBuildOperationExecutor.run(DefaultBuildOperationExecutor.java:63)
06-Feb-2020 03:28:38         at org.gradle.initialization.DefaultGradleLauncher.doBuild(DefaultGradleLauncher.java:92)
06-Feb-2020 03:28:38         at org.gradle.initialization.DefaultGradleLauncher.run(DefaultGradleLauncher.java:83)
06-Feb-2020 03:28:38         at org.gradle.launcher.exec.InProcessBuildActionExecuter$DefaultBuildController.run(InProcessBuildActionExecuter.java:94)
06-Feb-2020 03:28:38         at org.gradle.tooling.internal.provider.ExecuteBuildActionRunner.run(ExecuteBuildActionRunner.java:28)
06-Feb-2020 03:28:38         at org.gradle.launcher.exec.ChainingBuildActionRunner.run(ChainingBuildActionRunner.java:35)
06-Feb-2020 03:28:38         at org.gradle.launcher.exec.InProcessBuildActionExecuter.execute(InProcessBuildActionExecuter.java:43)
06-Feb-2020 03:28:38         at org.gradle.launcher.exec.InProcessBuildActionExecuter.execute(InProcessBuildActionExecuter.java:28)
06-Feb-2020 03:28:38         at org.gradle.launcher.exec.ContinuousBuildActionExecuter.execute(ContinuousBuildActionExecuter.java:82)
06-Feb-2020 03:28:38         at org.gradle.launcher.exec.ContinuousBuildActionExecuter.execute(ContinuousBuildActionExecuter.java:49)
06-Feb-2020 03:28:38         at org.gradle.launcher.cli.RunBuildAction.run(RunBuildAction.java:43)
06-Feb-2020 03:28:38         at org.gradle.internal.Actions$RunnableActionAdapter.execute(Actions.java:173)
06-Feb-2020 03:28:38         at org.gradle.launcher.cli.CommandLineActionFactory$ParseAndBuildAction.execute(CommandLineActionFactory.java:244)
06-Feb-2020 03:28:38         at org.gradle.launcher.cli.CommandLineActionFactory$ParseAndBuildAction.execute(CommandLineActionFactory.java:217)
06-Feb-2020 03:28:38         at org.gradle.launcher.cli.JavaRuntimeValidationAction.execute(JavaRuntimeValidationAction.java:33)
06-Feb-2020 03:28:38         at org.gradle.launcher.cli.JavaRuntimeValidationAction.execute(JavaRuntimeValidationAction.java:24)
06-Feb-2020 03:28:38         at org.gradle.launcher.cli.ExceptionReportingAction.execute(ExceptionReportingAction.java:33)
06-Feb-2020 03:28:38         at org.gradle.launcher.cli.ExceptionReportingAction.execute(ExceptionReportingAction.java:22)
06-Feb-2020 03:28:38         at org.gradle.launcher.cli.CommandLineActionFactory$WithLogging.execute(CommandLineActionFactory.java:210)
06-Feb-2020 03:28:38         at org.gradle.launcher.cli.CommandLineActionFactory$WithLogging.execute(CommandLineActionFactory.java:174)
06-Feb-2020 03:28:38         at org.gradle.launcher.Main.doAction(Main.java:33)
06-Feb-2020 03:28:38         at org.gradle.launcher.bootstrap.EntryPoint.run(EntryPoint.java:45)
06-Feb-2020 03:28:38         at sun.reflect.NativeMethodAccessorImpl.invoke0(Native Method)
06-Feb-2020 03:28:38         at sun.reflect.NativeMethodAccessorImpl.invoke(NativeMethodAccessorImpl.java:62)
06-Feb-2020 03:28:38         at sun.reflect.DelegatingMethodAccessorImpl.invoke(DelegatingMethodAccessorImpl.java:43)
06-Feb-2020 03:28:38         at java.lang.reflect.Method.invoke(Method.java:498)
06-Feb-2020 03:28:38         at org.gradle.launcher.bootstrap.ProcessBootstrap.runNoExit(ProcessBootstrap.java:60)
06-Feb-2020 03:28:38         at org.gradle.launcher.bootstrap.ProcessBootstrap.run(ProcessBootstrap.java:37)
06-Feb-2020 03:28:38         at org.gradle.launcher.GradleMain.main(GradleMain.java:23)
06-Feb-2020 03:28:38         at sun.reflect.NativeMethodAccessorImpl.invoke0(Native Method)
06-Feb-2020 03:28:38         at sun.reflect.NativeMethodAccessorImpl.invoke(NativeMethodAccessorImpl.java:62)
06-Feb-2020 03:28:38         at sun.reflect.DelegatingMethodAccessorImpl.invoke(DelegatingMethodAccessorImpl.java:43)
06-Feb-2020 03:28:38         at java.lang.reflect.Method.invoke(Method.java:498)
06-Feb-2020 03:28:38         at org.gradle.wrapper.BootstrapMainStarter.start(BootstrapMainStarter.java:30)
06-Feb-2020 03:28:38         at org.gradle.wrapper.WrapperExecutor.execute(WrapperExecutor.java:129)
06-Feb-2020 03:28:38         at org.gradle.wrapper.GradleWrapperMain.main(GradleWrapperMain.java:61)
06-Feb-2020 03:28:38 Caused by: org.gradle.api.GradleScriptException: A problem occurred evaluating root project 'spring-security'.
06-Feb-2020 03:28:38         at org.gradle.groovy.scripts.internal.DefaultScriptRunnerFactory$ScriptRunnerImpl.run(DefaultScriptRunnerFactory.java:92)
06-Feb-2020 03:28:38         at org.gradle.configuration.DefaultScriptPluginFactory$ScriptPluginImpl$2.run(DefaultScriptPluginFactory.java:177)
06-Feb-2020 03:28:38         at org.gradle.configuration.ProjectScriptTarget.addConfiguration(ProjectScriptTarget.java:77)
06-Feb-2020 03:28:38         at org.gradle.configuration.DefaultScriptPluginFactory$ScriptPluginImpl.apply(DefaultScriptPluginFactory.java:182)
06-Feb-2020 03:28:38         at org.gradle.configuration.project.BuildScriptProcessor.execute(BuildScriptProcessor.java:38)
06-Feb-2020 03:28:38         at org.gradle.configuration.project.BuildScriptProcessor.execute(BuildScriptProcessor.java:25)
06-Feb-2020 03:28:38         at org.gradle.configuration.project.ConfigureActionsProjectEvaluator.evaluate(ConfigureActionsProjectEvaluator.java:34)
06-Feb-2020 03:28:38         at org.gradle.configuration.project.LifecycleProjectEvaluator.evaluate(LifecycleProjectEvaluator.java:55)
06-Feb-2020 03:28:38         ... 49 more
06-Feb-2020 03:28:38 Caused by: org.gradle.api.GradleScriptException: A problem occurred evaluating script.
06-Feb-2020 03:28:38         at org.gradle.groovy.scripts.internal.DefaultScriptRunnerFactory$ScriptRunnerImpl.run(DefaultScriptRunnerFactory.java:92)
06-Feb-2020 03:28:38         at org.gradle.configuration.DefaultScriptPluginFactory$ScriptPluginImpl$2.run(DefaultScriptPluginFactory.java:177)
06-Feb-2020 03:28:38         at org.gradle.configuration.DefaultScriptTarget.addConfiguration(DefaultScriptTarget.java:74)
06-Feb-2020 03:28:38         at org.gradle.configuration.DefaultScriptPluginFactory$ScriptPluginImpl.apply(DefaultScriptPluginFactory.java:182)
06-Feb-2020 03:28:38         at org.gradle.api.internal.plugins.DefaultObjectConfigurationAction.applyScript(DefaultObjectConfigurationAction.java:102)
06-Feb-2020 03:28:38         at org.gradle.api.internal.plugins.DefaultObjectConfigurationAction.access$000(DefaultObjectConfigurationAction.java:36)
06-Feb-2020 03:28:38         at org.gradle.api.internal.plugins.DefaultObjectConfigurationAction$1.run(DefaultObjectConfigurationAction.java:62)
06-Feb-2020 03:28:38         at org.gradle.api.internal.plugins.DefaultObjectConfigurationAction.execute(DefaultObjectConfigurationAction.java:136)
06-Feb-2020 03:28:38         at org.gradle.api.internal.project.AbstractPluginAware.apply(AbstractPluginAware.java:44)
06-Feb-2020 03:28:38         at sun.reflect.GeneratedMethodAccessor40.invoke(Unknown Source)
06-Feb-2020 03:28:38         at sun.reflect.DelegatingMethodAccessorImpl.invoke(DelegatingMethodAccessorImpl.java:43)
06-Feb-2020 03:28:38         at java.lang.reflect.Method.invoke(Method.java:498)
06-Feb-2020 03:28:38         at org.codehaus.groovy.reflection.CachedMethod.invoke(CachedMethod.java:93)
06-Feb-2020 03:28:38         at groovy.lang.MetaMethod.doMethodInvoke(MetaMethod.java:325)
06-Feb-2020 03:28:38         at org.gradle.internal.metaobject.BeanDynamicObject$MetaClassAdapter.invokeMethod(BeanDynamicObject.java:382)
06-Feb-2020 03:28:38         at org.gradle.internal.metaobject.BeanDynamicObject.invokeMethod(BeanDynamicObject.java:170)
06-Feb-2020 03:28:38         at org.gradle.internal.metaobject.CompositeDynamicObject.invokeMethod(CompositeDynamicObject.java:96)
06-Feb-2020 03:28:38         at org.gradle.internal.metaobject.MixInClosurePropertiesAsMethodsDynamicObject.invokeMethod(MixInClosurePropertiesAsMethodsDynamicObject.java:30)
06-Feb-2020 03:28:38         at org.gradle.internal.metaobject.ConfigureDelegate.invokeMethod(ConfigureDelegate.java:59)
06-Feb-2020 03:28:38         at org.codehaus.groovy.runtime.metaclass.ClosureMetaClass.invokeOnDelegationObjects(ClosureMetaClass.java:430)
06-Feb-2020 03:28:38         at org.codehaus.groovy.runtime.metaclass.ClosureMetaClass.invokeMethod(ClosureMetaClass.java:369)
06-Feb-2020 03:28:38         at groovy.lang.MetaClassImpl.invokeMethod(MetaClassImpl.java:1024)
06-Feb-2020 03:28:38         at org.codehaus.groovy.runtime.callsite.PogoMetaClassSite.callCurrent(PogoMetaClassSite.java:69)
06-Feb-2020 03:28:38         at org.codehaus.groovy.runtime.callsite.CallSiteArray.defaultCallCurrent(CallSiteArray.java:52)
06-Feb-2020 03:28:38         at org.codehaus.groovy.runtime.callsite.AbstractCallSite.callCurrent(AbstractCallSite.java:154)
06-Feb-2020 03:28:38         at org.codehaus.groovy.runtime.callsite.AbstractCallSite.callCurrent(AbstractCallSite.java:166)
06-Feb-2020 03:28:38         at build_54hslkk5jqk8gxa9mlqjldrmz$_run_closure10.doCall(/opt/bamboo-home/xml-data/build-dir/SEC-B42X-JOB1/build.gradle:112)
06-Feb-2020 03:28:38         at sun.reflect.NativeMethodAccessorImpl.invoke0(Native Method)
06-Feb-2020 03:28:38         at sun.reflect.NativeMethodAccessorImpl.invoke(NativeMethodAccessorImpl.java:62)
06-Feb-2020 03:28:38         at sun.reflect.DelegatingMethodAccessorImpl.invoke(DelegatingMethodAccessorImpl.java:43)
06-Feb-2020 03:28:38         at java.lang.reflect.Method.invoke(Method.java:498)
06-Feb-2020 03:28:38         at org.codehaus.groovy.reflection.CachedMethod.invoke(CachedMethod.java:93)
06-Feb-2020 03:28:38         at groovy.lang.MetaMethod.doMethodInvoke(MetaMethod.java:325)
06-Feb-2020 03:28:38         at org.codehaus.groovy.runtime.metaclass.ClosureMetaClass.invokeMethod(ClosureMetaClass.java:294)
06-Feb-2020 03:28:38         at groovy.lang.MetaClassImpl.invokeMethod(MetaClassImpl.java:1024)
06-Feb-2020 03:28:38         at groovy.lang.Closure.call(Closure.java:414)
06-Feb-2020 03:28:38         at groovy.lang.Closure.call(Closure.java:430)
06-Feb-2020 03:28:38         at org.gradle.api.internal.ClosureBackedAction.execute(ClosureBackedAction.java:70)
06-Feb-2020 03:28:38         at org.gradle.util.ConfigureUtil.configureTarget(ConfigureUtil.java:160)
06-Feb-2020 03:28:38         at org.gradle.util.ConfigureUtil.configure(ConfigureUtil.java:106)
06-Feb-2020 03:28:38         at org.gradle.api.internal.project.DefaultProject.configure(DefaultProject.java:921)
06-Feb-2020 03:28:38         at org.gradle.api.internal.project.DefaultProject.configure(DefaultProject.java:926)
06-Feb-2020 03:28:38         at sun.reflect.NativeMethodAccessorImpl.invoke0(Native Method)
06-Feb-2020 03:28:38         at sun.reflect.NativeMethodAccessorImpl.invoke(NativeMethodAccessorImpl.java:62)
06-Feb-2020 03:28:38         at sun.reflect.DelegatingMethodAccessorImpl.invoke(DelegatingMethodAccessorImpl.java:43)
06-Feb-2020 03:28:38         at java.lang.reflect.Method.invoke(Method.java:498)
06-Feb-2020 03:28:38         at org.codehaus.groovy.reflection.CachedMethod.invoke(CachedMethod.java:93)
06-Feb-2020 03:28:38         at groovy.lang.MetaMethod.doMethodInvoke(MetaMethod.java:325)
06-Feb-2020 03:28:38         at org.gradle.internal.metaobject.BeanDynamicObject$MetaClassAdapter.invokeMethod(BeanDynamicObject.java:382)
06-Feb-2020 03:28:38         at org.gradle.internal.metaobject.BeanDynamicObject.invokeMethod(BeanDynamicObject.java:170)
06-Feb-2020 03:28:38         at org.gradle.internal.metaobject.CompositeDynamicObject.invokeMethod(CompositeDynamicObject.java:96)
06-Feb-2020 03:28:38         at org.gradle.internal.metaobject.MixInClosurePropertiesAsMethodsDynamicObject.invokeMethod(MixInClosurePropertiesAsMethodsDynamicObject.java:30)
06-Feb-2020 03:28:38         at org.gradle.internal.metaobject.AbstractDynamicObject.invokeMethod(AbstractDynamicObject.java:163)
06-Feb-2020 03:28:38         at org.gradle.groovy.scripts.BasicScript.methodMissing(BasicScript.java:83)
06-Feb-2020 03:28:38         at sun.reflect.GeneratedMethodAccessor9.invoke(Unknown Source)
06-Feb-2020 03:28:38         at sun.reflect.DelegatingMethodAccessorImpl.invoke(DelegatingMethodAccessorImpl.java:43)
06-Feb-2020 03:28:38         at java.lang.reflect.Method.invoke(Method.java:498)
06-Feb-2020 03:28:38         at org.codehaus.groovy.reflection.CachedMethod.invoke(CachedMethod.java:93)
06-Feb-2020 03:28:38         at groovy.lang.MetaClassImpl.invokeMissingMethod(MetaClassImpl.java:941)
06-Feb-2020 03:28:38         at groovy.lang.MetaClassImpl.invokePropertyOrMissing(MetaClassImpl.java:1264)
06-Feb-2020 03:28:38         at groovy.lang.MetaClassImpl.invokeMethod(MetaClassImpl.java:1217)
06-Feb-2020 03:28:38         at groovy.lang.MetaClassImpl.invokeMethod(MetaClassImpl.java:1024)
06-Feb-2020 03:28:38         at org.codehaus.groovy.runtime.callsite.PogoMetaClassSite.callCurrent(PogoMetaClassSite.java:69)
06-Feb-2020 03:28:38         at org.codehaus.groovy.runtime.callsite.CallSiteArray.defaultCallCurrent(CallSiteArray.java:52)
06-Feb-2020 03:28:38         at org.codehaus.groovy.runtime.callsite.AbstractCallSite.callCurrent(AbstractCallSite.java:154)
06-Feb-2020 03:28:38         at org.codehaus.groovy.runtime.callsite.AbstractCallSite.callCurrent(AbstractCallSite.java:174)
06-Feb-2020 03:28:38         at build_54hslkk5jqk8gxa9mlqjldrmz.run(/opt/bamboo-home/xml-data/build-dir/SEC-B42X-JOB1/build.gradle:110)
06-Feb-2020 03:28:38         at org.gradle.groovy.scripts.internal.DefaultScriptRunnerFactory$ScriptRunnerImpl.run(DefaultScriptRunnerFactory.java:90)
06-Feb-2020 03:28:38         ... 56 more
06-Feb-2020 03:28:38 Caused by: org.gradle.api.internal.plugins.PluginApplicationException: Failed to apply plugin [id 'com.jfrog.artifactory']
06-Feb-2020 03:28:38         at org.gradle.api.internal.plugins.DefaultPluginManager.doApply(DefaultPluginManager.java:155)
06-Feb-2020 03:28:38         at org.gradle.api.internal.plugins.DefaultPluginManager.apply(DefaultPluginManager.java:112)
06-Feb-2020 03:28:38         at org.gradle.api.internal.plugins.DefaultObjectConfigurationAction.applyType(DefaultObjectConfigurationAction.java:113)
06-Feb-2020 03:28:38         at org.gradle.api.internal.plugins.DefaultObjectConfigurationAction.access$200(DefaultObjectConfigurationAction.java:36)
06-Feb-2020 03:28:38         at org.gradle.api.internal.plugins.DefaultObjectConfigurationAction$3.run(DefaultObjectConfigurationAction.java:80)
06-Feb-2020 03:28:38         at org.gradle.api.internal.plugins.DefaultObjectConfigurationAction.execute(DefaultObjectConfigurationAction.java:136)
06-Feb-2020 03:28:38         at org.gradle.groovy.scripts.DefaultScript.apply(DefaultScript.java:114)
06-Feb-2020 03:28:38         at org.gradle.api.Script$apply.callCurrent(Unknown Source)
06-Feb-2020 03:28:38         at org.codehaus.groovy.runtime.callsite.CallSiteArray.defaultCallCurrent(CallSiteArray.java:52)
06-Feb-2020 03:28:38         at org.codehaus.groovy.runtime.callsite.AbstractCallSite.callCurrent(AbstractCallSite.java:154)
06-Feb-2020 03:28:38         at org.codehaus.groovy.runtime.callsite.AbstractCallSite.callCurrent(AbstractCallSite.java:166)
06-Feb-2020 03:28:38         at artifactory_do0x2satu4xr1js8ccmm5hu99.run(/opt/bamboo-home/xml-data/build-dir/SEC-B42X-JOB1/gradle/artifactory.gradle:1)
06-Feb-2020 03:28:38         at org.gradle.groovy.scripts.internal.DefaultScriptRunnerFactory$ScriptRunnerImpl.run(DefaultScriptRunnerFactory.java:90)
06-Feb-2020 03:28:38         ... 123 more
06-Feb-2020 03:28:38 Caused by: org.codehaus.groovy.runtime.typehandling.GroovyCastException: Cannot cast object 'org.jfrog.gradle.plugin.artifactory.dsl.ArtifactoryPluginConvention@54ad9ff9' with class 'org.jfrog.gradle.plugin.artifactory.dsl.ArtifactoryPluginConvention' to class 'org.jfrog.gradle.plugin.artifactory.dsl.ArtifactoryPluginConvention'
06-Feb-2020 03:28:38         at org.codehaus.groovy.runtime.typehandling.DefaultTypeTransformation.continueCastOnSAM(DefaultTypeTransformation.java:405)
06-Feb-2020 03:28:38         at org.codehaus.groovy.runtime.typehandling.DefaultTypeTransformation.continueCastOnNumber(DefaultTypeTransformation.java:319)
06-Feb-2020 03:28:38         at org.codehaus.groovy.runtime.typehandling.DefaultTypeTransformation.castToType(DefaultTypeTransformation.java:232)
06-Feb-2020 03:28:38         at org.codehaus.groovy.runtime.ScriptBytecodeAdapter.castToType(ScriptBytecodeAdapter.java:603)
06-Feb-2020 03:28:38         at org.jfrog.gradle.plugin.artifactory.ArtifactoryPluginBase.getArtifactoryPluginConvention(ArtifactoryPluginBase.groovy:73)
06-Feb-2020 03:28:38         at sun.reflect.NativeMethodAccessorImpl.invoke0(Native Method)
06-Feb-2020 03:28:38         at sun.reflect.NativeMethodAccessorImpl.invoke(NativeMethodAccessorImpl.java:62)
06-Feb-2020 03:28:38         at sun.reflect.DelegatingMethodAccessorImpl.invoke(DelegatingMethodAccessorImpl.java:43)
06-Feb-2020 03:28:38         at java.lang.reflect.Method.invoke(Method.java:498)
06-Feb-2020 03:28:38         at org.codehaus.groovy.runtime.callsite.PogoMetaMethodSite$PogoCachedMethodSiteNoUnwrapNoCoerce.invoke(PogoMetaMethodSite.java:210)
06-Feb-2020 03:28:38         at org.codehaus.groovy.runtime.callsite.PogoMetaMethodSite.callCurrent(PogoMetaMethodSite.java:59)
06-Feb-2020 03:28:38         at org.codehaus.groovy.runtime.callsite.CallSiteArray.defaultCallCurrent(CallSiteArray.java:52)
06-Feb-2020 03:28:38         at org.codehaus.groovy.runtime.callsite.AbstractCallSite.callCurrent(AbstractCallSite.java:154)
06-Feb-2020 03:28:38         at org.codehaus.groovy.runtime.callsite.AbstractCallSite.callCurrent(AbstractCallSite.java:166)
06-Feb-2020 03:28:38         at org.jfrog.gradle.plugin.artifactory.ArtifactoryPluginBase.apply(ArtifactoryPluginBase.groovy:41)
06-Feb-2020 03:28:38         at org.jfrog.gradle.plugin.artifactory.ArtifactoryPluginBase.apply(ArtifactoryPluginBase.groovy)
06-Feb-2020 03:28:38         at org.gradle.api.internal.plugins.ImperativeOnlyPluginApplicator.applyImperative(ImperativeOnlyPluginApplicator.java:35)
06-Feb-2020 03:28:38         at org.gradle.api.internal.plugins.RuleBasedPluginApplicator.applyImperative(RuleBasedPluginApplicator.java:43)
06-Feb-2020 03:28:38         at org.gradle.api.internal.plugins.DefaultPluginManager.doApply(DefaultPluginManager.java:139)
06-Feb-2020 03:28:38         ... 135 more
06-Feb-2020 03:28:38 Cause 53: org.gradle.api.ProjectConfigurationException: A problem occurred configuring root project 'spring-security'.
06-Feb-2020 03:28:38         at org.gradle.configuration.project.LifecycleProjectEvaluator.addConfigurationFailure(LifecycleProjectEvaluator.java:79)
06-Feb-2020 03:28:38         at org.gradle.configuration.project.LifecycleProjectEvaluator.evaluate(LifecycleProjectEvaluator.java:57)
06-Feb-2020 03:28:38         at org.gradle.api.internal.project.DefaultProject.evaluate(DefaultProject.java:573)
06-Feb-2020 03:28:38         at org.gradle.api.internal.project.DefaultProject.evaluate(DefaultProject.java:125)
06-Feb-2020 03:28:38         at org.gradle.execution.TaskPathProjectEvaluator.configureHierarchy(TaskPathProjectEvaluator.java:42)
06-Feb-2020 03:28:38         at org.gradle.configuration.DefaultBuildConfigurer.configure(DefaultBuildConfigurer.java:38)
06-Feb-2020 03:28:38         at org.gradle.initialization.DefaultGradleLauncher$2.run(DefaultGradleLauncher.java:124)
06-Feb-2020 03:28:38         at org.gradle.internal.Factories$1.create(Factories.java:22)
06-Feb-2020 03:28:38         at org.gradle.internal.progress.DefaultBuildOperationExecutor.run(DefaultBuildOperationExecutor.java:91)
06-Feb-2020 03:28:38         at org.gradle.internal.progress.DefaultBuildOperationExecutor.run(DefaultBuildOperationExecutor.java:53)
06-Feb-2020 03:28:38         at org.gradle.initialization.DefaultGradleLauncher.doBuildStages(DefaultGradleLauncher.java:121)
06-Feb-2020 03:28:38         at org.gradle.initialization.DefaultGradleLauncher.access$200(DefaultGradleLauncher.java:32)
06-Feb-2020 03:28:38         at org.gradle.initialization.DefaultGradleLauncher$1.create(DefaultGradleLauncher.java:98)
06-Feb-2020 03:28:38         at org.gradle.initialization.DefaultGradleLauncher$1.create(DefaultGradleLauncher.java:92)
06-Feb-2020 03:28:38         at org.gradle.internal.progress.DefaultBuildOperationExecutor.run(DefaultBuildOperationExecutor.java:91)
06-Feb-2020 03:28:38         at org.gradle.internal.progress.DefaultBuildOperationExecutor.run(DefaultBuildOperationExecutor.java:63)
06-Feb-2020 03:28:38         at org.gradle.initialization.DefaultGradleLauncher.doBuild(DefaultGradleLauncher.java:92)
06-Feb-2020 03:28:38         at org.gradle.initialization.DefaultGradleLauncher.run(DefaultGradleLauncher.java:83)
06-Feb-2020 03:28:38         at org.gradle.launcher.exec.InProcessBuildActionExecuter$DefaultBuildController.run(InProcessBuildActionExecuter.java:94)
06-Feb-2020 03:28:38         at org.gradle.tooling.internal.provider.ExecuteBuildActionRunner.run(ExecuteBuildActionRunner.java:28)
06-Feb-2020 03:28:38         at org.gradle.launcher.exec.ChainingBuildActionRunner.run(ChainingBuildActionRunner.java:35)
06-Feb-2020 03:28:38         at org.gradle.launcher.exec.InProcessBuildActionExecuter.execute(InProcessBuildActionExecuter.java:43)
06-Feb-2020 03:28:38         at org.gradle.launcher.exec.InProcessBuildActionExecuter.execute(InProcessBuildActionExecuter.java:28)
06-Feb-2020 03:28:38         at org.gradle.launcher.exec.ContinuousBuildActionExecuter.execute(ContinuousBuildActionExecuter.java:82)
06-Feb-2020 03:28:38         at org.gradle.launcher.exec.ContinuousBuildActionExecuter.execute(ContinuousBuildActionExecuter.java:49)
06-Feb-2020 03:28:38         at org.gradle.launcher.cli.RunBuildAction.run(RunBuildAction.java:43)
06-Feb-2020 03:28:38         at org.gradle.internal.Actions$RunnableActionAdapter.execute(Actions.java:173)
06-Feb-2020 03:28:38         at org.gradle.launcher.cli.CommandLineActionFactory$ParseAndBuildAction.execute(CommandLineActionFactory.java:244)
06-Feb-2020 03:28:38         at org.gradle.launcher.cli.CommandLineActionFactory$ParseAndBuildAction.execute(CommandLineActionFactory.java:217)
06-Feb-2020 03:28:38         at org.gradle.launcher.cli.JavaRuntimeValidationAction.execute(JavaRuntimeValidationAction.java:33)
06-Feb-2020 03:28:38         at org.gradle.launcher.cli.JavaRuntimeValidationAction.execute(JavaRuntimeValidationAction.java:24)
06-Feb-2020 03:28:38         at org.gradle.launcher.cli.ExceptionReportingAction.execute(ExceptionReportingAction.java:33)
06-Feb-2020 03:28:38         at org.gradle.launcher.cli.ExceptionReportingAction.execute(ExceptionReportingAction.java:22)
06-Feb-2020 03:28:38         at org.gradle.launcher.cli.CommandLineActionFactory$WithLogging.execute(CommandLineActionFactory.java:210)
06-Feb-2020 03:28:38         at org.gradle.launcher.cli.CommandLineActionFactory$WithLogging.execute(CommandLineActionFactory.java:174)
06-Feb-2020 03:28:38         at org.gradle.launcher.Main.doAction(Main.java:33)
06-Feb-2020 03:28:38         at org.gradle.launcher.bootstrap.EntryPoint.run(EntryPoint.java:45)
06-Feb-2020 03:28:38         at sun.reflect.NativeMethodAccessorImpl.invoke0(Native Method)
06-Feb-2020 03:28:38         at sun.reflect.NativeMethodAccessorImpl.invoke(NativeMethodAccessorImpl.java:62)
06-Feb-2020 03:28:38         at sun.reflect.DelegatingMethodAccessorImpl.invoke(DelegatingMethodAccessorImpl.java:43)
06-Feb-2020 03:28:38         at java.lang.reflect.Method.invoke(Method.java:498)
06-Feb-2020 03:28:38         at org.gradle.launcher.bootstrap.ProcessBootstrap.runNoExit(ProcessBootstrap.java:60)
06-Feb-2020 03:28:38         at org.gradle.launcher.bootstrap.ProcessBootstrap.run(ProcessBootstrap.java:37)
06-Feb-2020 03:28:38         at org.gradle.launcher.GradleMain.main(GradleMain.java:23)
06-Feb-2020 03:28:38         at sun.reflect.NativeMethodAccessorImpl.invoke0(Native Method)
06-Feb-2020 03:28:38         at sun.reflect.NativeMethodAccessorImpl.invoke(NativeMethodAccessorImpl.java:62)
06-Feb-2020 03:28:38         at sun.reflect.DelegatingMethodAccessorImpl.invoke(DelegatingMethodAccessorImpl.java:43)
06-Feb-2020 03:28:38         at java.lang.reflect.Method.invoke(Method.java:498)
06-Feb-2020 03:28:38         at org.gradle.wrapper.BootstrapMainStarter.start(BootstrapMainStarter.java:30)
06-Feb-2020 03:28:38         at org.gradle.wrapper.WrapperExecutor.execute(WrapperExecutor.java:129)
06-Feb-2020 03:28:38         at org.gradle.wrapper.GradleWrapperMain.main(GradleWrapperMain.java:61)
06-Feb-2020 03:28:38 Caused by: org.gradle.api.GradleScriptException: A problem occurred evaluating root project 'spring-security'.
06-Feb-2020 03:28:38         at org.gradle.groovy.scripts.internal.DefaultScriptRunnerFactory$ScriptRunnerImpl.run(DefaultScriptRunnerFactory.java:92)
06-Feb-2020 03:28:38         at org.gradle.configuration.DefaultScriptPluginFactory$ScriptPluginImpl$2.run(DefaultScriptPluginFactory.java:177)
06-Feb-2020 03:28:38         at org.gradle.configuration.ProjectScriptTarget.addConfiguration(ProjectScriptTarget.java:77)
06-Feb-2020 03:28:38         at org.gradle.configuration.DefaultScriptPluginFactory$ScriptPluginImpl.apply(DefaultScriptPluginFactory.java:182)
06-Feb-2020 03:28:38         at org.gradle.configuration.project.BuildScriptProcessor.execute(BuildScriptProcessor.java:38)
06-Feb-2020 03:28:38         at org.gradle.configuration.project.BuildScriptProcessor.execute(BuildScriptProcessor.java:25)
06-Feb-2020 03:28:38         at org.gradle.configuration.project.ConfigureActionsProjectEvaluator.evaluate(ConfigureActionsProjectEvaluator.java:34)
06-Feb-2020 03:28:38         at org.gradle.configuration.project.LifecycleProjectEvaluator.evaluate(LifecycleProjectEvaluator.java:55)
06-Feb-2020 03:28:38         ... 49 more
06-Feb-2020 03:28:38 Caused by: org.gradle.api.GradleScriptException: A problem occurred evaluating script.
06-Feb-2020 03:28:38         at org.gradle.groovy.scripts.internal.DefaultScriptRunnerFactory$ScriptRunnerImpl.run(DefaultScriptRunnerFactory.java:92)
06-Feb-2020 03:28:38         at org.gradle.configuration.DefaultScriptPluginFactory$ScriptPluginImpl$2.run(DefaultScriptPluginFactory.java:177)
06-Feb-2020 03:28:38         at org.gradle.configuration.DefaultScriptTarget.addConfiguration(DefaultScriptTarget.java:74)
06-Feb-2020 03:28:38         at org.gradle.configuration.DefaultScriptPluginFactory$ScriptPluginImpl.apply(DefaultScriptPluginFactory.java:182)
06-Feb-2020 03:28:38         at org.gradle.api.internal.plugins.DefaultObjectConfigurationAction.applyScript(DefaultObjectConfigurationAction.java:102)
06-Feb-2020 03:28:38         at org.gradle.api.internal.plugins.DefaultObjectConfigurationAction.access$000(DefaultObjectConfigurationAction.java:36)
06-Feb-2020 03:28:38         at org.gradle.api.internal.plugins.DefaultObjectConfigurationAction$1.run(DefaultObjectConfigurationAction.java:62)
06-Feb-2020 03:28:38         at org.gradle.api.internal.plugins.DefaultObjectConfigurationAction.execute(DefaultObjectConfigurationAction.java:136)
06-Feb-2020 03:28:38         at org.gradle.api.internal.project.AbstractPluginAware.apply(AbstractPluginAware.java:44)
06-Feb-2020 03:28:38         at sun.reflect.GeneratedMethodAccessor40.invoke(Unknown Source)
06-Feb-2020 03:28:38         at sun.reflect.DelegatingMethodAccessorImpl.invoke(DelegatingMethodAccessorImpl.java:43)
06-Feb-2020 03:28:38         at java.lang.reflect.Method.invoke(Method.java:498)
06-Feb-2020 03:28:38         at org.codehaus.groovy.reflection.CachedMethod.invoke(CachedMethod.java:93)
06-Feb-2020 03:28:38         at groovy.lang.MetaMethod.doMethodInvoke(MetaMethod.java:325)
06-Feb-2020 03:28:38         at org.gradle.internal.metaobject.BeanDynamicObject$MetaClassAdapter.invokeMethod(BeanDynamicObject.java:382)
06-Feb-2020 03:28:38         at org.gradle.internal.metaobject.BeanDynamicObject.invokeMethod(BeanDynamicObject.java:170)
06-Feb-2020 03:28:38         at org.gradle.internal.metaobject.CompositeDynamicObject.invokeMethod(CompositeDynamicObject.java:96)
06-Feb-2020 03:28:38         at org.gradle.internal.metaobject.MixInClosurePropertiesAsMethodsDynamicObject.invokeMethod(MixInClosurePropertiesAsMethodsDynamicObject.java:30)
06-Feb-2020 03:28:38         at org.gradle.internal.metaobject.ConfigureDelegate.invokeMethod(ConfigureDelegate.java:59)
06-Feb-2020 03:28:38         at org.codehaus.groovy.runtime.metaclass.ClosureMetaClass.invokeOnDelegationObjects(ClosureMetaClass.java:430)
06-Feb-2020 03:28:38         at org.codehaus.groovy.runtime.metaclass.ClosureMetaClass.invokeMethod(ClosureMetaClass.java:369)
06-Feb-2020 03:28:38         at groovy.lang.MetaClassImpl.invokeMethod(MetaClassImpl.java:1024)
06-Feb-2020 03:28:38         at org.codehaus.groovy.runtime.callsite.PogoMetaClassSite.callCurrent(PogoMetaClassSite.java:69)
06-Feb-2020 03:28:38         at org.codehaus.groovy.runtime.callsite.CallSiteArray.defaultCallCurrent(CallSiteArray.java:52)
06-Feb-2020 03:28:38         at org.codehaus.groovy.runtime.callsite.AbstractCallSite.callCurrent(AbstractCallSite.java:154)
06-Feb-2020 03:28:38         at org.codehaus.groovy.runtime.callsite.AbstractCallSite.callCurrent(AbstractCallSite.java:166)
06-Feb-2020 03:28:38         at build_54hslkk5jqk8gxa9mlqjldrmz$_run_closure10.doCall(/opt/bamboo-home/xml-data/build-dir/SEC-B42X-JOB1/build.gradle:112)
06-Feb-2020 03:28:38         at sun.reflect.NativeMethodAccessorImpl.invoke0(Native Method)
06-Feb-2020 03:28:38         at sun.reflect.NativeMethodAccessorImpl.invoke(NativeMethodAccessorImpl.java:62)
06-Feb-2020 03:28:38         at sun.reflect.DelegatingMethodAccessorImpl.invoke(DelegatingMethodAccessorImpl.java:43)
06-Feb-2020 03:28:38         at java.lang.reflect.Method.invoke(Method.java:498)
06-Feb-2020 03:28:38         at org.codehaus.groovy.reflection.CachedMethod.invoke(CachedMethod.java:93)
06-Feb-2020 03:28:38         at groovy.lang.MetaMethod.doMethodInvoke(MetaMethod.java:325)
06-Feb-2020 03:28:38         at org.codehaus.groovy.runtime.metaclass.ClosureMetaClass.invokeMethod(ClosureMetaClass.java:294)
06-Feb-2020 03:28:38         at groovy.lang.MetaClassImpl.invokeMethod(MetaClassImpl.java:1024)
06-Feb-2020 03:28:38         at groovy.lang.Closure.call(Closure.java:414)
06-Feb-2020 03:28:38         at groovy.lang.Closure.call(Closure.java:430)
06-Feb-2020 03:28:38         at org.gradle.api.internal.ClosureBackedAction.execute(ClosureBackedAction.java:70)
06-Feb-2020 03:28:38         at org.gradle.util.ConfigureUtil.configureTarget(ConfigureUtil.java:160)
06-Feb-2020 03:28:38         at org.gradle.util.ConfigureUtil.configure(ConfigureUtil.java:106)
06-Feb-2020 03:28:38         at org.gradle.api.internal.project.DefaultProject.configure(DefaultProject.java:921)
06-Feb-2020 03:28:38         at org.gradle.api.internal.project.DefaultProject.configure(DefaultProject.java:926)
06-Feb-2020 03:28:38         at sun.reflect.NativeMethodAccessorImpl.invoke0(Native Method)
06-Feb-2020 03:28:38         at sun.reflect.NativeMethodAccessorImpl.invoke(NativeMethodAccessorImpl.java:62)
06-Feb-2020 03:28:38         at sun.reflect.DelegatingMethodAccessorImpl.invoke(DelegatingMethodAccessorImpl.java:43)
06-Feb-2020 03:28:38         at java.lang.reflect.Method.invoke(Method.java:498)
06-Feb-2020 03:28:38         at org.codehaus.groovy.reflection.CachedMethod.invoke(CachedMethod.java:93)
06-Feb-2020 03:28:38         at groovy.lang.MetaMethod.doMethodInvoke(MetaMethod.java:325)
06-Feb-2020 03:28:38         at org.gradle.internal.metaobject.BeanDynamicObject$MetaClassAdapter.invokeMethod(BeanDynamicObject.java:382)
06-Feb-2020 03:28:38         at org.gradle.internal.metaobject.BeanDynamicObject.invokeMethod(BeanDynamicObject.java:170)
06-Feb-2020 03:28:38         at org.gradle.internal.metaobject.CompositeDynamicObject.invokeMethod(CompositeDynamicObject.java:96)
06-Feb-2020 03:28:38         at org.gradle.internal.metaobject.MixInClosurePropertiesAsMethodsDynamicObject.invokeMethod(MixInClosurePropertiesAsMethodsDynamicObject.java:30)
06-Feb-2020 03:28:38         at org.gradle.internal.metaobject.AbstractDynamicObject.invokeMethod(AbstractDynamicObject.java:163)
06-Feb-2020 03:28:38         at org.gradle.groovy.scripts.BasicScript.methodMissing(BasicScript.java:83)
06-Feb-2020 03:28:38         at sun.reflect.GeneratedMethodAccessor9.invoke(Unknown Source)
06-Feb-2020 03:28:38         at sun.reflect.DelegatingMethodAccessorImpl.invoke(DelegatingMethodAccessorImpl.java:43)
06-Feb-2020 03:28:38         at java.lang.reflect.Method.invoke(Method.java:498)
06-Feb-2020 03:28:38         at org.codehaus.groovy.reflection.CachedMethod.invoke(CachedMethod.java:93)
06-Feb-2020 03:28:38         at groovy.lang.MetaClassImpl.invokeMissingMethod(MetaClassImpl.java:941)
06-Feb-2020 03:28:38         at groovy.lang.MetaClassImpl.invokePropertyOrMissing(MetaClassImpl.java:1264)
06-Feb-2020 03:28:38         at groovy.lang.MetaClassImpl.invokeMethod(MetaClassImpl.java:1217)
06-Feb-2020 03:28:38         at groovy.lang.MetaClassImpl.invokeMethod(MetaClassImpl.java:1024)
06-Feb-2020 03:28:38         at org.codehaus.groovy.runtime.callsite.PogoMetaClassSite.callCurrent(PogoMetaClassSite.java:69)
06-Feb-2020 03:28:38         at org.codehaus.groovy.runtime.callsite.CallSiteArray.defaultCallCurrent(CallSiteArray.java:52)
06-Feb-2020 03:28:38         at org.codehaus.groovy.runtime.callsite.AbstractCallSite.callCurrent(AbstractCallSite.java:154)
06-Feb-2020 03:28:38         at org.codehaus.groovy.runtime.callsite.AbstractCallSite.callCurrent(AbstractCallSite.java:174)
06-Feb-2020 03:28:38         at build_54hslkk5jqk8gxa9mlqjldrmz.run(/opt/bamboo-home/xml-data/build-dir/SEC-B42X-JOB1/build.gradle:110)
06-Feb-2020 03:28:38         at org.gradle.groovy.scripts.internal.DefaultScriptRunnerFactory$ScriptRunnerImpl.run(DefaultScriptRunnerFactory.java:90)
06-Feb-2020 03:28:38         ... 56 more
06-Feb-2020 03:28:38 Caused by: org.gradle.api.internal.plugins.PluginApplicationException: Failed to apply plugin [id 'com.jfrog.artifactory']
06-Feb-2020 03:28:38         at org.gradle.api.internal.plugins.DefaultPluginManager.doApply(DefaultPluginManager.java:155)
06-Feb-2020 03:28:38         at org.gradle.api.internal.plugins.DefaultPluginManager.apply(DefaultPluginManager.java:112)
06-Feb-2020 03:28:38         at org.gradle.api.internal.plugins.DefaultObjectConfigurationAction.applyType(DefaultObjectConfigurationAction.java:113)
06-Feb-2020 03:28:38         at org.gradle.api.internal.plugins.DefaultObjectConfigurationAction.access$200(DefaultObjectConfigurationAction.java:36)
06-Feb-2020 03:28:38         at org.gradle.api.internal.plugins.DefaultObjectConfigurationAction$3.run(DefaultObjectConfigurationAction.java:80)
06-Feb-2020 03:28:38         at org.gradle.api.internal.plugins.DefaultObjectConfigurationAction.execute(DefaultObjectConfigurationAction.java:136)
06-Feb-2020 03:28:38         at org.gradle.groovy.scripts.DefaultScript.apply(DefaultScript.java:114)
06-Feb-2020 03:28:38         at org.gradle.api.Script$apply.callCurrent(Unknown Source)
06-Feb-2020 03:28:38         at org.codehaus.groovy.runtime.callsite.CallSiteArray.defaultCallCurrent(CallSiteArray.java:52)
06-Feb-2020 03:28:38         at org.codehaus.groovy.runtime.callsite.AbstractCallSite.callCurrent(AbstractCallSite.java:154)
06-Feb-2020 03:28:38         at org.codehaus.groovy.runtime.callsite.AbstractCallSite.callCurrent(AbstractCallSite.java:166)
06-Feb-2020 03:28:38         at artifactory_do0x2satu4xr1js8ccmm5hu99.run(/opt/bamboo-home/xml-data/build-dir/SEC-B42X-JOB1/gradle/artifactory.gradle:1)
06-Feb-2020 03:28:38         at org.gradle.groovy.scripts.internal.DefaultScriptRunnerFactory$ScriptRunnerImpl.run(DefaultScriptRunnerFactory.java:90)
06-Feb-2020 03:28:38         ... 123 more
06-Feb-2020 03:28:38 Caused by: org.codehaus.groovy.runtime.typehandling.GroovyCastException: Cannot cast object 'org.jfrog.gradle.plugin.artifactory.dsl.ArtifactoryPluginConvention@54ad9ff9' with class 'org.jfrog.gradle.plugin.artifactory.dsl.ArtifactoryPluginConvention' to class 'org.jfrog.gradle.plugin.artifactory.dsl.ArtifactoryPluginConvention'
06-Feb-2020 03:28:38         at org.codehaus.groovy.runtime.typehandling.DefaultTypeTransformation.continueCastOnSAM(DefaultTypeTransformation.java:405)
06-Feb-2020 03:28:38         at org.codehaus.groovy.runtime.typehandling.DefaultTypeTransformation.continueCastOnNumber(DefaultTypeTransformation.java:319)
06-Feb-2020 03:28:38         at org.codehaus.groovy.runtime.typehandling.DefaultTypeTransformation.castToType(DefaultTypeTransformation.java:232)
06-Feb-2020 03:28:38         at org.codehaus.groovy.runtime.ScriptBytecodeAdapter.castToType(ScriptBytecodeAdapter.java:603)
06-Feb-2020 03:28:38         at org.jfrog.gradle.plugin.artifactory.ArtifactoryPluginBase.getArtifactoryPluginConvention(ArtifactoryPluginBase.groovy:73)
06-Feb-2020 03:28:38         at sun.reflect.NativeMethodAccessorImpl.invoke0(Native Method)
06-Feb-2020 03:28:38         at sun.reflect.NativeMethodAccessorImpl.invoke(NativeMethodAccessorImpl.java:62)
06-Feb-2020 03:28:38         at sun.reflect.DelegatingMethodAccessorImpl.invoke(DelegatingMethodAccessorImpl.java:43)
06-Feb-2020 03:28:38         at java.lang.reflect.Method.invoke(Method.java:498)
06-Feb-2020 03:28:38         at org.codehaus.groovy.runtime.callsite.PogoMetaMethodSite$PogoCachedMethodSiteNoUnwrapNoCoerce.invoke(PogoMetaMethodSite.java:210)
06-Feb-2020 03:28:38         at org.codehaus.groovy.runtime.callsite.PogoMetaMethodSite.callCurrent(PogoMetaMethodSite.java:59)
06-Feb-2020 03:28:38         at org.codehaus.groovy.runtime.callsite.CallSiteArray.defaultCallCurrent(CallSiteArray.java:52)
06-Feb-2020 03:28:38         at org.codehaus.groovy.runtime.callsite.AbstractCallSite.callCurrent(AbstractCallSite.java:154)
06-Feb-2020 03:28:38         at org.codehaus.groovy.runtime.callsite.AbstractCallSite.callCurrent(AbstractCallSite.java:166)
06-Feb-2020 03:28:38         at org.jfrog.gradle.plugin.artifactory.ArtifactoryPluginBase.apply(ArtifactoryPluginBase.groovy:41)
06-Feb-2020 03:28:38         at org.jfrog.gradle.plugin.artifactory.ArtifactoryPluginBase.apply(ArtifactoryPluginBase.groovy)
06-Feb-2020 03:28:38         at org.gradle.api.internal.plugins.ImperativeOnlyPluginApplicator.applyImperative(ImperativeOnlyPluginApplicator.java:35)
06-Feb-2020 03:28:38         at org.gradle.api.internal.plugins.RuleBasedPluginApplicator.applyImperative(RuleBasedPluginApplicator.java:43)
06-Feb-2020 03:28:38         at org.gradle.api.internal.plugins.DefaultPluginManager.doApply(DefaultPluginManager.java:139)
06-Feb-2020 03:28:38         ... 135 more
06-Feb-2020 03:28:38
06-Feb-2020 03:28:38 FAILURE: Build failed with an exception.
06-Feb-2020 03:28:38
06-Feb-2020 03:28:38 * Where:
06-Feb-2020 03:28:38 Script '/opt/bamboo-home/xml-data/build-dir/SEC-B42X-JOB1/gradle/artifactory.gradle' line: 1
06-Feb-2020 03:28:38
06-Feb-2020 03:28:38 * What went wrong:
06-Feb-2020 03:28:38 A problem occurred evaluating script.
06-Feb-2020 03:28:38 > Failed to apply plugin [id 'com.jfrog.artifactory']
06-Feb-2020 03:28:38    > Cannot cast object 'org.jfrog.gradle.plugin.artifactory.dsl.ArtifactoryPluginConvention@54ad9ff9' with class 'org.jfrog.gradle.plugin.artifactory.dsl.ArtifactoryPluginConvention' to class 'org.jfrog.gradle.plugin.artifactory.dsl.ArtifactoryPluginConvention'
06-Feb-2020 03:28:38
06-Feb-2020 03:28:38 * Try:
06-Feb-2020 03:28:38 Run with --info or --debug option to get more log output.
06-Feb-2020 03:28:38
06-Feb-2020 03:28:38 * Exception is:
06-Feb-2020 03:28:38 org.gradle.api.GradleScriptException: A problem occurred evaluating script.
06-Feb-2020 03:28:38         at org.gradle.groovy.scripts.internal.DefaultScriptRunnerFactory$ScriptRunnerImpl.run(DefaultScriptRunnerFactory.java:92)
06-Feb-2020 03:28:38         at org.gradle.configuration.DefaultScriptPluginFactory$ScriptPluginImpl$2.run(DefaultScriptPluginFactory.java:177)
06-Feb-2020 03:28:38         at org.gradle.configuration.DefaultScriptTarget.addConfiguration(DefaultScriptTarget.java:74)
06-Feb-2020 03:28:38         at org.gradle.configuration.DefaultScriptPluginFactory$ScriptPluginImpl.apply(DefaultScriptPluginFactory.java:182)
06-Feb-2020 03:28:38         at org.gradle.api.internal.plugins.DefaultObjectConfigurationAction.applyScript(DefaultObjectConfigurationAction.java:102)
06-Feb-2020 03:28:38         at org.gradle.api.internal.plugins.DefaultObjectConfigurationAction.access$000(DefaultObjectConfigurationAction.java:36)
06-Feb-2020 03:28:38         at org.gradle.api.internal.plugins.DefaultObjectConfigurationAction$1.run(DefaultObjectConfigurationAction.java:62)
06-Feb-2020 03:28:38         at org.gradle.api.internal.plugins.DefaultObjectConfigurationAction.execute(DefaultObjectConfigurationAction.java:136)
06-Feb-2020 03:28:38         at org.gradle.api.internal.project.AbstractPluginAware.apply(AbstractPluginAware.java:44)
06-Feb-2020 03:28:38         at org.gradle.internal.metaobject.BeanDynamicObject$MetaClassAdapter.invokeMethod(BeanDynamicObject.java:382)
06-Feb-2020 03:28:38         at org.gradle.internal.metaobject.BeanDynamicObject.invokeMethod(BeanDynamicObject.java:170)
06-Feb-2020 03:28:38         at org.gradle.internal.metaobject.CompositeDynamicObject.invokeMethod(CompositeDynamicObject.java:96)
06-Feb-2020 03:28:38         at org.gradle.internal.metaobject.MixInClosurePropertiesAsMethodsDynamicObject.invokeMethod(MixInClosurePropertiesAsMethodsDynamicObject.java:30)
06-Feb-2020 03:28:38         at org.gradle.internal.metaobject.ConfigureDelegate.invokeMethod(ConfigureDelegate.java:59)
06-Feb-2020 03:28:38         at build_54hslkk5jqk8gxa9mlqjldrmz$_run_closure10.doCall(/opt/bamboo-home/xml-data/build-dir/SEC-B42X-JOB1/build.gradle:112)
06-Feb-2020 03:28:38         at org.gradle.api.internal.ClosureBackedAction.execute(ClosureBackedAction.java:70)
06-Feb-2020 03:28:38         at org.gradle.util.ConfigureUtil.configureTarget(ConfigureUtil.java:160)
06-Feb-2020 03:28:38         at org.gradle.util.ConfigureUtil.configure(ConfigureUtil.java:106)
06-Feb-2020 03:28:38         at org.gradle.api.internal.project.DefaultProject.configure(DefaultProject.java:921)
06-Feb-2020 03:28:38         at org.gradle.api.internal.project.DefaultProject.configure(DefaultProject.java:926)
06-Feb-2020 03:28:38         at org.gradle.internal.metaobject.BeanDynamicObject$MetaClassAdapter.invokeMethod(BeanDynamicObject.java:382)
06-Feb-2020 03:28:38         at org.gradle.internal.metaobject.BeanDynamicObject.invokeMethod(BeanDynamicObject.java:170)
06-Feb-2020 03:28:38         at org.gradle.internal.metaobject.CompositeDynamicObject.invokeMethod(CompositeDynamicObject.java:96)
06-Feb-2020 03:28:38         at org.gradle.internal.metaobject.MixInClosurePropertiesAsMethodsDynamicObject.invokeMethod(MixInClosurePropertiesAsMethodsDynamicObject.java:30)
06-Feb-2020 03:28:38         at org.gradle.internal.metaobject.AbstractDynamicObject.invokeMethod(AbstractDynamicObject.java:163)
06-Feb-2020 03:28:38         at org.gradle.groovy.scripts.BasicScript.methodMissing(BasicScript.java:83)
06-Feb-2020 03:28:38         at build_54hslkk5jqk8gxa9mlqjldrmz.run(/opt/bamboo-home/xml-data/build-dir/SEC-B42X-JOB1/build.gradle:110)
06-Feb-2020 03:28:38         at org.gradle.groovy.scripts.internal.DefaultScriptRunnerFactory$ScriptRunnerImpl.run(DefaultScriptRunnerFactory.java:90)
06-Feb-2020 03:28:38         at org.gradle.configuration.DefaultScriptPluginFactory$ScriptPluginImpl$2.run(DefaultScriptPluginFactory.java:177)
06-Feb-2020 03:28:38         at org.gradle.configuration.ProjectScriptTarget.addConfiguration(ProjectScriptTarget.java:77)
06-Feb-2020 03:28:38         at org.gradle.configuration.DefaultScriptPluginFactory$ScriptPluginImpl.apply(DefaultScriptPluginFactory.java:182)
06-Feb-2020 03:28:38         at org.gradle.configuration.project.BuildScriptProcessor.execute(BuildScriptProcessor.java:38)
06-Feb-2020 03:28:38         at org.gradle.configuration.project.BuildScriptProcessor.execute(BuildScriptProcessor.java:25)
06-Feb-2020 03:28:38         at org.gradle.configuration.project.ConfigureActionsProjectEvaluator.evaluate(ConfigureActionsProjectEvaluator.java:34)
06-Feb-2020 03:28:38         at org.gradle.configuration.project.LifecycleProjectEvaluator.evaluate(LifecycleProjectEvaluator.java:55)
06-Feb-2020 03:28:38         at org.gradle.api.internal.project.DefaultProject.evaluate(DefaultProject.java:573)
06-Feb-2020 03:28:38         at org.gradle.api.internal.project.DefaultProject.evaluate(DefaultProject.java:125)
06-Feb-2020 03:28:38         at org.gradle.execution.TaskPathProjectEvaluator.configureHierarchy(TaskPathProjectEvaluator.java:42)
06-Feb-2020 03:28:38         at org.gradle.configuration.DefaultBuildConfigurer.configure(DefaultBuildConfigurer.java:38)
06-Feb-2020 03:28:38         at org.gradle.initialization.DefaultGradleLauncher$2.run(DefaultGradleLauncher.java:124)
06-Feb-2020 03:28:38         at org.gradle.internal.Factories$1.create(Factories.java:22)
06-Feb-2020 03:28:38         at org.gradle.internal.progress.DefaultBuildOperationExecutor.run(DefaultBuildOperationExecutor.java:91)
06-Feb-2020 03:28:38         at org.gradle.internal.progress.DefaultBuildOperationExecutor.run(DefaultBuildOperationExecutor.java:53)
06-Feb-2020 03:28:38         at org.gradle.initialization.DefaultGradleLauncher.doBuildStages(DefaultGradleLauncher.java:121)
06-Feb-2020 03:28:38         at org.gradle.initialization.DefaultGradleLauncher.access$200(DefaultGradleLauncher.java:32)
06-Feb-2020 03:28:38         at org.gradle.initialization.DefaultGradleLauncher$1.create(DefaultGradleLauncher.java:98)
06-Feb-2020 03:28:38         at org.gradle.initialization.DefaultGradleLauncher$1.create(DefaultGradleLauncher.java:92)
06-Feb-2020 03:28:38         at org.gradle.internal.progress.DefaultBuildOperationExecutor.run(DefaultBuildOperationExecutor.java:91)
06-Feb-2020 03:28:38         at org.gradle.internal.progress.DefaultBuildOperationExecutor.run(DefaultBuildOperationExecutor.java:63)
06-Feb-2020 03:28:38         at org.gradle.initialization.DefaultGradleLauncher.doBuild(DefaultGradleLauncher.java:92)
06-Feb-2020 03:28:38         at org.gradle.initialization.DefaultGradleLauncher.run(DefaultGradleLauncher.java:83)
06-Feb-2020 03:28:38         at org.gradle.launcher.exec.InProcessBuildActionExecuter$DefaultBuildController.run(InProcessBuildActionExecuter.java:94)
06-Feb-2020 03:28:38         at org.gradle.tooling.internal.provider.ExecuteBuildActionRunner.run(ExecuteBuildActionRunner.java:28)
06-Feb-2020 03:28:38         at org.gradle.launcher.exec.ChainingBuildActionRunner.run(ChainingBuildActionRunner.java:35)
06-Feb-2020 03:28:38         at org.gradle.launcher.exec.InProcessBuildActionExecuter.execute(InProcessBuildActionExecuter.java:43)
06-Feb-2020 03:28:38         at org.gradle.launcher.exec.InProcessBuildActionExecuter.execute(InProcessBuildActionExecuter.java:28)
06-Feb-2020 03:28:38         at org.gradle.launcher.exec.ContinuousBuildActionExecuter.execute(ContinuousBuildActionExecuter.java:82)
06-Feb-2020 03:28:38         at org.gradle.launcher.exec.ContinuousBuildActionExecuter.execute(ContinuousBuildActionExecuter.java:49)
06-Feb-2020 03:28:38         at org.gradle.launcher.cli.RunBuildAction.run(RunBuildAction.java:43)
06-Feb-2020 03:28:38         at org.gradle.internal.Actions$RunnableActionAdapter.execute(Actions.java:173)
06-Feb-2020 03:28:38         at org.gradle.launcher.cli.CommandLineActionFactory$ParseAndBuildAction.execute(CommandLineActionFactory.java:244)
06-Feb-2020 03:28:38         at org.gradle.launcher.cli.CommandLineActionFactory$ParseAndBuildAction.execute(CommandLineActionFactory.java:217)
06-Feb-2020 03:28:38         at org.gradle.launcher.cli.JavaRuntimeValidationAction.execute(JavaRuntimeValidationAction.java:33)
06-Feb-2020 03:28:38         at org.gradle.launcher.cli.JavaRuntimeValidationAction.execute(JavaRuntimeValidationAction.java:24)
06-Feb-2020 03:28:38         at org.gradle.launcher.cli.ExceptionReportingAction.execute(ExceptionReportingAction.java:33)
06-Feb-2020 03:28:38         at org.gradle.launcher.cli.ExceptionReportingAction.execute(ExceptionReportingAction.java:22)
06-Feb-2020 03:28:38         at org.gradle.launcher.cli.CommandLineActionFactory$WithLogging.execute(CommandLineActionFactory.java:210)
06-Feb-2020 03:28:38         at org.gradle.launcher.cli.CommandLineActionFactory$WithLogging.execute(CommandLineActionFactory.java:174)
06-Feb-2020 03:28:38         at org.gradle.launcher.Main.doAction(Main.java:33)
06-Feb-2020 03:28:38         at org.gradle.launcher.bootstrap.EntryPoint.run(EntryPoint.java:45)
06-Feb-2020 03:28:38         at org.gradle.launcher.bootstrap.ProcessBootstrap.runNoExit(ProcessBootstrap.java:60)
06-Feb-2020 03:28:38         at org.gradle.launcher.bootstrap.ProcessBootstrap.run(ProcessBootstrap.java:37)
06-Feb-2020 03:28:38         at org.gradle.launcher.GradleMain.main(GradleMain.java:23)
06-Feb-2020 03:28:38         at org.gradle.wrapper.BootstrapMainStarter.start(BootstrapMainStarter.java:30)
06-Feb-2020 03:28:38         at org.gradle.wrapper.WrapperExecutor.execute(WrapperExecutor.java:129)
06-Feb-2020 03:28:38         at org.gradle.wrapper.GradleWrapperMain.main(GradleWrapperMain.java:61)
06-Feb-2020 03:28:38 Caused by: org.gradle.api.internal.plugins.PluginApplicationException: Failed to apply plugin [id 'com.jfrog.artifactory']
06-Feb-2020 03:28:38         at org.gradle.api.internal.plugins.DefaultPluginManager.doApply(DefaultPluginManager.java:155)
06-Feb-2020 03:28:38         at org.gradle.api.internal.plugins.DefaultPluginManager.apply(DefaultPluginManager.java:112)
06-Feb-2020 03:28:38         at org.gradle.api.internal.plugins.DefaultObjectConfigurationAction.applyType(DefaultObjectConfigurationAction.java:113)
06-Feb-2020 03:28:38         at org.gradle.api.internal.plugins.DefaultObjectConfigurationAction.access$200(DefaultObjectConfigurationAction.java:36)
06-Feb-2020 03:28:38         at org.gradle.api.internal.plugins.DefaultObjectConfigurationAction$3.run(DefaultObjectConfigurationAction.java:80)
06-Feb-2020 03:28:38         at org.gradle.api.internal.plugins.DefaultObjectConfigurationAction.execute(DefaultObjectConfigurationAction.java:136)
06-Feb-2020 03:28:38         at org.gradle.groovy.scripts.DefaultScript.apply(DefaultScript.java:114)
06-Feb-2020 03:28:38         at org.gradle.api.Script$apply.callCurrent(Unknown Source)
06-Feb-2020 03:28:38         at artifactory_do0x2satu4xr1js8ccmm5hu99.run(/opt/bamboo-home/xml-data/build-dir/SEC-B42X-JOB1/gradle/artifactory.gradle:1)
06-Feb-2020 03:28:38         at org.gradle.groovy.scripts.internal.DefaultScriptRunnerFactory$ScriptRunnerImpl.run(DefaultScriptRunnerFactory.java:90)
06-Feb-2020 03:28:38         ... 75 more
06-Feb-2020 03:28:38 Caused by: org.codehaus.groovy.runtime.typehandling.GroovyCastException: Cannot cast object 'org.jfrog.gradle.plugin.artifactory.dsl.ArtifactoryPluginConvention@54ad9ff9' with class 'org.jfrog.gradle.plugin.artifactory.dsl.ArtifactoryPluginConvention' to class 'org.jfrog.gradle.plugin.artifactory.dsl.ArtifactoryPluginConvention'
06-Feb-2020 03:28:38         at org.jfrog.gradle.plugin.artifactory.ArtifactoryPluginBase.getArtifactoryPluginConvention(ArtifactoryPluginBase.groovy:73)
06-Feb-2020 03:28:38         at org.jfrog.gradle.plugin.artifactory.ArtifactoryPluginBase.apply(ArtifactoryPluginBase.groovy:41)
06-Feb-2020 03:28:38         at org.jfrog.gradle.plugin.artifactory.ArtifactoryPluginBase.apply(ArtifactoryPluginBase.groovy)
06-Feb-2020 03:28:38         at org.gradle.api.internal.plugins.ImperativeOnlyPluginApplicator.applyImperative(ImperativeOnlyPluginApplicator.java:35)
06-Feb-2020 03:28:38         at org.gradle.api.internal.plugins.RuleBasedPluginApplicator.applyImperative(RuleBasedPluginApplicator.java:43)
06-Feb-2020 03:28:38         at org.gradle.api.internal.plugins.DefaultPluginManager.doApply(DefaultPluginManager.java:139)
06-Feb-2020 03:28:38         ... 84 more
06-Feb-2020 03:28:38
06-Feb-2020 03:28:38
06-Feb-2020 03:28:38 BUILD FAILED
06-Feb-2020 03:28:38
06-Feb-2020 03:28:38 Total time: 21.376 secs
06-Feb-2020 03:28:38
06-Feb-2020 03:28:38 Failing task since return code of [./gradlew clean build --stacktrace -I /tmp/artifactory.init.script676090471200471284gradle -DbuildInfoConfig.propertiesFile=/tmp/buildinfo6478351360894049481properties artifactoryPublish -Dartifactory.resolve.password=******** -Dartifactory.publish.password=********] was 1 while expected 0
06-Feb-2020 03:28:38 Parsing test results under /opt/bamboo-home/xml-data/build-dir/SEC-B42X-JOB1...
06-Feb-2020 03:28:39 Finished task 'Artifactory Gradle' with result: Failed
06-Feb-2020 03:28:39 Running post build plugin 'Docker Container Cleanup'
06-Feb-2020 03:28:39 Running post build plugin 'NCover Results Collector'
06-Feb-2020 03:28:39 Running post build plugin 'Artifactory Release Management Staging'
06-Feb-2020 03:28:39 Running post build plugin 'Artifactory Build Info Copier'
06-Feb-2020 03:28:39 Running post build plugin 'Artifactory Gradle Properties Info Copier'
06-Feb-2020 03:28:39 Running post build plugin 'Clover Results Collector'
06-Feb-2020 03:28:39 Running post build plugin 'npm Cache Cleanup'
06-Feb-2020 03:28:39 Running post build plugin 'Artifact Copier'
06-Feb-2020 03:28:39 Successfully removed working directory at '/opt/bamboo-home/xml-data/build-dir/SEC-B42X-JOB1'
06-Feb-2020 03:28:39 Finalising the build...
06-Feb-2020 03:28:39 Stopping timer.
06-Feb-2020 03:28:39 Build SEC-B42X-JOB1-1473 completed.
06-Feb-2020 03:28:39 Running on server: post build plugin 'NCover Results Collector'
06-Feb-2020 03:28:39 Running on server: post build plugin 'Build Hanging Detection Configuration'
06-Feb-2020 03:28:39 Running on server: post build plugin 'Bamboo project link creator'
06-Feb-2020 03:28:39 Running on server: post build plugin 'Clover Delta Calculator'
06-Feb-2020 03:28:39 Running on server: post build plugin 'Maven Dependencies Postprocessor'
06-Feb-2020 03:28:39 All post build plugins have finished
06-Feb-2020 03:28:39 Generating build results summary...
06-Feb-2020 03:28:39 Saving build results to disk...
06-Feb-2020 03:28:39 Logging substituted variables...
06-Feb-2020 03:28:39 Indexing build results...
06-Feb-2020 03:28:39 Finished building SEC-B42X-JOB1-1473.